directory-notifications mailing list archives

Site index · List index
Message view « Date » · « Thread »
Top « Date » · « Thread »
From Apache Hudson Server <hud...@hudson.apache.org>
Subject Build failed in Hudson: dir-studio-jdk16-win » Apache Directory Studio Apache DS 2.0 Configuration #89
Date Sat, 11 Dec 2010 04:16:42 GMT
See <https://hudson.apache.org/hudson/job/dir-studio-jdk16-win/org.apache.directory.studio$apacheds.configuration.v2/89/changes>

Changes:

[pamarcelot] Specified, as well, the 'filenames' attribute in the editor extension definition
to allow the editor to appear in the list of editors in the 'Open With...' context-menu sub-item.

[pamarcelot] Added a ContentDescriber class which checks that the given file is a correct
ApacheDS Configuration 2.0 file.
Defined a specific content type which rules the opening of the Editor.

[pamarcelot] Removed unused imports.

------------------------------------------
[INFO] ------------------------------------------------------------------------
[INFO] Building Apache Directory Studio Apache DS 2.0 Configuration
[INFO]    task-segment: [clean, install]
[INFO] ------------------------------------------------------------------------
[INFO] [clean:clean {execution: default-clean}]
[INFO] Deleting C:\hudson\hudson-slave\workspace\dir-studio-jdk16-win\trunk\plugins\apacheds.configuration.v2\target
[INFO] [remote-resources:process {execution: default}]
[INFO] [resources:resources {execution: default-resources}]
[INFO] Using 'UTF-8' encoding to copy filtered resources.
[INFO] Copying 2 resources
[INFO] Copying 5 resources to resources
[INFO] Copying 0 resource
[INFO] Copying 3 resources
[INFO] Copying 3 resources
[INFO] [studio:prepare-jar-package {execution: default}]
[INFO] [compiler:compile {execution: default-compile}]
[INFO] Compiling 21 source files to C:\hudson\hudson-slave\workspace\dir-studio-jdk16-win\trunk\plugins\apacheds.configuration.v2\target\classes
[INFO] -------------------------------------------------------------
[ERROR] COMPILATION ERROR : 
[INFO] -------------------------------------------------------------
[ERROR] \hudson\hudson-slave\workspace\dir-studio-jdk16-win\trunk\plugins\apacheds.configuration.v2\src\main\java\org\apache\directory\studio\apacheds\configuration\v2\ApacheDS2ConfigurationContentDescriber.java:[33,39]
package org.eclipse.core.runtime.content does not exist
[ERROR] \hudson\hudson-slave\workspace\dir-studio-jdk16-win\trunk\plugins\apacheds.configuration.v2\src\main\java\org\apache\directory\studio\apacheds\configuration\v2\ApacheDS2ConfigurationContentDescriber.java:[34,39]
package org.eclipse.core.runtime.content does not exist
[ERROR] \hudson\hudson-slave\workspace\dir-studio-jdk16-win\trunk\plugins\apacheds.configuration.v2\src\main\java\org\apache\directory\studio\apacheds\configuration\v2\ApacheDS2ConfigurationContentDescriber.java:[42,63]
cannot find symbol
symbol: class ITextContentDescriber
public class ApacheDS2ConfigurationContentDescriber implements ITextContentDescriber
[ERROR] \hudson\hudson-slave\workspace\dir-studio-jdk16-win\trunk\plugins\apacheds.configuration.v2\src\main\java\org\apache\directory\studio\apacheds\configuration\v2\ApacheDS2ConfigurationContentDescriber.java:[76,42]
cannot find symbol
symbol  : class IContentDescription
location: class org.apache.directory.studio.apacheds.configuration.v2.ApacheDS2ConfigurationContentDescriber
[ERROR] \hudson\hudson-slave\workspace\dir-studio-jdk16-win\trunk\plugins\apacheds.configuration.v2\src\main\java\org\apache\directory\studio\apacheds\configuration\v2\ApacheDS2ConfigurationContentDescriber.java:[106,47]
cannot find symbol
symbol  : class IContentDescription
location: class org.apache.directory.studio.apacheds.configuration.v2.ApacheDS2ConfigurationContentDescriber
[ERROR] \hudson\hudson-slave\workspace\dir-studio-jdk16-win\trunk\plugins\apacheds.configuration.v2\src\main\java\org\apache\directory\studio\apacheds\configuration\v2\ApacheDS2ConfigurationContentDescriber.java:[90,19]
cannot find symbol
symbol  : variable ITextContentDescriber
location: class org.apache.directory.studio.apacheds.configuration.v2.ApacheDS2ConfigurationContentDescriber
[ERROR] \hudson\hudson-slave\workspace\dir-studio-jdk16-win\trunk\plugins\apacheds.configuration.v2\src\main\java\org\apache\directory\studio\apacheds\configuration\v2\ApacheDS2ConfigurationContentDescriber.java:[119,19]
cannot find symbol
symbol  : variable ITextContentDescriber
location: class org.apache.directory.studio.apacheds.configuration.v2.ApacheDS2ConfigurationContentDescriber
[ERROR] \hudson\hudson-slave\workspace\dir-studio-jdk16-win\trunk\plugins\apacheds.configuration.v2\src\main\java\org\apache\directory\studio\apacheds\configuration\v2\ApacheDS2ConfigurationContentDescriber.java:[193,19]
cannot find symbol
symbol  : variable ITextContentDescriber
location: class org.apache.directory.studio.apacheds.configuration.v2.ApacheDS2ConfigurationContentDescriber
[ERROR] \hudson\hudson-slave\workspace\dir-studio-jdk16-win\trunk\plugins\apacheds.configuration.v2\src\main\java\org\apache\directory\studio\apacheds\configuration\v2\ApacheDS2ConfigurationContentDescriber.java:[197,19]
cannot find symbol
symbol  : variable ITextContentDescriber
location: class org.apache.directory.studio.apacheds.configuration.v2.ApacheDS2ConfigurationContentDescriber
[INFO] 9 errors 
[INFO] -------------------------------------------------------------
[HUDSON] Archiving disabled - not archiving C:\hudson\hudson-slave\workspace\dir-studio-jdk16-win\trunk\plugins\apacheds.configuration.v2\pom.xml
[INFO] ------------------------------------------------------------------------
[ERROR] BUILD FAILURE
[INFO] ------------------------------------------------------------------------
[INFO] Compilation failure

\hudson\hudson-slave\workspace\dir-studio-jdk16-win\trunk\plugins\apacheds.configuration.v2\src\main\java\org\apache\directory\studio\apacheds\configuration\v2\ApacheDS2ConfigurationContentDescriber.java:[33,39]
package org.eclipse.core.runtime.content does not exist
\hudson\hudson-slave\workspace\dir-studio-jdk16-win\trunk\plugins\apacheds.configuration.v2\src\main\java\org\apache\directory\studio\apacheds\configuration\v2\ApacheDS2ConfigurationContentDescriber.java:[34,39]
package org.eclipse.core.runtime.content does not exist
\hudson\hudson-slave\workspace\dir-studio-jdk16-win\trunk\plugins\apacheds.configuration.v2\src\main\java\org\apache\directory\studio\apacheds\configuration\v2\ApacheDS2ConfigurationContentDescriber.java:[42,63]
cannot find symbol
symbol: class ITextContentDescriber
public class ApacheDS2ConfigurationContentDescriber implements ITextContentDescriber
\hudson\hudson-slave\workspace\dir-studio-jdk16-win\trunk\plugins\apacheds.configuration.v2\src\main\java\org\apache\directory\studio\apacheds\configuration\v2\ApacheDS2ConfigurationContentDescriber.java:[76,42]
cannot find symbol
symbol  : class IContentDescription
location: class org.apache.directory.studio.apacheds.configuration.v2.ApacheDS2ConfigurationContentDescriber
\hudson\hudson-slave\workspace\dir-studio-jdk16-win\trunk\plugins\apacheds.configuration.v2\src\main\java\org\apache\directory\studio\apacheds\configuration\v2\ApacheDS2ConfigurationContentDescriber.java:[106,47]
cannot find symbol
symbol  : class IContentDescription
location: class org.apache.directory.studio.apacheds.configuration.v2.ApacheDS2ConfigurationContentDescriber
\hudson\hudson-slave\workspace\dir-studio-jdk16-win\trunk\plugins\apacheds.configuration.v2\src\main\java\org\apache\directory\studio\apacheds\configuration\v2\ApacheDS2ConfigurationContentDescriber.java:[90,19]
cannot find symbol
symbol  : variable ITextContentDescriber
location: class org.apache.directory.studio.apacheds.configuration.v2.ApacheDS2ConfigurationContentDescriber
\hudson\hudson-slave\workspace\dir-studio-jdk16-win\trunk\plugins\apacheds.configuration.v2\src\main\java\org\apache\directory\studio\apacheds\configuration\v2\ApacheDS2ConfigurationContentDescriber.java:[119,19]
cannot find symbol
symbol  : variable ITextContentDescriber
location: class org.apache.directory.studio.apacheds.configuration.v2.ApacheDS2ConfigurationContentDescriber
\hudson\hudson-slave\workspace\dir-studio-jdk16-win\trunk\plugins\apacheds.configuration.v2\src\main\java\org\apache\directory\studio\apacheds\configuration\v2\ApacheDS2ConfigurationContentDescriber.java:[193,19]
cannot find symbol
symbol  : variable ITextContentDescriber
location: class org.apache.directory.studio.apacheds.configuration.v2.ApacheDS2ConfigurationContentDescriber
\hudson\hudson-slave\workspace\dir-studio-jdk16-win\trunk\plugins\apacheds.configuration.v2\src\main\java\org\apache\directory\studio\apacheds\configuration\v2\ApacheDS2ConfigurationContentDescriber.java:[197,19]
cannot find symbol
symbol  : variable ITextContentDescriber
location: class org.apache.directory.studio.apacheds.configuration.v2.ApacheDS2ConfigurationContentDescriber

[INFO] ------------------------------------------------------------------------
[INFO] For more information, run Maven with the -e switch
[INFO] ------------------------------------------------------------------------
[INFO] Total time: 6 minutes 12 seconds
[INFO] Finished at: Sat Dec 11 04:12:44 GMT 2010
[INFO] Final Memory: 258M/494M
[INFO] ------------------------------------------------------------------------


Mime
View raw message