directory-notifications mailing list archives

Site index · List index
Message view « Date » · « Thread »
Top « Date » · « Thread »
From Apache Hudson Server <hud...@hudson.apache.org>
Subject Build failed in Hudson: dir-junit-addons-jdk15-deploy-site » Apache Directory JUnit Add-ons #107
Date Sat, 11 Dec 2010 02:38:48 GMT
See <https://hudson.apache.org/hudson/job/dir-junit-addons-jdk15-deploy-site/org.apache.directory.junit$junit-addons/107/>

------------------------------------------
<===[HUDSON REMOTING CAPACITY]===>channel started
   Executing Maven:  -B -f <https://hudson.apache.org/hudson/job/dir-junit-addons-jdk15-deploy-site/org.apache.directory.junit$junit-addons/ws/pom.xml>
clean deploy site
[INFO] Scanning for projects...
[INFO] ------------------------------------------------------------------------
[INFO] Building Apache Directory JUnit Add-ons
[INFO]    task-segment: [clean, deploy, site]
[INFO] ------------------------------------------------------------------------
[INFO] [clean:clean {execution: default-clean}]
[INFO] Setting property: classpath.resource.loader.class => 'org.codehaus.plexus.velocity.ContextClassLoaderResourceLoader'.
[INFO] Setting property: velocimacro.messages.on => 'false'.
[INFO] Setting property: resource.loader => 'classpath'.
[INFO] Setting property: resource.manager.logwhenfound => 'false'.
[INFO] [remote-resources:process {execution: default}]
[INFO] [resources:resources {execution: default-resources}]
[INFO] Using 'UTF-8' encoding to copy filtered resources.
[INFO] skip non existing resourceDirectory <https://hudson.apache.org/hudson/job/dir-junit-addons-jdk15-deploy-site/org.apache.directory.junit$junit-addons/ws/src/main/resources>
[INFO] Copying 3 resources
[INFO] [compiler:compile {execution: default-compile}]
[INFO] Compiling 5 source files to <https://hudson.apache.org/hudson/job/dir-junit-addons-jdk15-deploy-site/org.apache.directory.junit$junit-addons/ws/target/classes>
[INFO] [resources:testResources {execution: default-testResources}]
[INFO] Using 'UTF-8' encoding to copy filtered resources.
[INFO] skip non existing resourceDirectory <https://hudson.apache.org/hudson/job/dir-junit-addons-jdk15-deploy-site/org.apache.directory.junit$junit-addons/ws/src/test/resources>
[INFO] Copying 3 resources
[INFO] [compiler:testCompile {execution: default-testCompile}]
[INFO] No sources to compile
[INFO] [surefire:test {execution: default-test}]
[INFO] Surefire report directory: <https://hudson.apache.org/hudson/job/dir-junit-addons-jdk15-deploy-site/org.apache.directory.junit$junit-addons/ws/target/surefire-reports>

-------------------------------------------------------
 T E S T S
-------------------------------------------------------
There are no tests to run.

Results :

Tests run: 0, Failures: 0, Errors: 0, Skipped: 0

[HUDSON] Recording test results
[INFO] [jar:jar {execution: default-jar}]
[INFO] Building jar: <https://hudson.apache.org/hudson/job/dir-junit-addons-jdk15-deploy-site/org.apache.directory.junit$junit-addons/ws/target/junit-addons-0.1-SNAPSHOT.jar>
[INFO] [tools:verify-legal-files {execution: verify-legal-files}]
[INFO] Checking legal files in: junit-addons-0.1-SNAPSHOT.jar
[INFO] [install:install {execution: default-install}]
[INFO] Installing <https://hudson.apache.org/hudson/job/dir-junit-addons-jdk15-deploy-site/org.apache.directory.junit$junit-addons/ws/target/junit-addons-0.1-SNAPSHOT.jar>
to /home/hudson/.m2/repository/org/apache/directory/junit/junit-addons/0.1-SNAPSHOT/junit-addons-0.1-SNAPSHOT.jar
[INFO] [deploy:deploy {execution: default-deploy}]
[INFO] Retrieving previous build number from apache.snapshots.https
Uploading: https://repository.apache.org/content/repositories/snapshots/org/apache/directory/junit/junit-addons/0.1-SNAPSHOT/junit-addons-0.1-20101211.023830-98.jar
18K uploaded  (junit-addons-0.1-20101211.023830-98.jar)
[INFO] Retrieving previous metadata from apache.snapshots.https
[INFO] Uploading repository metadata for: 'snapshot org.apache.directory.junit:junit-addons:0.1-SNAPSHOT'
[INFO] Retrieving previous metadata from apache.snapshots.https
[INFO] Uploading repository metadata for: 'artifact org.apache.directory.junit:junit-addons'
[INFO] Uploading project information for junit-addons 0.1-20101211.023830-98
[INFO] Setting property: classpath.resource.loader.class => 'org.codehaus.plexus.velocity.ContextClassLoaderResourceLoader'.
[INFO] Setting property: velocimacro.messages.on => 'false'.
[INFO] Setting property: resource.loader => 'classpath'.
[INFO] Setting property: resource.manager.logwhenfound => 'false'.
[INFO] [site:site {execution: default-site}]
[INFO] Parent project loaded from repository.
[INFO] Parent project loaded from repository.
[INFO] Parent project loaded from repository.
[INFO] snapshot org.apache.directory.skins:directory-skin:1.0.2-SNAPSHOT: checking for updates
from apache.snapshots
Downloading: http://repository.apache.org/snapshots/org/apache/directory/skins/directory-skin/1.0.2-SNAPSHOT/directory-skin-1.0.2-SNAPSHOT.jar
[INFO] Unable to find resource 'org.apache.directory.skins:directory-skin:jar:1.0.2-SNAPSHOT'
in repository apache.snapshots (http://repository.apache.org/snapshots)
[HUDSON] Archiving <https://hudson.apache.org/hudson/job/dir-junit-addons-jdk15-deploy-site/org.apache.directory.junit$junit-addons/ws/pom.xml>
to /home/hudson/hudson/jobs/dir-junit-addons-jdk15-deploy-site/modules/org.apache.directory.junit$junit-addons/builds/2010-12-11_02-38-10/archive/org.apache.directory.junit/junit-addons/0.1-SNAPSHOT/pom.xml
[HUDSON] Archiving <https://hudson.apache.org/hudson/job/dir-junit-addons-jdk15-deploy-site/org.apache.directory.junit$junit-addons/ws/target/junit-addons-0.1-SNAPSHOT.jar>
to /home/hudson/hudson/jobs/dir-junit-addons-jdk15-deploy-site/modules/org.apache.directory.junit$junit-addons/builds/2010-12-11_02-38-10/archive/org.apache.directory.junit/junit-addons/0.1-20101211.023830-98/junit-addons-0.1-SNAPSHOT.jar
[INFO] ------------------------------------------------------------------------
[ERROR] BUILD ERROR
[INFO] ------------------------------------------------------------------------
[INFO] SiteToolException: ArtifactNotFoundException: The skin does not exist: Unable to download
the artifact from any repository

Try downloading the file manually from the project website.

Then, install it using the command: 
    mvn install:install-file -DgroupId=org.apache.directory.skins -DartifactId=directory-skin
-Dversion=1.0.2-SNAPSHOT -Dpackaging=jar -Dfile=/path/to/file

Alternatively, if you host your own repository you can deploy the file there: 
    mvn deploy:deploy-file -DgroupId=org.apache.directory.skins -DartifactId=directory-skin
-Dversion=1.0.2-SNAPSHOT -Dpackaging=jar -Dfile=/path/to/file -Durl=[url] -DrepositoryId=[id]


  org.apache.directory.skins:directory-skin:jar:1.0.2-SNAPSHOT

from the specified remote repositories:
  central (http://repo1.maven.org/maven2),
  Nexus (http://repository.apache.org/snapshots)



[INFO] ------------------------------------------------------------------------
[INFO] For more information, run Maven with the -e switch
[INFO] ------------------------------------------------------------------------
[INFO] Total time: 28 seconds
[INFO] Finished at: Fri Dec 10 18:38:47 GMT-08:00 2010
[INFO] Final Memory: 51M/96M
[INFO] ------------------------------------------------------------------------


Mime
View raw message