directory-notifications mailing list archives

Site index · List index
Message view « Date » · « Thread »
Top « Date » · « Thread »
From Apache Hudson Server <hud...@hudson.apache.org>
Subject Build failed in Hudson: dir-apacheds-jdk15-ubuntu-deploy #106
Date Fri, 10 Dec 2010 04:51:14 GMT
See <https://hudson.apache.org/hudson/job/dir-apacheds-jdk15-ubuntu-deploy/106/changes>

Changes:

[pamarcelot] Removed unused import.

[elecharny] Removed some spurious printStackTrace

[pamarcelot] Merged 'server-config-annotations' branch (https://svn.apache.org/repos/asf/directory/apacheds/branches/server-config-annotations)
back into trunk.

------------------------------------------
[...truncated 1129 lines...]
[INFO] Installing <https://hudson.apache.org/hudson/job/dir-apacheds-jdk15-ubuntu-deploy/ws/trunk/jdbm-partition/target/apacheds-jdbm-partition-1.5.8-SNAPSHOT.jar>
to /home/hudson/.m2/repository/org/apache/directory/server/apacheds-jdbm-partition/1.5.8-SNAPSHOT/apacheds-jdbm-partition-1.5.8-SNAPSHOT.jar
[INFO] Installing <https://hudson.apache.org/hudson/job/dir-apacheds-jdk15-ubuntu-deploy/ws/trunk/jdbm-partition/target/apacheds-jdbm-partition-1.5.8-SNAPSHOT-sources.jar>
to /home/hudson/.m2/repository/org/apache/directory/server/apacheds-jdbm-partition/1.5.8-SNAPSHOT/apacheds-jdbm-partition-1.5.8-SNAPSHOT-sources.jar
[INFO] [deploy:deploy {execution: default-deploy}]
[INFO] Retrieving previous build number from apache.snapshots.https
Uploading: https://repository.apache.org/content/repositories/snapshots/org/apache/directory/server/apacheds-jdbm-partition/1.5.8-SNAPSHOT/apacheds-jdbm-partition-1.5.8-20101210.044114-93.jar
60K uploaded  (apacheds-jdbm-partition-1.5.8-20101210.044114-93.jar)
[INFO] Uploading project information for apacheds-jdbm-partition 1.5.8-20101210.044114-93
[INFO] Retrieving previous metadata from apache.snapshots.https
[INFO] Uploading repository metadata for: 'snapshot org.apache.directory.server:apacheds-jdbm-partition:1.5.8-SNAPSHOT'
[INFO] Retrieving previous metadata from apache.snapshots.https
[INFO] Uploading repository metadata for: 'artifact org.apache.directory.server:apacheds-jdbm-partition'
[INFO] Retrieving previous build number from apache.snapshots.https
Uploading: https://repository.apache.org/content/repositories/snapshots/org/apache/directory/server/apacheds-jdbm-partition/1.5.8-SNAPSHOT/apacheds-jdbm-partition-1.5.8-20101210.044114-93-sources.jar
52K uploaded  (apacheds-jdbm-partition-1.5.8-20101210.044114-93-sources.jar)
[HUDSON] Archiving <https://hudson.apache.org/hudson/job/dir-apacheds-jdk15-ubuntu-deploy/ws/trunk/jdbm-partition/pom.xml>
to /home/hudson/hudson/jobs/dir-apacheds-jdk15-ubuntu-deploy/modules/org.apache.directory.server$apacheds-jdbm-partition/builds/2010-12-10_04-40-53/archive/org.apache.directory.server/apacheds-jdbm-partition/1.5.8-SNAPSHOT/pom.xml
[HUDSON] Archiving <https://hudson.apache.org/hudson/job/dir-apacheds-jdk15-ubuntu-deploy/ws/trunk/jdbm-partition/target/apacheds-jdbm-partition-1.5.8-SNAPSHOT.jar>
to /home/hudson/hudson/jobs/dir-apacheds-jdk15-ubuntu-deploy/modules/org.apache.directory.server$apacheds-jdbm-partition/builds/2010-12-10_04-40-53/archive/org.apache.directory.server/apacheds-jdbm-partition/1.5.8-20101210.044114-93/apacheds-jdbm-partition-1.5.8-SNAPSHOT.jar
[HUDSON] Archiving <https://hudson.apache.org/hudson/job/dir-apacheds-jdk15-ubuntu-deploy/ws/trunk/jdbm-partition/target/apacheds-jdbm-partition-1.5.8-SNAPSHOT-sources.jar>
to /home/hudson/hudson/jobs/dir-apacheds-jdk15-ubuntu-deploy/modules/org.apache.directory.server$apacheds-jdbm-partition/builds/2010-12-10_04-40-53/archive/org.apache.directory.server/apacheds-jdbm-partition/1.5.8-20101210.044114-93/apacheds-jdbm-partition-1.5.8-SNAPSHOT-sources.jar
[INFO] ------------------------------------------------------------------------
[INFO] Building ApacheDS Core Annotations
[INFO]    task-segment: [clean, deploy]
[INFO] ------------------------------------------------------------------------
[INFO] [clean:clean {execution: default-clean}]
[INFO] Deleting <https://hudson.apache.org/hudson/job/dir-apacheds-jdk15-ubuntu-deploy/ws/trunk/core-annotations/target>
[INFO] [remote-resources:process {execution: default}]
[INFO] [resources:resources {execution: default-resources}]
[INFO] Using 'UTF-8' encoding to copy filtered resources.
[INFO] skip non existing resourceDirectory <https://hudson.apache.org/hudson/job/dir-apacheds-jdk15-ubuntu-deploy/ws/trunk/core-annotations/src/main/resources>
[INFO] Copying 3 resources
[INFO] [compiler:compile {execution: default-compile}]
[INFO] Compiling 13 source files to <https://hudson.apache.org/hudson/job/dir-apacheds-jdk15-ubuntu-deploy/ws/trunk/core-annotations/target/classes>
[INFO] [resources:testResources {execution: default-testResources}]
[INFO] Using 'UTF-8' encoding to copy filtered resources.
[INFO] Copying 1 resource
[INFO] Copying 3 resources
[INFO] [compiler:testCompile {execution: default-testCompile}]
[INFO] Compiling 2 source files to <https://hudson.apache.org/hudson/job/dir-apacheds-jdk15-ubuntu-deploy/ws/trunk/core-annotations/target/test-classes>
[INFO] [surefire:test {execution: default-test}]
[INFO] Surefire report directory: <https://hudson.apache.org/hudson/job/dir-apacheds-jdk15-ubuntu-deploy/ws/trunk/core-annotations/target/surefire-reports>

-------------------------------------------------------
 T E S T S
-------------------------------------------------------
Running org.apache.directory.server.core.factory.DirectoryServiceFactoryTest
Tests run: 1, Failures: 0, Errors: 0, Skipped: 0, Time elapsed: 3.594 sec
Running org.apache.directory.server.core.factory.DirectoryServiceAnnotationTest
Tests run: 4, Failures: 0, Errors: 0, Skipped: 0, Time elapsed: 5.92 sec

Results :

Tests run: 5, Failures: 0, Errors: 0, Skipped: 0

[HUDSON] Recording test results
[INFO] [jar:jar {execution: default-jar}]
[INFO] Building jar: <https://hudson.apache.org/hudson/job/dir-apacheds-jdk15-ubuntu-deploy/ws/trunk/core-annotations/target/apacheds-core-annotations-1.5.8-SNAPSHOT.jar>
[INFO] [tools:verify-legal-files {execution: verify-legal-files}]
[INFO] Checking legal files in: apacheds-core-annotations-1.5.8-SNAPSHOT.jar
[INFO] [install:install {execution: default-install}]
[INFO] Installing <https://hudson.apache.org/hudson/job/dir-apacheds-jdk15-ubuntu-deploy/ws/trunk/core-annotations/target/apacheds-core-annotations-1.5.8-SNAPSHOT.jar>
to /home/hudson/.m2/repository/org/apache/directory/server/apacheds-core-annotations/1.5.8-SNAPSHOT/apacheds-core-annotations-1.5.8-SNAPSHOT.jar
[INFO] [deploy:deploy {execution: default-deploy}]
[INFO] Retrieving previous build number from apache.snapshots.https
Uploading: https://repository.apache.org/content/repositories/snapshots/org/apache/directory/server/apacheds-core-annotations/1.5.8-SNAPSHOT/apacheds-core-annotations-1.5.8-20101210.044114-92.jar
24K uploaded  (apacheds-core-annotations-1.5.8-20101210.044114-92.jar)
[INFO] Retrieving previous metadata from apache.snapshots.https
[INFO] Uploading repository metadata for: 'artifact org.apache.directory.server:apacheds-core-annotations'
[INFO] Retrieving previous metadata from apache.snapshots.https
[INFO] Uploading repository metadata for: 'snapshot org.apache.directory.server:apacheds-core-annotations:1.5.8-SNAPSHOT'
[INFO] Uploading project information for apacheds-core-annotations 1.5.8-20101210.044114-92
[HUDSON] Archiving <https://hudson.apache.org/hudson/job/dir-apacheds-jdk15-ubuntu-deploy/ws/trunk/core-annotations/pom.xml>
to /home/hudson/hudson/jobs/dir-apacheds-jdk15-ubuntu-deploy/modules/org.apache.directory.server$apacheds-core-annotations/builds/2010-12-10_04-40-53/archive/org.apache.directory.server/apacheds-core-annotations/1.5.8-SNAPSHOT/pom.xml
[HUDSON] Archiving <https://hudson.apache.org/hudson/job/dir-apacheds-jdk15-ubuntu-deploy/ws/trunk/core-annotations/target/apacheds-core-annotations-1.5.8-SNAPSHOT.jar>
to /home/hudson/hudson/jobs/dir-apacheds-jdk15-ubuntu-deploy/modules/org.apache.directory.server$apacheds-core-annotations/builds/2010-12-10_04-40-53/archive/org.apache.directory.server/apacheds-core-annotations/1.5.8-20101210.044114-92/apacheds-core-annotations-1.5.8-SNAPSHOT.jar
[INFO] ------------------------------------------------------------------------
[INFO] Building ApacheDS Core JNDI
[INFO]    task-segment: [clean, deploy]
[INFO] ------------------------------------------------------------------------
[INFO] [clean:clean {execution: default-clean}]
[INFO] Deleting <https://hudson.apache.org/hudson/job/dir-apacheds-jdk15-ubuntu-deploy/ws/trunk/core-jndi/target>
[INFO] [remote-resources:process {execution: default}]
[INFO] snapshot org.apache.directory.shared:shared-ldap-jndi:0.9.20-SNAPSHOT: checking for
updates from apache.snapshots
Downloading: http://repository.apache.org/snapshots/org/apache/directory/shared/shared-ldap-jndi/0.9.20-SNAPSHOT/shared-ldap-jndi-0.9.20-20101210.035602-104.pom
1K downloaded  (shared-ldap-jndi-0.9.20-20101210.035602-104.pom)
Downloading: http://repository.apache.org/snapshots/org/apache/directory/shared/shared-ldap-jndi/0.9.20-SNAPSHOT/shared-ldap-jndi-0.9.20-20101210.035602-104.jar
17K downloaded  (shared-ldap-jndi-0.9.20-20101210.035602-104.jar)
[INFO] [resources:resources {execution: default-resources}]
[INFO] Using 'UTF-8' encoding to copy filtered resources.
[INFO] skip non existing resourceDirectory <https://hudson.apache.org/hudson/job/dir-apacheds-jdk15-ubuntu-deploy/ws/trunk/core-jndi/src/main/resources>
[INFO] Copying 3 resources
[INFO] [compiler:compile {execution: default-compile}]
[INFO] Compiling 12 source files to <https://hudson.apache.org/hudson/job/dir-apacheds-jdk15-ubuntu-deploy/ws/trunk/core-jndi/target/classes>
[INFO] [resources:testResources {execution: default-testResources}]
[INFO] Using 'UTF-8' encoding to copy filtered resources.
[INFO] Copying 1 resource
[INFO] Copying 3 resources
[INFO] [compiler:testCompile {execution: default-testCompile}]
[INFO] Compiling 1 source file to <https://hudson.apache.org/hudson/job/dir-apacheds-jdk15-ubuntu-deploy/ws/trunk/core-jndi/target/test-classes>
[INFO] [surefire:test {execution: default-test}]
[INFO] Surefire report directory: <https://hudson.apache.org/hudson/job/dir-apacheds-jdk15-ubuntu-deploy/ws/trunk/core-jndi/target/surefire-reports>

-------------------------------------------------------
 T E S T S
-------------------------------------------------------
Running org.apache.directory.server.core.jndi.LdapJndiPropertiesTest
Tests run: 7, Failures: 0, Errors: 0, Skipped: 0, Time elapsed: 0.189 sec

Results :

Tests run: 7, Failures: 0, Errors: 0, Skipped: 0

[HUDSON] Recording test results
[INFO] [jar:jar {execution: default-jar}]
[INFO] Building jar: <https://hudson.apache.org/hudson/job/dir-apacheds-jdk15-ubuntu-deploy/ws/trunk/core-jndi/target/apacheds-core-jndi-1.5.8-SNAPSHOT.jar>
[INFO] [tools:verify-legal-files {execution: verify-legal-files}]
[INFO] Checking legal files in: apacheds-core-jndi-1.5.8-SNAPSHOT.jar
[INFO] Preparing source:jar
[WARNING] Removing: jar from forked lifecycle, to prevent recursive invocation.
[INFO] No goals needed for project - skipping
[INFO] [source:jar {execution: attach-sources}]
[INFO] META-INF already added, skipping
[INFO] META-INF/LICENSE already added, skipping
[INFO] META-INF/DEPENDENCIES already added, skipping
[INFO] META-INF/NOTICE already added, skipping
[INFO] Building jar: <https://hudson.apache.org/hudson/job/dir-apacheds-jdk15-ubuntu-deploy/ws/trunk/core-jndi/target/apacheds-core-jndi-1.5.8-SNAPSHOT-sources.jar>
[INFO] META-INF already added, skipping
[INFO] META-INF/LICENSE already added, skipping
[INFO] META-INF/DEPENDENCIES already added, skipping
[INFO] META-INF/NOTICE already added, skipping
[INFO] [install:install {execution: default-install}]
[INFO] Installing <https://hudson.apache.org/hudson/job/dir-apacheds-jdk15-ubuntu-deploy/ws/trunk/core-jndi/target/apacheds-core-jndi-1.5.8-SNAPSHOT.jar>
to /home/hudson/.m2/repository/org/apache/directory/server/apacheds-core-jndi/1.5.8-SNAPSHOT/apacheds-core-jndi-1.5.8-SNAPSHOT.jar
[INFO] Installing <https://hudson.apache.org/hudson/job/dir-apacheds-jdk15-ubuntu-deploy/ws/trunk/core-jndi/target/apacheds-core-jndi-1.5.8-SNAPSHOT-sources.jar>
to /home/hudson/.m2/repository/org/apache/directory/server/apacheds-core-jndi/1.5.8-SNAPSHOT/apacheds-core-jndi-1.5.8-SNAPSHOT-sources.jar
[INFO] [deploy:deploy {execution: default-deploy}]
[INFO] Retrieving previous build number from apache.snapshots.https
Uploading: https://repository.apache.org/content/repositories/snapshots/org/apache/directory/server/apacheds-core-jndi/1.5.8-SNAPSHOT/apacheds-core-jndi-1.5.8-20101210.044114-93.jar
47K uploaded  (apacheds-core-jndi-1.5.8-20101210.044114-93.jar)
[INFO] Retrieving previous metadata from apache.snapshots.https
[INFO] Uploading repository metadata for: 'artifact org.apache.directory.server:apacheds-core-jndi'
[INFO] Retrieving previous metadata from apache.snapshots.https
[INFO] Uploading repository metadata for: 'snapshot org.apache.directory.server:apacheds-core-jndi:1.5.8-SNAPSHOT'
[INFO] Uploading project information for apacheds-core-jndi 1.5.8-20101210.044114-93
[INFO] Retrieving previous build number from apache.snapshots.https
Uploading: https://repository.apache.org/content/repositories/snapshots/org/apache/directory/server/apacheds-core-jndi/1.5.8-SNAPSHOT/apacheds-core-jndi-1.5.8-20101210.044114-93-sources.jar
39K uploaded  (apacheds-core-jndi-1.5.8-20101210.044114-93-sources.jar)
[HUDSON] Archiving <https://hudson.apache.org/hudson/job/dir-apacheds-jdk15-ubuntu-deploy/ws/trunk/core-jndi/pom.xml>
to /home/hudson/hudson/jobs/dir-apacheds-jdk15-ubuntu-deploy/modules/org.apache.directory.server$apacheds-core-jndi/builds/2010-12-10_04-40-53/archive/org.apache.directory.server/apacheds-core-jndi/1.5.8-SNAPSHOT/pom.xml
[HUDSON] Archiving <https://hudson.apache.org/hudson/job/dir-apacheds-jdk15-ubuntu-deploy/ws/trunk/core-jndi/target/apacheds-core-jndi-1.5.8-SNAPSHOT.jar>
to /home/hudson/hudson/jobs/dir-apacheds-jdk15-ubuntu-deploy/modules/org.apache.directory.server$apacheds-core-jndi/builds/2010-12-10_04-40-53/archive/org.apache.directory.server/apacheds-core-jndi/1.5.8-20101210.044114-93/apacheds-core-jndi-1.5.8-SNAPSHOT.jar
[HUDSON] Archiving <https://hudson.apache.org/hudson/job/dir-apacheds-jdk15-ubuntu-deploy/ws/trunk/core-jndi/target/apacheds-core-jndi-1.5.8-SNAPSHOT-sources.jar>
to /home/hudson/hudson/jobs/dir-apacheds-jdk15-ubuntu-deploy/modules/org.apache.directory.server$apacheds-core-jndi/builds/2010-12-10_04-40-53/archive/org.apache.directory.server/apacheds-core-jndi/1.5.8-20101210.044114-93/apacheds-core-jndi-1.5.8-SNAPSHOT-sources.jar
[INFO] ------------------------------------------------------------------------
[INFO] Building ApacheDS Protocol Shared
[INFO]    task-segment: [clean, deploy]
[INFO] ------------------------------------------------------------------------
[INFO] [clean:clean {execution: default-clean}]
[INFO] Deleting <https://hudson.apache.org/hudson/job/dir-apacheds-jdk15-ubuntu-deploy/ws/trunk/protocol-shared/target>
[INFO] [remote-resources:process {execution: default}]
[INFO] [resources:resources {execution: default-resources}]
[INFO] Using 'UTF-8' encoding to copy filtered resources.
[INFO] Copying 0 resource
[INFO] Copying 3 resources
[INFO] [compiler:compile {execution: default-compile}]
[INFO] Compiling 16 source files to <https://hudson.apache.org/hudson/job/dir-apacheds-jdk15-ubuntu-deploy/ws/trunk/protocol-shared/target/classes>
[INFO] [resources:testResources {execution: default-testResources}]
[INFO] Using 'UTF-8' encoding to copy filtered resources.
[INFO] skip non existing resourceDirectory <https://hudson.apache.org/hudson/job/dir-apacheds-jdk15-ubuntu-deploy/ws/trunk/protocol-shared/src/test/resources>
[INFO] Copying 3 resources
[INFO] [compiler:testCompile {execution: default-testCompile}]
[INFO] Nothing to compile - all classes are up to date
[INFO] [surefire:test {execution: default-test}]
[INFO] Surefire report directory: <https://hudson.apache.org/hudson/job/dir-apacheds-jdk15-ubuntu-deploy/ws/trunk/protocol-shared/target/surefire-reports>

-------------------------------------------------------
 T E S T S
-------------------------------------------------------
There are no tests to run.

Results :

Tests run: 0, Failures: 0, Errors: 0, Skipped: 0

[HUDSON] Recording test results
[INFO] [jar:jar {execution: default-jar}]
[INFO] Building jar: <https://hudson.apache.org/hudson/job/dir-apacheds-jdk15-ubuntu-deploy/ws/trunk/protocol-shared/target/apacheds-protocol-shared-1.5.8-SNAPSHOT.jar>
[INFO] [tools:verify-legal-files {execution: verify-legal-files}]
[INFO] Checking legal files in: apacheds-protocol-shared-1.5.8-SNAPSHOT.jar
[INFO] Preparing source:jar
[WARNING] Removing: jar from forked lifecycle, to prevent recursive invocation.
[INFO] No goals needed for project - skipping
[INFO] [source:jar {execution: attach-sources}]
[INFO] META-INF already added, skipping
[INFO] META-INF already added, skipping
[INFO] META-INF/LICENSE already added, skipping
[INFO] META-INF/DEPENDENCIES already added, skipping
[INFO] META-INF/NOTICE already added, skipping
[INFO] Building jar: <https://hudson.apache.org/hudson/job/dir-apacheds-jdk15-ubuntu-deploy/ws/trunk/protocol-shared/target/apacheds-protocol-shared-1.5.8-SNAPSHOT-sources.jar>
[INFO] META-INF already added, skipping
[INFO] META-INF already added, skipping
[INFO] META-INF/LICENSE already added, skipping
[INFO] META-INF/DEPENDENCIES already added, skipping
[INFO] META-INF/NOTICE already added, skipping
[INFO] [install:install {execution: default-install}]
[INFO] Installing <https://hudson.apache.org/hudson/job/dir-apacheds-jdk15-ubuntu-deploy/ws/trunk/protocol-shared/target/apacheds-protocol-shared-1.5.8-SNAPSHOT.jar>
to /home/hudson/.m2/repository/org/apache/directory/server/apacheds-protocol-shared/1.5.8-SNAPSHOT/apacheds-protocol-shared-1.5.8-SNAPSHOT.jar
[INFO] Installing <https://hudson.apache.org/hudson/job/dir-apacheds-jdk15-ubuntu-deploy/ws/trunk/protocol-shared/target/apacheds-protocol-shared-1.5.8-SNAPSHOT-sources.jar>
to /home/hudson/.m2/repository/org/apache/directory/server/apacheds-protocol-shared/1.5.8-SNAPSHOT/apacheds-protocol-shared-1.5.8-SNAPSHOT-sources.jar
[INFO] [deploy:deploy {execution: default-deploy}]
[INFO] Retrieving previous build number from apache.snapshots.https
Uploading: https://repository.apache.org/content/repositories/snapshots/org/apache/directory/server/apacheds-protocol-shared/1.5.8-SNAPSHOT/apacheds-protocol-shared-1.5.8-20101210.044114-93.jar
26K uploaded  (apacheds-protocol-shared-1.5.8-20101210.044114-93.jar)
[INFO] Uploading project information for apacheds-protocol-shared 1.5.8-20101210.044114-93
[INFO] Retrieving previous metadata from apache.snapshots.https
[INFO] Uploading repository metadata for: 'artifact org.apache.directory.server:apacheds-protocol-shared'
[INFO] Retrieving previous metadata from apache.snapshots.https
[INFO] Uploading repository metadata for: 'snapshot org.apache.directory.server:apacheds-protocol-shared:1.5.8-SNAPSHOT'
[INFO] Retrieving previous build number from apache.snapshots.https
Uploading: https://repository.apache.org/content/repositories/snapshots/org/apache/directory/server/apacheds-protocol-shared/1.5.8-SNAPSHOT/apacheds-protocol-shared-1.5.8-20101210.044114-93-sources.jar
28K uploaded  (apacheds-protocol-shared-1.5.8-20101210.044114-93-sources.jar)
[HUDSON] Archiving <https://hudson.apache.org/hudson/job/dir-apacheds-jdk15-ubuntu-deploy/ws/trunk/protocol-shared/pom.xml>
to /home/hudson/hudson/jobs/dir-apacheds-jdk15-ubuntu-deploy/modules/org.apache.directory.server$apacheds-protocol-shared/builds/2010-12-10_04-40-53/archive/org.apache.directory.server/apacheds-protocol-shared/1.5.8-SNAPSHOT/pom.xml
[HUDSON] Archiving <https://hudson.apache.org/hudson/job/dir-apacheds-jdk15-ubuntu-deploy/ws/trunk/protocol-shared/target/apacheds-protocol-shared-1.5.8-SNAPSHOT.jar>
to /home/hudson/hudson/jobs/dir-apacheds-jdk15-ubuntu-deploy/modules/org.apache.directory.server$apacheds-protocol-shared/builds/2010-12-10_04-40-53/archive/org.apache.directory.server/apacheds-protocol-shared/1.5.8-20101210.044114-93/apacheds-protocol-shared-1.5.8-SNAPSHOT.jar
[HUDSON] Archiving <https://hudson.apache.org/hudson/job/dir-apacheds-jdk15-ubuntu-deploy/ws/trunk/protocol-shared/target/apacheds-protocol-shared-1.5.8-SNAPSHOT-sources.jar>
to /home/hudson/hudson/jobs/dir-apacheds-jdk15-ubuntu-deploy/modules/org.apache.directory.server$apacheds-protocol-shared/builds/2010-12-10_04-40-53/archive/org.apache.directory.server/apacheds-protocol-shared/1.5.8-20101210.044114-93/apacheds-protocol-shared-1.5.8-SNAPSHOT-sources.jar
[INFO] ------------------------------------------------------------------------
[INFO] Building ApacheDS Protocol Kerberos Codec
[INFO]    task-segment: [clean, deploy]
[INFO] ------------------------------------------------------------------------
[INFO] [clean:clean {execution: default-clean}]
[INFO] [remote-resources:process {execution: default}]
[INFO] [resources:resources {execution: default-resources}]
[INFO] Using 'UTF-8' encoding to copy filtered resources.
[INFO] skip non existing resourceDirectory <https://hudson.apache.org/hudson/job/dir-apacheds-jdk15-ubuntu-deploy/ws/trunk/kerberos-codec/src/main/resources>
[INFO] Copying 3 resources
[INFO] [compiler:compile {execution: default-compile}]
[INFO] Compiling 465 source files to <https://hudson.apache.org/hudson/job/dir-apacheds-jdk15-ubuntu-deploy/ws/trunk/kerberos-codec/target/classes>
[INFO] -------------------------------------------------------------
[ERROR] COMPILATION ERROR : 
[INFO] -------------------------------------------------------------
[ERROR] <https://hudson.apache.org/hudson/job/dir-apacheds-jdk15-ubuntu-deploy/ws/trunk/kerberos-codec/src/main/java/org/apache/directory/server/kerberos/protocol/KerberosEncoder.java>:[54,18]
cannot find symbol
symbol  : constructor IOException(java.lang.String,org.apache.directory.shared.asn1.codec.EncoderException)
location: class java.io.IOException
[INFO] 1 error
[INFO] -------------------------------------------------------------
[HUDSON] Archiving <https://hudson.apache.org/hudson/job/dir-apacheds-jdk15-ubuntu-deploy/ws/trunk/kerberos-codec/pom.xml>
to /home/hudson/hudson/jobs/dir-apacheds-jdk15-ubuntu-deploy/modules/org.apache.directory.server$apacheds-kerberos-codec/builds/2010-12-10_04-40-53/archive/org.apache.directory.server/apacheds-kerberos-codec/1.5.8-SNAPSHOT/pom.xml
[INFO] ------------------------------------------------------------------------
[ERROR] BUILD FAILURE
[INFO] ------------------------------------------------------------------------
[INFO] Compilation failure
<https://hudson.apache.org/hudson/job/dir-apacheds-jdk15-ubuntu-deploy/ws/trunk/kerberos-codec/src/main/java/org/apache/directory/server/kerberos/protocol/KerberosEncoder.java>:[54,18]
cannot find symbol
symbol  : constructor IOException(java.lang.String,org.apache.directory.shared.asn1.codec.EncoderException)
location: class java.io.IOException

[INFO] ------------------------------------------------------------------------
[INFO] For more information, run Maven with the -e switch
[INFO] ------------------------------------------------------------------------
[INFO] Total time: 10 minutes 9 seconds
[INFO] Finished at: Fri Dec 10 04:51:13 UTC 2010
[INFO] Final Memory: 49M/114M
[INFO] ------------------------------------------------------------------------
Sending e-mails to: notifications@directory.apache.org
channel stopped


Mime
View raw message