directory-notifications mailing list archives

Site index · List index
Message view « Date » · « Thread »
Top « Date » · « Thread »
From Apache Hudson Server <hud...@hudson.apache.org>
Subject Build failed in Hudson: dir-apacheds-jdk15-ubuntu-deploy » ApacheDS Protocol Kerberos Codec #106
Date Fri, 10 Dec 2010 04:51:13 GMT
See <https://hudson.apache.org/hudson/job/dir-apacheds-jdk15-ubuntu-deploy/org.apache.directory.server$apacheds-kerberos-codec/106/changes>

Changes:

[elecharny] Removed some spurious printStackTrace

------------------------------------------
[INFO] ------------------------------------------------------------------------
[INFO] Building ApacheDS Protocol Kerberos Codec
[INFO]    task-segment: [clean, deploy]
[INFO] ------------------------------------------------------------------------
[INFO] [clean:clean {execution: default-clean}]
[INFO] [remote-resources:process {execution: default}]
[INFO] [resources:resources {execution: default-resources}]
[INFO] Using 'UTF-8' encoding to copy filtered resources.
[INFO] skip non existing resourceDirectory <https://hudson.apache.org/hudson/job/dir-apacheds-jdk15-ubuntu-deploy/org.apache.directory.server$apacheds-kerberos-codec/ws/src/main/resources>
[INFO] Copying 3 resources
[INFO] [compiler:compile {execution: default-compile}]
[INFO] Compiling 465 source files to <https://hudson.apache.org/hudson/job/dir-apacheds-jdk15-ubuntu-deploy/org.apache.directory.server$apacheds-kerberos-codec/ws/target/classes>
[INFO] -------------------------------------------------------------
[ERROR] COMPILATION ERROR : 
[INFO] -------------------------------------------------------------
[ERROR] <https://hudson.apache.org/hudson/job/dir-apacheds-jdk15-ubuntu-deploy/org.apache.directory.server$apacheds-kerberos-codec/ws/src/main/java/org/apache/directory/server/kerberos/protocol/KerberosEncoder.java>:[54,18]
cannot find symbol
symbol  : constructor IOException(java.lang.String,org.apache.directory.shared.asn1.codec.EncoderException)
location: class java.io.IOException
[INFO] 1 error
[INFO] -------------------------------------------------------------
[HUDSON] Archiving <https://hudson.apache.org/hudson/job/dir-apacheds-jdk15-ubuntu-deploy/org.apache.directory.server$apacheds-kerberos-codec/ws/pom.xml>
to /home/hudson/hudson/jobs/dir-apacheds-jdk15-ubuntu-deploy/modules/org.apache.directory.server$apacheds-kerberos-codec/builds/2010-12-10_04-40-53/archive/org.apache.directory.server/apacheds-kerberos-codec/1.5.8-SNAPSHOT/pom.xml
[INFO] ------------------------------------------------------------------------
[ERROR] BUILD FAILURE
[INFO] ------------------------------------------------------------------------
[INFO] Compilation failure
<https://hudson.apache.org/hudson/job/dir-apacheds-jdk15-ubuntu-deploy/org.apache.directory.server$apacheds-kerberos-codec/ws/src/main/java/org/apache/directory/server/kerberos/protocol/KerberosEncoder.java>:[54,18]
cannot find symbol
symbol  : constructor IOException(java.lang.String,org.apache.directory.shared.asn1.codec.EncoderException)
location: class java.io.IOException

[INFO] ------------------------------------------------------------------------
[INFO] For more information, run Maven with the -e switch
[INFO] ------------------------------------------------------------------------
[INFO] Total time: 10 minutes 9 seconds
[INFO] Finished at: Fri Dec 10 04:51:13 UTC 2010
[INFO] Final Memory: 49M/114M
[INFO] ------------------------------------------------------------------------


Mime
View raw message