directory-notifications mailing list archives

Site index · List index
Message view « Date » · « Thread »
Top « Date » · « Thread »
From Apache Hudson Server <hud...@hudson.apache.org>
Subject Build failed in Hudson: dir-apacheds-jdk15-ubuntu-deploy #71
Date Thu, 28 Oct 2010 04:45:48 GMT
See <https://hudson.apache.org/hudson/job/dir-apacheds-jdk15-ubuntu-deploy/71/changes>

Changes:

[pamarcelot] Fix for DIRAPI-35 (LdapConnection.search(...) methods should return a SearchCursor
instead of a Cursor object in order to allow access to the SearchCursor.getSearchResultDone()
method).

[elecharny] added a reference to the bcprov dependency

[kayyagari] o removed the set/get methods for ppolicy from the Authenticator interface
o updated the auth interceptor to use ppolicy based on the changes made to support more than
one policy as configured in the server

[kayyagari] o fixed a bug in creating a string representation of a hashed password using CRYPT
algorithm

[kayyagari] o added new methods to deal with password policy

[kayyagari] o a container to hold all the password policies

[kayyagari] o fixed the package after move

[kayyagari] o moving password policy config to core-api

------------------------------------------
[...truncated 1869 lines...]
[INFO] Checking legal files in: apacheds-xdbm-tools-1.5.8-SNAPSHOT.jar
[INFO] [install:install {execution: default-install}]
[INFO] Installing <https://hudson.apache.org/hudson/job/dir-apacheds-jdk15-ubuntu-deploy/ws/trunk/xdbm-tools/target/apacheds-xdbm-tools-1.5.8-SNAPSHOT.jar>
to /home/hudson/.m2/repository/org/apache/directory/server/apacheds-xdbm-tools/1.5.8-SNAPSHOT/apacheds-xdbm-tools-1.5.8-SNAPSHOT.jar
[INFO] [deploy:deploy {execution: default-deploy}]
[INFO] Retrieving previous build number from apache.snapshots.https
Uploading: https://repository.apache.org/content/repositories/snapshots/org/apache/directory/server/apacheds-xdbm-tools/1.5.8-SNAPSHOT/apacheds-xdbm-tools-1.5.8-20101028.040938-57.jar
83K uploaded  (apacheds-xdbm-tools-1.5.8-20101028.040938-57.jar)
[INFO] Retrieving previous metadata from apache.snapshots.https
[INFO] Uploading repository metadata for: 'snapshot org.apache.directory.server:apacheds-xdbm-tools:1.5.8-SNAPSHOT'
[INFO] Retrieving previous metadata from apache.snapshots.https
[INFO] Uploading repository metadata for: 'artifact org.apache.directory.server:apacheds-xdbm-tools'
[INFO] Uploading project information for apacheds-xdbm-tools 1.5.8-20101028.040938-57
[HUDSON] Archiving <https://hudson.apache.org/hudson/job/dir-apacheds-jdk15-ubuntu-deploy/ws/trunk/xdbm-tools/pom.xml>
to /home/hudson/hudson/jobs/dir-apacheds-jdk15-ubuntu-deploy/modules/org.apache.directory.server$apacheds-xdbm-tools/builds/2010-10-28_04-09-18/archive/org.apache.directory.server/apacheds-xdbm-tools/1.5.8-SNAPSHOT/pom.xml
[HUDSON] Archiving <https://hudson.apache.org/hudson/job/dir-apacheds-jdk15-ubuntu-deploy/ws/trunk/xdbm-tools/target/apacheds-xdbm-tools-1.5.8-SNAPSHOT.jar>
to /home/hudson/hudson/jobs/dir-apacheds-jdk15-ubuntu-deploy/modules/org.apache.directory.server$apacheds-xdbm-tools/builds/2010-10-28_04-09-18/archive/org.apache.directory.server/apacheds-xdbm-tools/1.5.8-20101028.040938-57/apacheds-xdbm-tools-1.5.8-SNAPSHOT.jar
[INFO] ------------------------------------------------------------------------
[INFO] Building ApacheDS All
[INFO]    task-segment: [clean, deploy]
[INFO] ------------------------------------------------------------------------
[INFO] [clean:clean {execution: default-clean}]
[INFO] Deleting <https://hudson.apache.org/hudson/job/dir-apacheds-jdk15-ubuntu-deploy/ws/trunk/all/target>
[INFO] [remote-resources:process {execution: default}]
[INFO] [resources:resources {execution: default-resources}]
[INFO] Using 'UTF-8' encoding to copy filtered resources.
[INFO] skip non existing resourceDirectory <https://hudson.apache.org/hudson/job/dir-apacheds-jdk15-ubuntu-deploy/ws/trunk/all/src/main/resources>
[INFO] Copying 3 resources
[INFO] [compiler:compile {execution: default-compile}]
[INFO] No sources to compile
[INFO] [resources:testResources {execution: default-testResources}]
[INFO] Using 'UTF-8' encoding to copy filtered resources.
[INFO] skip non existing resourceDirectory <https://hudson.apache.org/hudson/job/dir-apacheds-jdk15-ubuntu-deploy/ws/trunk/all/src/test/resources>
[INFO] Copying 3 resources
[INFO] [compiler:testCompile {execution: default-testCompile}]
[INFO] No sources to compile
[INFO] [surefire:test {execution: default-test}]
[INFO] Surefire report directory: <https://hudson.apache.org/hudson/job/dir-apacheds-jdk15-ubuntu-deploy/ws/trunk/all/target/surefire-reports>

-------------------------------------------------------
 T E S T S
-------------------------------------------------------
There are no tests to run.

Results :

Tests run: 0, Failures: 0, Errors: 0, Skipped: 0

[HUDSON] Recording test results
[INFO] [jar:jar {execution: default-jar}]
[INFO] Building jar: <https://hudson.apache.org/hudson/job/dir-apacheds-jdk15-ubuntu-deploy/ws/trunk/all/target/apacheds-all-1.5.8-SNAPSHOT.jar>
[INFO] [shade:shade {execution: default}]
[INFO] Including org.apache.directory.server:apacheds-core:jar:1.5.8-SNAPSHOT in the shaded
jar.
[INFO] Including org.apache.directory.server:apacheds-i18n:jar:1.5.8-SNAPSHOT in the shaded
jar.
[INFO] Including org.slf4j:slf4j-api:jar:1.5.11 in the shaded jar.
[INFO] Including org.apache.directory.server:apacheds-core-api:jar:1.5.8-SNAPSHOT in the shaded
jar.
[INFO] Including org.apache.directory.server:apacheds-core-constants:jar:1.5.8-SNAPSHOT in
the shaded jar.
[INFO] Including commons-collections:commons-collections:jar:3.2.1 in the shaded jar.
[INFO] Including commons-lang:commons-lang:jar:2.5 in the shaded jar.
[INFO] Including commons-io:commons-io:jar:1.4 in the shaded jar.
[INFO] Including org.apache.directory.shared:shared-ldap:jar:0.9.20-SNAPSHOT in the shaded
jar.
[INFO] Including org.apache.directory.shared:shared-i18n:jar:0.9.20-SNAPSHOT in the shaded
jar.
[INFO] Including org.apache.mina:mina-core:jar:2.0.0 in the shaded jar.
[INFO] Including antlr:antlr:jar:2.7.7 in the shaded jar.
[INFO] Including org.apache.directory.shared:shared-ldap-schema:jar:0.9.20-SNAPSHOT in the
shaded jar.
[INFO] Including org.apache.directory.shared:ldap-client-api:jar:0.9.20-SNAPSHOT in the shaded
jar.
[INFO] Including commons-pool:commons-pool:jar:1.5.4 in the shaded jar.
[INFO] Including net.sf.ehcache:ehcache-core:jar:2.2.0 in the shaded jar.
[INFO] Including bouncycastle:bcprov-jdk15:jar:140 in the shaded jar.
[INFO] Including org.apache.directory.server:apacheds-core-annotations:jar:1.5.8-SNAPSHOT
in the shaded jar.
[INFO] Including org.apache.directory.server:apacheds-ldif-partition:jar:1.5.8-SNAPSHOT in
the shaded jar.
[INFO] Including org.apache.directory.server:apacheds-xdbm-partition:jar:1.5.8-SNAPSHOT in
the shaded jar.
[INFO] Including org.apache.directory.server:apacheds-core-avl:jar:1.5.8-SNAPSHOT in the shaded
jar.
[INFO] Including org.apache.directory.server:apacheds-jdbm-partition:jar:1.5.8-SNAPSHOT in
the shaded jar.
[INFO] Including org.apache.directory.server:apacheds-jdbm:jar:1.5.8-SNAPSHOT in the shaded
jar.
[INFO] Including org.apache.directory.server:apacheds-core-jndi:jar:1.5.8-SNAPSHOT in the
shaded jar.
[INFO] Including org.apache.directory.shared:shared-ldap-jndi:jar:0.9.20-SNAPSHOT in the shaded
jar.
[INFO] Including org.apache.directory.server:apacheds-interceptor-kerberos:jar:1.5.8-SNAPSHOT
in the shaded jar.
[INFO] Including org.apache.directory.server:apacheds-kerberos-shared:jar:1.5.8-SNAPSHOT in
the shaded jar.
[INFO] Including org.apache.directory.server:apacheds-protocol-shared:jar:1.5.8-SNAPSHOT in
the shaded jar.
[INFO] Including org.apache.directory.server:apacheds-protocol-changepw:jar:1.5.8-SNAPSHOT
in the shaded jar.
[INFO] Including org.apache.directory.server:apacheds-protocol-dhcp:jar:1.5.8-SNAPSHOT in
the shaded jar.
[INFO] Including org.apache.directory.server:apacheds-protocol-dns:jar:1.5.8-SNAPSHOT in the
shaded jar.
[INFO] Including org.apache.directory.server:apacheds-protocol-kerberos:jar:1.5.8-SNAPSHOT
in the shaded jar.
[INFO] Including org.apache.directory.server:apacheds-protocol-ldap:jar:1.5.8-SNAPSHOT in
the shaded jar.
[INFO] Including org.apache.activemq:activemq-core:jar:5.3.1 in the shaded jar.
[INFO] Including commons-logging:commons-logging-api:jar:1.1 in the shaded jar.
[INFO] Including org.apache.geronimo.specs:geronimo-jms_1.1_spec:jar:1.1.1 in the shaded jar.
[INFO] Including org.apache.activemq:activeio-core:jar:3.1.2 in the shaded jar.
[INFO] Including org.apache.geronimo.specs:geronimo-j2ee-management_1.1_spec:jar:1.0.1 in
the shaded jar.
[INFO] Including commons-logging:commons-logging:jar:1.1 in the shaded jar.
[INFO] Including log4j:log4j:jar:1.2.16 in the shaded jar.
[INFO] Including org.apache.activemq:kahadb:jar:5.3.1 in the shaded jar.
[INFO] Including org.apache.activemq.protobuf:activemq-protobuf:jar:1.0 in the shaded jar.
[INFO] Including commons-net:commons-net:jar:2.0 in the shaded jar.
[INFO] Including org.apache.directory.server:apacheds-protocol-ntp:jar:1.5.8-SNAPSHOT in the
shaded jar.
[INFO] Including org.apache.directory.server:apacheds-server-annotations:jar:1.5.8-SNAPSHOT
in the shaded jar.
[INFO] Including org.apache.directory.server:apacheds-server-jndi:jar:1.5.8-SNAPSHOT in the
shaded jar.
[INFO] Including org.apache.directory.server:apacheds-server-replication:jar:1.5.8-SNAPSHOT
in the shaded jar.
[INFO] Including org.apache.directory.server:apacheds-test-framework:jar:1.5.8-SNAPSHOT in
the shaded jar.
[INFO] Including org.apache.directory.server:apacheds-xdbm-tools:jar:1.5.8-SNAPSHOT in the
shaded jar.
[WARNING] We have a duplicate org/apache/commons/logging/Log.class in /home/hudson/.m2/repository/commons-logging/commons-logging/1.1/commons-logging-1.1.jar
[WARNING] We have a duplicate org/apache/commons/logging/LogConfigurationException.class in
/home/hudson/.m2/repository/commons-logging/commons-logging/1.1/commons-logging-1.1.jar
[WARNING] We have a duplicate org/apache/commons/logging/LogFactory$1.class in /home/hudson/.m2/repository/commons-logging/commons-logging/1.1/commons-logging-1.1.jar
[WARNING] We have a duplicate org/apache/commons/logging/LogFactory$2.class in /home/hudson/.m2/repository/commons-logging/commons-logging/1.1/commons-logging-1.1.jar
[WARNING] We have a duplicate org/apache/commons/logging/LogFactory$3.class in /home/hudson/.m2/repository/commons-logging/commons-logging/1.1/commons-logging-1.1.jar
[WARNING] We have a duplicate org/apache/commons/logging/LogFactory$4.class in /home/hudson/.m2/repository/commons-logging/commons-logging/1.1/commons-logging-1.1.jar
[WARNING] We have a duplicate org/apache/commons/logging/LogFactory$5.class in /home/hudson/.m2/repository/commons-logging/commons-logging/1.1/commons-logging-1.1.jar
[WARNING] We have a duplicate org/apache/commons/logging/LogFactory.class in /home/hudson/.m2/repository/commons-logging/commons-logging/1.1/commons-logging-1.1.jar
[WARNING] We have a duplicate org/apache/commons/logging/LogSource.class in /home/hudson/.m2/repository/commons-logging/commons-logging/1.1/commons-logging-1.1.jar
[WARNING] We have a duplicate org/apache/commons/logging/impl/Jdk14Logger.class in /home/hudson/.m2/repository/commons-logging/commons-logging/1.1/commons-logging-1.1.jar
[WARNING] We have a duplicate org/apache/commons/logging/impl/LogFactoryImpl.class in /home/hudson/.m2/repository/commons-logging/commons-logging/1.1/commons-logging-1.1.jar
[WARNING] We have a duplicate org/apache/commons/logging/impl/NoOpLog.class in /home/hudson/.m2/repository/commons-logging/commons-logging/1.1/commons-logging-1.1.jar
[WARNING] We have a duplicate org/apache/commons/logging/impl/SimpleLog$1.class in /home/hudson/.m2/repository/commons-logging/commons-logging/1.1/commons-logging-1.1.jar
[WARNING] We have a duplicate org/apache/commons/logging/impl/SimpleLog.class in /home/hudson/.m2/repository/commons-logging/commons-logging/1.1/commons-logging-1.1.jar
[WARNING] We have a duplicate org/apache/commons/logging/impl/WeakHashtable$1.class in /home/hudson/.m2/repository/commons-logging/commons-logging/1.1/commons-logging-1.1.jar
[WARNING] We have a duplicate org/apache/commons/logging/impl/WeakHashtable$2.class in /home/hudson/.m2/repository/commons-logging/commons-logging/1.1/commons-logging-1.1.jar
[WARNING] We have a duplicate org/apache/commons/logging/impl/WeakHashtable$Entry.class in
/home/hudson/.m2/repository/commons-logging/commons-logging/1.1/commons-logging-1.1.jar
[WARNING] We have a duplicate org/apache/commons/logging/impl/WeakHashtable$Referenced.class
in /home/hudson/.m2/repository/commons-logging/commons-logging/1.1/commons-logging-1.1.jar
[WARNING] We have a duplicate org/apache/commons/logging/impl/WeakHashtable$WeakKey.class
in /home/hudson/.m2/repository/commons-logging/commons-logging/1.1/commons-logging-1.1.jar
[WARNING] We have a duplicate org/apache/commons/logging/impl/WeakHashtable.class in /home/hudson/.m2/repository/commons-logging/commons-logging/1.1/commons-logging-1.1.jar
[WARNING] We have a duplicate org/apache/activemq/protobuf/AsciiBuffer.class in /home/hudson/.m2/repository/org/apache/activemq/protobuf/activemq-protobuf/1.0/activemq-protobuf-1.0.jar
[WARNING] We have a duplicate org/apache/activemq/protobuf/BaseMessage.class in /home/hudson/.m2/repository/org/apache/activemq/protobuf/activemq-protobuf/1.0/activemq-protobuf-1.0.jar
[WARNING] We have a duplicate org/apache/activemq/protobuf/Buffer.class in /home/hudson/.m2/repository/org/apache/activemq/protobuf/activemq-protobuf/1.0/activemq-protobuf-1.0.jar
[WARNING] We have a duplicate org/apache/activemq/protobuf/BufferInputStream.class in /home/hudson/.m2/repository/org/apache/activemq/protobuf/activemq-protobuf/1.0/activemq-protobuf-1.0.jar
[WARNING] We have a duplicate org/apache/activemq/protobuf/BufferOutputStream.class in /home/hudson/.m2/repository/org/apache/activemq/protobuf/activemq-protobuf/1.0/activemq-protobuf-1.0.jar
[WARNING] We have a duplicate org/apache/activemq/protobuf/CodedInputStream.class in /home/hudson/.m2/repository/org/apache/activemq/protobuf/activemq-protobuf/1.0/activemq-protobuf-1.0.jar
[WARNING] We have a duplicate org/apache/activemq/protobuf/CodedOutputStream.class in /home/hudson/.m2/repository/org/apache/activemq/protobuf/activemq-protobuf/1.0/activemq-protobuf-1.0.jar
[WARNING] We have a duplicate org/apache/activemq/protobuf/compiler/AltJavaGenerator$1.class
in /home/hudson/.m2/repository/org/apache/activemq/protobuf/activemq-protobuf/1.0/activemq-protobuf-1.0.jar
[WARNING] We have a duplicate org/apache/activemq/protobuf/compiler/AltJavaGenerator$2.class
in /home/hudson/.m2/repository/org/apache/activemq/protobuf/activemq-protobuf/1.0/activemq-protobuf-1.0.jar
[WARNING] We have a duplicate org/apache/activemq/protobuf/compiler/AltJavaGenerator$3.class
in /home/hudson/.m2/repository/org/apache/activemq/protobuf/activemq-protobuf/1.0/activemq-protobuf-1.0.jar
[WARNING] We have a duplicate org/apache/activemq/protobuf/compiler/AltJavaGenerator$Closure.class
in /home/hudson/.m2/repository/org/apache/activemq/protobuf/activemq-protobuf/1.0/activemq-protobuf-1.0.jar
[WARNING] We have a duplicate org/apache/activemq/protobuf/compiler/AltJavaGenerator.class
in /home/hudson/.m2/repository/org/apache/activemq/protobuf/activemq-protobuf/1.0/activemq-protobuf-1.0.jar
[WARNING] We have a duplicate org/apache/activemq/protobuf/compiler/CommandLineSupport.class
in /home/hudson/.m2/repository/org/apache/activemq/protobuf/activemq-protobuf/1.0/activemq-protobuf-1.0.jar
[WARNING] We have a duplicate org/apache/activemq/protobuf/compiler/CompilerException.class
in /home/hudson/.m2/repository/org/apache/activemq/protobuf/activemq-protobuf/1.0/activemq-protobuf-1.0.jar
[WARNING] We have a duplicate org/apache/activemq/protobuf/compiler/EnumDescriptor.class in
/home/hudson/.m2/repository/org/apache/activemq/protobuf/activemq-protobuf/1.0/activemq-protobuf-1.0.jar
[WARNING] We have a duplicate org/apache/activemq/protobuf/compiler/EnumFieldDescriptor.class
in /home/hudson/.m2/repository/org/apache/activemq/protobuf/activemq-protobuf/1.0/activemq-protobuf-1.0.jar
[WARNING] We have a duplicate org/apache/activemq/protobuf/compiler/ExtensionsDescriptor.class
in /home/hudson/.m2/repository/org/apache/activemq/protobuf/activemq-protobuf/1.0/activemq-protobuf-1.0.jar
[WARNING] We have a duplicate org/apache/activemq/protobuf/compiler/FieldDescriptor.class
in /home/hudson/.m2/repository/org/apache/activemq/protobuf/activemq-protobuf/1.0/activemq-protobuf-1.0.jar
[WARNING] We have a duplicate org/apache/activemq/protobuf/compiler/IntrospectionSupport.class
in /home/hudson/.m2/repository/org/apache/activemq/protobuf/activemq-protobuf/1.0/activemq-protobuf-1.0.jar
[WARNING] We have a duplicate org/apache/activemq/protobuf/compiler/JavaGenerator$1.class
in /home/hudson/.m2/repository/org/apache/activemq/protobuf/activemq-protobuf/1.0/activemq-protobuf-1.0.jar
[WARNING] We have a duplicate org/apache/activemq/protobuf/compiler/JavaGenerator$2.class
in /home/hudson/.m2/repository/org/apache/activemq/protobuf/activemq-protobuf/1.0/activemq-protobuf-1.0.jar
[WARNING] We have a duplicate org/apache/activemq/protobuf/compiler/JavaGenerator$3.class
in /home/hudson/.m2/repository/org/apache/activemq/protobuf/activemq-protobuf/1.0/activemq-protobuf-1.0.jar
[WARNING] We have a duplicate org/apache/activemq/protobuf/compiler/JavaGenerator$Closure.class
in /home/hudson/.m2/repository/org/apache/activemq/protobuf/activemq-protobuf/1.0/activemq-protobuf-1.0.jar
[WARNING] We have a duplicate org/apache/activemq/protobuf/compiler/JavaGenerator.class in
/home/hudson/.m2/repository/org/apache/activemq/protobuf/activemq-protobuf/1.0/activemq-protobuf-1.0.jar
[WARNING] We have a duplicate org/apache/activemq/protobuf/compiler/MessageDescriptor.class
in /home/hudson/.m2/repository/org/apache/activemq/protobuf/activemq-protobuf/1.0/activemq-protobuf-1.0.jar
[WARNING] We have a duplicate org/apache/activemq/protobuf/compiler/MethodDescriptor.class
in /home/hudson/.m2/repository/org/apache/activemq/protobuf/activemq-protobuf/1.0/activemq-protobuf-1.0.jar
[WARNING] We have a duplicate org/apache/activemq/protobuf/compiler/OptionDescriptor.class
in /home/hudson/.m2/repository/org/apache/activemq/protobuf/activemq-protobuf/1.0/activemq-protobuf-1.0.jar
[WARNING] We have a duplicate org/apache/activemq/protobuf/compiler/parser/ParseException.class
in /home/hudson/.m2/repository/org/apache/activemq/protobuf/activemq-protobuf/1.0/activemq-protobuf-1.0.jar
[WARNING] We have a duplicate org/apache/activemq/protobuf/compiler/parser/ProtoParser$1.class
in /home/hudson/.m2/repository/org/apache/activemq/protobuf/activemq-protobuf/1.0/activemq-protobuf-1.0.jar
[WARNING] We have a duplicate org/apache/activemq/protobuf/compiler/parser/ProtoParser$JJCalls.class
in /home/hudson/.m2/repository/org/apache/activemq/protobuf/activemq-protobuf/1.0/activemq-protobuf-1.0.jar
[WARNING] We have a duplicate org/apache/activemq/protobuf/compiler/parser/ProtoParser$LookaheadSuccess.class
in /home/hudson/.m2/repository/org/apache/activemq/protobuf/activemq-protobuf/1.0/activemq-protobuf-1.0.jar
[WARNING] We have a duplicate org/apache/activemq/protobuf/compiler/parser/ProtoParser.class
in /home/hudson/.m2/repository/org/apache/activemq/protobuf/activemq-protobuf/1.0/activemq-protobuf-1.0.jar
[WARNING] We have a duplicate org/apache/activemq/protobuf/compiler/parser/ProtoParserConstants.class
in /home/hudson/.m2/repository/org/apache/activemq/protobuf/activemq-protobuf/1.0/activemq-protobuf-1.0.jar
[WARNING] We have a duplicate org/apache/activemq/protobuf/compiler/parser/ProtoParserTokenManager.class
in /home/hudson/.m2/repository/org/apache/activemq/protobuf/activemq-protobuf/1.0/activemq-protobuf-1.0.jar
[WARNING] We have a duplicate org/apache/activemq/protobuf/compiler/parser/SimpleCharStream.class
in /home/hudson/.m2/repository/org/apache/activemq/protobuf/activemq-protobuf/1.0/activemq-protobuf-1.0.jar
[WARNING] We have a duplicate org/apache/activemq/protobuf/compiler/parser/Token.class in
/home/hudson/.m2/repository/org/apache/activemq/protobuf/activemq-protobuf/1.0/activemq-protobuf-1.0.jar
[WARNING] We have a duplicate org/apache/activemq/protobuf/compiler/parser/TokenMgrError.class
in /home/hudson/.m2/repository/org/apache/activemq/protobuf/activemq-protobuf/1.0/activemq-protobuf-1.0.jar
[WARNING] We have a duplicate org/apache/activemq/protobuf/compiler/ParserSupport.class in
/home/hudson/.m2/repository/org/apache/activemq/protobuf/activemq-protobuf/1.0/activemq-protobuf-1.0.jar
[WARNING] We have a duplicate org/apache/activemq/protobuf/compiler/ProtoDescriptor.class
in /home/hudson/.m2/repository/org/apache/activemq/protobuf/activemq-protobuf/1.0/activemq-protobuf-1.0.jar
[WARNING] We have a duplicate org/apache/activemq/protobuf/compiler/ProtoMojo$1.class in /home/hudson/.m2/repository/org/apache/activemq/protobuf/activemq-protobuf/1.0/activemq-protobuf-1.0.jar
[WARNING] We have a duplicate org/apache/activemq/protobuf/compiler/ProtoMojo.class in /home/hudson/.m2/repository/org/apache/activemq/protobuf/activemq-protobuf/1.0/activemq-protobuf-1.0.jar
[WARNING] We have a duplicate org/apache/activemq/protobuf/compiler/ServiceDescriptor.class
in /home/hudson/.m2/repository/org/apache/activemq/protobuf/activemq-protobuf/1.0/activemq-protobuf-1.0.jar
[WARNING] We have a duplicate org/apache/activemq/protobuf/compiler/TextFormat$InvalidEscapeSequence.class
in /home/hudson/.m2/repository/org/apache/activemq/protobuf/activemq-protobuf/1.0/activemq-protobuf-1.0.jar
[WARNING] We have a duplicate org/apache/activemq/protobuf/compiler/TextFormat$ParseException.class
in /home/hudson/.m2/repository/org/apache/activemq/protobuf/activemq-protobuf/1.0/activemq-protobuf-1.0.jar
[WARNING] We have a duplicate org/apache/activemq/protobuf/compiler/TextFormat$Tokenizer.class
in /home/hudson/.m2/repository/org/apache/activemq/protobuf/activemq-protobuf/1.0/activemq-protobuf-1.0.jar
[WARNING] We have a duplicate org/apache/activemq/protobuf/compiler/TextFormat.class in /home/hudson/.m2/repository/org/apache/activemq/protobuf/activemq-protobuf/1.0/activemq-protobuf-1.0.jar
[WARNING] We have a duplicate org/apache/activemq/protobuf/compiler/TypeDescriptor.class in
/home/hudson/.m2/repository/org/apache/activemq/protobuf/activemq-protobuf/1.0/activemq-protobuf-1.0.jar
[WARNING] We have a duplicate org/apache/activemq/protobuf/DeferredDecodeMessage.class in
/home/hudson/.m2/repository/org/apache/activemq/protobuf/activemq-protobuf/1.0/activemq-protobuf-1.0.jar
[WARNING] We have a duplicate org/apache/activemq/protobuf/InvalidProtocolBufferException.class
in /home/hudson/.m2/repository/org/apache/activemq/protobuf/activemq-protobuf/1.0/activemq-protobuf-1.0.jar
[WARNING] We have a duplicate org/apache/activemq/protobuf/Message.class in /home/hudson/.m2/repository/org/apache/activemq/protobuf/activemq-protobuf/1.0/activemq-protobuf-1.0.jar
[WARNING] We have a duplicate org/apache/activemq/protobuf/MessageBuffer.class in /home/hudson/.m2/repository/org/apache/activemq/protobuf/activemq-protobuf/1.0/activemq-protobuf-1.0.jar
[WARNING] We have a duplicate org/apache/activemq/protobuf/MessageBufferSupport.class in /home/hudson/.m2/repository/org/apache/activemq/protobuf/activemq-protobuf/1.0/activemq-protobuf-1.0.jar
[WARNING] We have a duplicate org/apache/activemq/protobuf/PBMessage.class in /home/hudson/.m2/repository/org/apache/activemq/protobuf/activemq-protobuf/1.0/activemq-protobuf-1.0.jar
[WARNING] We have a duplicate org/apache/activemq/protobuf/UninitializedMessageException.class
in /home/hudson/.m2/repository/org/apache/activemq/protobuf/activemq-protobuf/1.0/activemq-protobuf-1.0.jar
[WARNING] We have a duplicate org/apache/activemq/protobuf/UTF8Buffer.class in /home/hudson/.m2/repository/org/apache/activemq/protobuf/activemq-protobuf/1.0/activemq-protobuf-1.0.jar
[WARNING] We have a duplicate org/apache/activemq/protobuf/WireFormat.class in /home/hudson/.m2/repository/org/apache/activemq/protobuf/activemq-protobuf/1.0/activemq-protobuf-1.0.jar
[INFO] Replacing original artifact with shaded artifact.
[INFO] Replacing <https://hudson.apache.org/hudson/job/dir-apacheds-jdk15-ubuntu-deploy/ws/trunk/all/target/apacheds-all-1.5.8-SNAPSHOT.jar>
with <https://hudson.apache.org/hudson/job/dir-apacheds-jdk15-ubuntu-deploy/ws/trunk/all/target/apacheds-all-1.5.8-SNAPSHOT-app.jar>
[INFO] [tools:verify-legal-files {execution: verify-legal-files}]
[INFO] Checking legal files in: apacheds-all-1.5.8-SNAPSHOT.jar
[INFO] [install:install {execution: default-install}]
[INFO] Installing <https://hudson.apache.org/hudson/job/dir-apacheds-jdk15-ubuntu-deploy/ws/trunk/all/target/apacheds-all-1.5.8-SNAPSHOT.jar>
to /home/hudson/.m2/repository/org/apache/directory/server/apacheds-all/1.5.8-SNAPSHOT/apacheds-all-1.5.8-SNAPSHOT.jar
[INFO] [deploy:deploy {execution: default-deploy}]
[INFO] Retrieving previous build number from apache.snapshots.https
Uploading: https://repository.apache.org/content/repositories/snapshots/org/apache/directory/server/apacheds-all/1.5.8-SNAPSHOT/apacheds-all-1.5.8-20101028.040938-57.jar
12325K uploaded  (apacheds-all-1.5.8-20101028.040938-57.jar)
[INFO] Retrieving previous metadata from apache.snapshots.https
[INFO] Uploading repository metadata for: 'snapshot org.apache.directory.server:apacheds-all:1.5.8-SNAPSHOT'
[INFO] Retrieving previous metadata from apache.snapshots.https
[INFO] Uploading repository metadata for: 'artifact org.apache.directory.server:apacheds-all'
[INFO] Uploading project information for apacheds-all 1.5.8-20101028.040938-57
[HUDSON] Archiving <https://hudson.apache.org/hudson/job/dir-apacheds-jdk15-ubuntu-deploy/ws/trunk/all/dependency-reduced-pom.xml>
to /home/hudson/hudson/jobs/dir-apacheds-jdk15-ubuntu-deploy/modules/org.apache.directory.server$apacheds-all/builds/2010-10-28_04-09-18/archive/org.apache.directory.server/apacheds-all/1.5.8-SNAPSHOT/dependency-reduced-pom.xml
[HUDSON] Archiving <https://hudson.apache.org/hudson/job/dir-apacheds-jdk15-ubuntu-deploy/ws/trunk/all/target/apacheds-all-1.5.8-SNAPSHOT.jar>
to /home/hudson/hudson/jobs/dir-apacheds-jdk15-ubuntu-deploy/modules/org.apache.directory.server$apacheds-all/builds/2010-10-28_04-09-18/archive/org.apache.directory.server/apacheds-all/1.5.8-20101028.040938-57/apacheds-all-1.5.8-SNAPSHOT.jar
[INFO] ------------------------------------------------------------------------
[INFO] Building ApacheDS Core Integration
[INFO]    task-segment: [clean, deploy]
[INFO] ------------------------------------------------------------------------
[INFO] [clean:clean {execution: default-clean}]
[INFO] Deleting <https://hudson.apache.org/hudson/job/dir-apacheds-jdk15-ubuntu-deploy/ws/trunk/core-integ/target>
[INFO] [remote-resources:process {execution: default}]
[INFO] [resources:resources {execution: default-resources}]
[INFO] Using 'UTF-8' encoding to copy filtered resources.
[INFO] Copying 0 resource
[INFO] Copying 3 resources
[INFO] [compiler:compile {execution: default-compile}]
[INFO] Compiling 1 source file to <https://hudson.apache.org/hudson/job/dir-apacheds-jdk15-ubuntu-deploy/ws/trunk/core-integ/target/classes>
[INFO] [resources:testResources {execution: default-testResources}]
[INFO] Using 'UTF-8' encoding to copy filtered resources.
[INFO] Copying 7 resources
[INFO] Copying 3 resources
[INFO] [compiler:testCompile {execution: default-testCompile}]
[INFO] Compiling 100 source files to <https://hudson.apache.org/hudson/job/dir-apacheds-jdk15-ubuntu-deploy/ws/trunk/core-integ/target/test-classes>
[INFO] -------------------------------------------------------------
[ERROR] COMPILATION ERROR : 
[INFO] -------------------------------------------------------------
[ERROR] <https://hudson.apache.org/hudson/job/dir-apacheds-jdk15-ubuntu-deploy/ws/trunk/core-integ/src/test/java/org/apache/directory/server/core/authn/ppolicy/PasswordPolicyTest.java>:[39,46]
cannot find symbol
symbol  : class PasswordPolicyConfiguration
location: package org.apache.directory.server.core.authn
[ERROR] <https://hudson.apache.org/hudson/job/dir-apacheds-jdk15-ubuntu-deploy/ws/trunk/core-integ/src/test/java/org/apache/directory/server/core/authn/ppolicy/PasswordPolicyTest.java>:[83,12]
cannot find symbol
symbol  : class PasswordPolicyConfiguration
location: class org.apache.directory.server.core.authn.ppolicy.PasswordPolicyTest
[ERROR] <https://hudson.apache.org/hudson/job/dir-apacheds-jdk15-ubuntu-deploy/ws/trunk/core-integ/src/test/java/org/apache/directory/server/core/authn/ppolicy/PasswordPolicyTest.java>:[93,27]
cannot find symbol
symbol  : class PasswordPolicyConfiguration
location: class org.apache.directory.server.core.authn.ppolicy.PasswordPolicyTest
[INFO] 3 errors 
[INFO] -------------------------------------------------------------
[HUDSON] Archiving <https://hudson.apache.org/hudson/job/dir-apacheds-jdk15-ubuntu-deploy/ws/trunk/core-integ/pom.xml>
to /home/hudson/hudson/jobs/dir-apacheds-jdk15-ubuntu-deploy/modules/org.apache.directory.server$apacheds-core-integ/builds/2010-10-28_04-09-18/archive/org.apache.directory.server/apacheds-core-integ/1.5.8-SNAPSHOT/pom.xml
[INFO] ------------------------------------------------------------------------
[ERROR] BUILD FAILURE
[INFO] ------------------------------------------------------------------------
[INFO] Compilation failure

<https://hudson.apache.org/hudson/job/dir-apacheds-jdk15-ubuntu-deploy/ws/trunk/core-integ/src/test/java/org/apache/directory/server/core/authn/ppolicy/PasswordPolicyTest.java>:[39,46]
cannot find symbol
symbol  : class PasswordPolicyConfiguration
location: package org.apache.directory.server.core.authn
<https://hudson.apache.org/hudson/job/dir-apacheds-jdk15-ubuntu-deploy/ws/trunk/core-integ/src/test/java/org/apache/directory/server/core/authn/ppolicy/PasswordPolicyTest.java>:[83,12]
cannot find symbol
symbol  : class PasswordPolicyConfiguration
location: class org.apache.directory.server.core.authn.ppolicy.PasswordPolicyTest
<https://hudson.apache.org/hudson/job/dir-apacheds-jdk15-ubuntu-deploy/ws/trunk/core-integ/src/test/java/org/apache/directory/server/core/authn/ppolicy/PasswordPolicyTest.java>:[93,27]
cannot find symbol
symbol  : class PasswordPolicyConfiguration
location: class org.apache.directory.server.core.authn.ppolicy.PasswordPolicyTest

[INFO] ------------------------------------------------------------------------
[INFO] For more information, run Maven with the -e switch
[INFO] ------------------------------------------------------------------------
[INFO] Total time: 36 minutes 19 seconds
[INFO] Finished at: Thu Oct 28 04:45:46 UTC 2010
[INFO] Final Memory: 58M/112M
[INFO] ------------------------------------------------------------------------
Sending e-mails to: notifications@directory.apache.org
channel stopped


Mime
View raw message