directory-notifications mailing list archives

Site index · List index
Message view « Date » · « Thread »
Top « Date » · « Thread »
From Apache Hudson Server <hud...@hudson.apache.org>
Subject Build failed in Hudson: dir-studio-jdk15-ubuntu-deploy #55
Date Sun, 10 Oct 2010 04:15:43 GMT
See <https://hudson.apache.org/hudson/job/dir-studio-jdk15-ubuntu-deploy/55/>

------------------------------------------
[...truncated 1015 lines...]
Uploading: https://repository.apache.org/content/repositories/snapshots/org/apache/directory/studio/ldapbrowser.core/2.0.0-SNAPSHOT/ldapbrowser.core-2.0.0-20101010.040234-35.jar
2855K uploaded  (ldapbrowser.core-2.0.0-20101010.040234-35.jar)
[INFO] Retrieving previous metadata from apache.snapshots.https
[INFO] Uploading repository metadata for: 'artifact org.apache.directory.studio:ldapbrowser.core'
[INFO] Uploading project information for ldapbrowser.core 2.0.0-20101010.040234-35
[INFO] Retrieving previous metadata from apache.snapshots.https
[INFO] Uploading repository metadata for: 'snapshot org.apache.directory.studio:ldapbrowser.core:2.0.0-SNAPSHOT'
[HUDSON] Archiving <https://hudson.apache.org/hudson/job/dir-studio-jdk15-ubuntu-deploy/ws/trunk/plugins/ldapbrowser.core/pom.xml>
to /home/hudson/hudson/jobs/dir-studio-jdk15-ubuntu-deploy/modules/org.apache.directory.studio$ldapbrowser.core/builds/2010-10-10_04-02-08/archive/org.apache.directory.studio/ldapbrowser.core/2.0.0-SNAPSHOT/pom.xml
[HUDSON] Archiving <https://hudson.apache.org/hudson/job/dir-studio-jdk15-ubuntu-deploy/ws/trunk/plugins/ldapbrowser.core/target/ldapbrowser.core-2.0.0-SNAPSHOT.jar>
to /home/hudson/hudson/jobs/dir-studio-jdk15-ubuntu-deploy/modules/org.apache.directory.studio$ldapbrowser.core/builds/2010-10-10_04-02-08/archive/org.apache.directory.studio/ldapbrowser.core/2.0.0-20101010.040234-35/ldapbrowser.core-2.0.0-SNAPSHOT.jar
[INFO] ------------------------------------------------------------------------
[INFO] Building Apache Directory Studio LDAP Browser Common
[INFO]    task-segment: [clean, deploy]
[INFO] ------------------------------------------------------------------------
[INFO] [clean:clean {execution: default-clean}]
[INFO] Deleting <https://hudson.apache.org/hudson/job/dir-studio-jdk15-ubuntu-deploy/ws/trunk/plugins/ldapbrowser.common/target>
[INFO] [remote-resources:process {execution: default}]
[INFO] snapshot org.apache.directory.studio:ldapbrowser.core:2.0.0-SNAPSHOT: checking for
updates from apache.snapshots
[INFO] [resources:resources {execution: default-resources}]
[INFO] Using 'UTF-8' encoding to copy filtered resources.
[INFO] Copying 4 resources
[INFO] Copying 62 resources to resources
[INFO] Copying 1 resource
[INFO] Copying 33 resources
[INFO] Copying 3 resources
[INFO] [studio:prepare-jar-package {execution: default}]
[INFO] [compiler:compile {execution: default-compile}]
[INFO] Compiling 164 source files to <https://hudson.apache.org/hudson/job/dir-studio-jdk15-ubuntu-deploy/ws/trunk/plugins/ldapbrowser.common/target/classes>
[INFO] [bundle:manifest {execution: generate-manifest}]
[INFO] [resources:testResources {execution: default-testResources}]
[INFO] Using 'UTF-8' encoding to copy filtered resources.
[INFO] skip non existing resourceDirectory <https://hudson.apache.org/hudson/job/dir-studio-jdk15-ubuntu-deploy/ws/trunk/plugins/ldapbrowser.common/src/test/resources>
[INFO] Copying 3 resources
[INFO] [compiler:testCompile {execution: default-testCompile}]
[INFO] Nothing to compile - all classes are up to date
[INFO] [surefire:test {execution: default-test}]
[INFO] Tests are skipped.
[INFO] [jar:jar {execution: default-jar}]
[INFO] Building jar: <https://hudson.apache.org/hudson/job/dir-studio-jdk15-ubuntu-deploy/ws/trunk/plugins/ldapbrowser.common/target/ldapbrowser.common-2.0.0-SNAPSHOT.jar>
[INFO] [tools:verify-legal-files {execution: verify-legal-files}]
[INFO] Checking legal files in: ldapbrowser.common-2.0.0-SNAPSHOT.jar
[INFO] [install:install {execution: default-install}]
[INFO] Installing <https://hudson.apache.org/hudson/job/dir-studio-jdk15-ubuntu-deploy/ws/trunk/plugins/ldapbrowser.common/target/ldapbrowser.common-2.0.0-SNAPSHOT.jar>
to /home/hudson/.m2/repository/org/apache/directory/studio/ldapbrowser.common/2.0.0-SNAPSHOT/ldapbrowser.common-2.0.0-SNAPSHOT.jar
[INFO] [deploy:deploy {execution: default-deploy}]
[INFO] Retrieving previous build number from apache.snapshots.https
Uploading: https://repository.apache.org/content/repositories/snapshots/org/apache/directory/studio/ldapbrowser.common/2.0.0-SNAPSHOT/ldapbrowser.common-2.0.0-20101010.040234-35.jar
636K uploaded  (ldapbrowser.common-2.0.0-20101010.040234-35.jar)
[INFO] Retrieving previous metadata from apache.snapshots.https
[INFO] Uploading repository metadata for: 'artifact org.apache.directory.studio:ldapbrowser.common'
[INFO] Uploading project information for ldapbrowser.common 2.0.0-20101010.040234-35
[INFO] Retrieving previous metadata from apache.snapshots.https
[INFO] Uploading repository metadata for: 'snapshot org.apache.directory.studio:ldapbrowser.common:2.0.0-SNAPSHOT'
[HUDSON] Archiving <https://hudson.apache.org/hudson/job/dir-studio-jdk15-ubuntu-deploy/ws/trunk/plugins/ldapbrowser.common/pom.xml>
to /home/hudson/hudson/jobs/dir-studio-jdk15-ubuntu-deploy/modules/org.apache.directory.studio$ldapbrowser.common/builds/2010-10-10_04-02-08/archive/org.apache.directory.studio/ldapbrowser.common/2.0.0-SNAPSHOT/pom.xml
[HUDSON] Archiving <https://hudson.apache.org/hudson/job/dir-studio-jdk15-ubuntu-deploy/ws/trunk/plugins/ldapbrowser.common/target/ldapbrowser.common-2.0.0-SNAPSHOT.jar>
to /home/hudson/hudson/jobs/dir-studio-jdk15-ubuntu-deploy/modules/org.apache.directory.studio$ldapbrowser.common/builds/2010-10-10_04-02-08/archive/org.apache.directory.studio/ldapbrowser.common/2.0.0-20101010.040234-35/ldapbrowser.common-2.0.0-SNAPSHOT.jar
[INFO] ------------------------------------------------------------------------
[INFO] Building Apache Directory Studio Value Editors
[INFO]    task-segment: [clean, deploy]
[INFO] ------------------------------------------------------------------------
[INFO] [clean:clean {execution: default-clean}]
[INFO] Deleting <https://hudson.apache.org/hudson/job/dir-studio-jdk15-ubuntu-deploy/ws/trunk/plugins/valueeditors/target>
[INFO] [remote-resources:process {execution: default}]
[INFO] snapshot org.apache.directory.studio:ldapbrowser.common:2.0.0-SNAPSHOT: checking for
updates from apache.snapshots
[INFO] [resources:resources {execution: default-resources}]
[INFO] Using 'UTF-8' encoding to copy filtered resources.
[INFO] Copying 4 resources
[INFO] Copying 17 resources to resources
[INFO] Copying 30 resources
[INFO] Copying 3 resources
[INFO] [studio:prepare-jar-package {execution: default}]
[INFO] [compiler:compile {execution: default-compile}]
[INFO] Compiling 33 source files to <https://hudson.apache.org/hudson/job/dir-studio-jdk15-ubuntu-deploy/ws/trunk/plugins/valueeditors/target/classes>
[INFO] [bundle:manifest {execution: default}]
[WARNING] Embed-Dependency: clause "*;scope=compile|runtime" did not match any dependencies
[WARNING] Warning in manifest for org.apache.directory.studio:valueeditors:jar:2.0.0-SNAPSHOT
: Superfluous export-package instructions: [org.apache.directory.studio.valueeditors.integer.*,
org.apache.directory.studio.valueeditors.objectclass.*, org.apache.directory.studio.valueeditors.image.*,
org.apache.directory.studio.valueeditors.dn.*, org.apache.directory.studio.valueeditors.password.*,
org.apache.directory.studio.valueeditors.address.*, org.apache.directory.studio.valueeditors.time.*]
[WARNING] Warning in manifest for org.apache.directory.studio:valueeditors:jar:2.0.0-SNAPSHOT
: Did not find matching referal for !
[INFO] [resources:testResources {execution: default-testResources}]
[INFO] Using 'UTF-8' encoding to copy filtered resources.
[INFO] skip non existing resourceDirectory <https://hudson.apache.org/hudson/job/dir-studio-jdk15-ubuntu-deploy/ws/trunk/plugins/valueeditors/src/test/resources>
[INFO] Copying 3 resources
[INFO] [compiler:testCompile {execution: default-testCompile}]
[INFO] Compiling 3 source files to <https://hudson.apache.org/hudson/job/dir-studio-jdk15-ubuntu-deploy/ws/trunk/plugins/valueeditors/target/test-classes>
[INFO] [surefire:test {execution: default-test}]
[INFO] Tests are skipped.
[INFO] [jar:jar {execution: default-jar}]
[INFO] Building jar: <https://hudson.apache.org/hudson/job/dir-studio-jdk15-ubuntu-deploy/ws/trunk/plugins/valueeditors/target/valueeditors-2.0.0-SNAPSHOT.jar>
[INFO] [tools:verify-legal-files {execution: verify-legal-files}]
[INFO] Checking legal files in: valueeditors-2.0.0-SNAPSHOT.jar
[INFO] [install:install {execution: default-install}]
[INFO] Installing <https://hudson.apache.org/hudson/job/dir-studio-jdk15-ubuntu-deploy/ws/trunk/plugins/valueeditors/target/valueeditors-2.0.0-SNAPSHOT.jar>
to /home/hudson/.m2/repository/org/apache/directory/studio/valueeditors/2.0.0-SNAPSHOT/valueeditors-2.0.0-SNAPSHOT.jar
[INFO] [deploy:deploy {execution: default-deploy}]
[INFO] Retrieving previous build number from apache.snapshots.https
Uploading: https://repository.apache.org/content/repositories/snapshots/org/apache/directory/studio/valueeditors/2.0.0-SNAPSHOT/valueeditors-2.0.0-20101010.040234-35.jar
122K uploaded  (valueeditors-2.0.0-20101010.040234-35.jar)
[INFO] Retrieving previous metadata from apache.snapshots.https
[INFO] Uploading repository metadata for: 'snapshot org.apache.directory.studio:valueeditors:2.0.0-SNAPSHOT'
[INFO] Uploading project information for valueeditors 2.0.0-20101010.040234-35
[INFO] Retrieving previous metadata from apache.snapshots.https
[INFO] Uploading repository metadata for: 'artifact org.apache.directory.studio:valueeditors'
[HUDSON] Archiving <https://hudson.apache.org/hudson/job/dir-studio-jdk15-ubuntu-deploy/ws/trunk/plugins/valueeditors/pom.xml>
to /home/hudson/hudson/jobs/dir-studio-jdk15-ubuntu-deploy/modules/org.apache.directory.studio$valueeditors/builds/2010-10-10_04-02-08/archive/org.apache.directory.studio/valueeditors/2.0.0-SNAPSHOT/pom.xml
[HUDSON] Archiving <https://hudson.apache.org/hudson/job/dir-studio-jdk15-ubuntu-deploy/ws/trunk/plugins/valueeditors/target/valueeditors-2.0.0-SNAPSHOT.jar>
to /home/hudson/hudson/jobs/dir-studio-jdk15-ubuntu-deploy/modules/org.apache.directory.studio$valueeditors/builds/2010-10-10_04-02-08/archive/org.apache.directory.studio/valueeditors/2.0.0-20101010.040234-35/valueeditors-2.0.0-SNAPSHOT.jar
[INFO] ------------------------------------------------------------------------
[INFO] Building Apache Directory Studio ACI Item Editor
[INFO]    task-segment: [clean, deploy]
[INFO] ------------------------------------------------------------------------
[INFO] [clean:clean {execution: default-clean}]
[INFO] Deleting <https://hudson.apache.org/hudson/job/dir-studio-jdk15-ubuntu-deploy/ws/trunk/plugins/aciitemeditor/target>
[INFO] [remote-resources:process {execution: default}]
[INFO] snapshot org.apache.directory.studio:valueeditors:2.0.0-SNAPSHOT: checking for updates
from apache.snapshots
[INFO] [resources:resources {execution: default-resources}]
[INFO] Using 'UTF-8' encoding to copy filtered resources.
[INFO] Copying 4 resources
[INFO] Copying 10 resources to resources
[INFO] Copying 12 resources
[INFO] Copying 3 resources
[INFO] [studio:prepare-jar-package {execution: default}]
[INFO] [compiler:compile {execution: default-compile}]
[INFO] Compiling 49 source files to <https://hudson.apache.org/hudson/job/dir-studio-jdk15-ubuntu-deploy/ws/trunk/plugins/aciitemeditor/target/classes>
[INFO] [bundle:manifest {execution: generate-manifest}]
[INFO] [resources:testResources {execution: default-testResources}]
[INFO] Using 'UTF-8' encoding to copy filtered resources.
[INFO] skip non existing resourceDirectory <https://hudson.apache.org/hudson/job/dir-studio-jdk15-ubuntu-deploy/ws/trunk/plugins/aciitemeditor/src/test/resources>
[INFO] Copying 3 resources
[INFO] [compiler:testCompile {execution: default-testCompile}]
[INFO] Nothing to compile - all classes are up to date
[INFO] [surefire:test {execution: default-test}]
[INFO] Tests are skipped.
[INFO] [jar:jar {execution: default-jar}]
[INFO] Building jar: <https://hudson.apache.org/hudson/job/dir-studio-jdk15-ubuntu-deploy/ws/trunk/plugins/aciitemeditor/target/aciitemeditor-2.0.0-SNAPSHOT.jar>
[INFO] [tools:verify-legal-files {execution: verify-legal-files}]
[INFO] Checking legal files in: aciitemeditor-2.0.0-SNAPSHOT.jar
[INFO] [install:install {execution: default-install}]
[INFO] Installing <https://hudson.apache.org/hudson/job/dir-studio-jdk15-ubuntu-deploy/ws/trunk/plugins/aciitemeditor/target/aciitemeditor-2.0.0-SNAPSHOT.jar>
to /home/hudson/.m2/repository/org/apache/directory/studio/aciitemeditor/2.0.0-SNAPSHOT/aciitemeditor-2.0.0-SNAPSHOT.jar
[INFO] [deploy:deploy {execution: default-deploy}]
[INFO] Retrieving previous build number from apache.snapshots.https
Uploading: https://repository.apache.org/content/repositories/snapshots/org/apache/directory/studio/aciitemeditor/2.0.0-SNAPSHOT/aciitemeditor-2.0.0-20101010.040234-35.jar
198K uploaded  (aciitemeditor-2.0.0-20101010.040234-35.jar)
[INFO] Uploading project information for aciitemeditor 2.0.0-20101010.040234-35
[INFO] Retrieving previous metadata from apache.snapshots.https
[INFO] Uploading repository metadata for: 'artifact org.apache.directory.studio:aciitemeditor'
[INFO] Retrieving previous metadata from apache.snapshots.https
[INFO] Uploading repository metadata for: 'snapshot org.apache.directory.studio:aciitemeditor:2.0.0-SNAPSHOT'
[HUDSON] Archiving <https://hudson.apache.org/hudson/job/dir-studio-jdk15-ubuntu-deploy/ws/trunk/plugins/aciitemeditor/pom.xml>
to /home/hudson/hudson/jobs/dir-studio-jdk15-ubuntu-deploy/modules/org.apache.directory.studio$aciitemeditor/builds/2010-10-10_04-02-08/archive/org.apache.directory.studio/aciitemeditor/2.0.0-SNAPSHOT/pom.xml
[HUDSON] Archiving <https://hudson.apache.org/hudson/job/dir-studio-jdk15-ubuntu-deploy/ws/trunk/plugins/aciitemeditor/target/aciitemeditor-2.0.0-SNAPSHOT.jar>
to /home/hudson/hudson/jobs/dir-studio-jdk15-ubuntu-deploy/modules/org.apache.directory.studio$aciitemeditor/builds/2010-10-10_04-02-08/archive/org.apache.directory.studio/aciitemeditor/2.0.0-20101010.040234-35/aciitemeditor-2.0.0-SNAPSHOT.jar
[INFO] ------------------------------------------------------------------------
[INFO] Building Apache MINA Core (for Apache Directory Studio)
[INFO]    task-segment: [clean, deploy]
[INFO] ------------------------------------------------------------------------
[INFO] [clean:clean {execution: default-clean}]
[INFO] Deleting <https://hudson.apache.org/hudson/job/dir-studio-jdk15-ubuntu-deploy/ws/trunk/libraries/org.apache.mina.core/target>
[INFO] [remote-resources:process {execution: default}]
[INFO] [resources:resources {execution: default-resources}]
[INFO] Using 'UTF-8' encoding to copy filtered resources.
[INFO] skip non existing resourceDirectory <https://hudson.apache.org/hudson/job/dir-studio-jdk15-ubuntu-deploy/ws/trunk/libraries/org.apache.mina.core/src/main/resources>
[INFO] Copying 3 resources
[INFO] [studio:prepare-jar-package {execution: default}]
[INFO] Copying /home/hudson/.m2/repository/ant/ant/1.6/ant-1.6.jar to
               <https://hudson.apache.org/hudson/job/dir-studio-jdk15-ubuntu-deploy/ws/trunk/libraries/org.apache.mina.core/target/classes/lib/ant-1.6.jar>
[INFO] Copying /home/hudson/.m2/repository/asm/asm/3.1/asm-3.1.jar to
               <https://hudson.apache.org/hudson/job/dir-studio-jdk15-ubuntu-deploy/ws/trunk/libraries/org.apache.mina.core/target/classes/lib/asm-3.1.jar>
[INFO] Copying /home/hudson/.m2/repository/dom4j/dom4j/1.6.1/dom4j-1.6.1.jar to
               <https://hudson.apache.org/hudson/job/dir-studio-jdk15-ubuntu-deploy/ws/trunk/libraries/org.apache.mina.core/target/classes/lib/dom4j-1.6.1.jar>
[INFO] Copying /home/hudson/.m2/repository/com/ibm/icu/icu4j/2.6.1/icu4j-2.6.1.jar to
               <https://hudson.apache.org/hudson/job/dir-studio-jdk15-ubuntu-deploy/ws/trunk/libraries/org.apache.mina.core/target/classes/lib/icu4j-2.6.1.jar>
[INFO] Copying /home/hudson/.m2/repository/jaxen/jaxen/1.1.1/jaxen-1.1.1.jar to
               <https://hudson.apache.org/hudson/job/dir-studio-jdk15-ubuntu-deploy/ws/trunk/libraries/org.apache.mina.core/target/classes/lib/jaxen-1.1.1.jar>
[INFO] Copying /home/hudson/.m2/repository/jdom/jdom/1.0/jdom-1.0.jar to
               <https://hudson.apache.org/hudson/job/dir-studio-jdk15-ubuntu-deploy/ws/trunk/libraries/org.apache.mina.core/target/classes/lib/jdom-1.0.jar>
[INFO] Copying /home/hudson/.m2/repository/junit/junit/4.5/junit-4.5.jar to
               <https://hudson.apache.org/hudson/job/dir-studio-jdk15-ubuntu-deploy/ws/trunk/libraries/org.apache.mina.core/target/classes/lib/junit-4.5.jar>
[INFO] Copying /home/hudson/.m2/repository/org/apache/mina/mina-core/2.0.0/mina-core-2.0.0.jar
to
               <https://hudson.apache.org/hudson/job/dir-studio-jdk15-ubuntu-deploy/ws/trunk/libraries/org.apache.mina.core/target/classes/lib/mina-core-2.0.0.jar>
[INFO] Copying /home/hudson/.m2/repository/pmd/pmd/4.2.5/pmd-4.2.5.jar to
               <https://hudson.apache.org/hudson/job/dir-studio-jdk15-ubuntu-deploy/ws/trunk/libraries/org.apache.mina.core/target/classes/lib/pmd-4.2.5.jar>
[INFO] Copying /home/hudson/.m2/repository/xalan/xalan/2.6.0/xalan-2.6.0.jar to
               <https://hudson.apache.org/hudson/job/dir-studio-jdk15-ubuntu-deploy/ws/trunk/libraries/org.apache.mina.core/target/classes/lib/xalan-2.6.0.jar>
[INFO] Copying /home/hudson/.m2/repository/xerces/xercesImpl/2.9.1/xercesImpl-2.9.1.jar to
               <https://hudson.apache.org/hudson/job/dir-studio-jdk15-ubuntu-deploy/ws/trunk/libraries/org.apache.mina.core/target/classes/lib/xercesImpl-2.9.1.jar>
[INFO] Copying /home/hudson/.m2/repository/xml-apis/xml-apis/1.3.02/xml-apis-1.3.02.jar to
               <https://hudson.apache.org/hudson/job/dir-studio-jdk15-ubuntu-deploy/ws/trunk/libraries/org.apache.mina.core/target/classes/lib/xml-apis-1.3.02.jar>
[INFO] Copying /home/hudson/.m2/repository/xerces/xmlParserAPIs/2.6.2/xmlParserAPIs-2.6.2.jar
to
               <https://hudson.apache.org/hudson/job/dir-studio-jdk15-ubuntu-deploy/ws/trunk/libraries/org.apache.mina.core/target/classes/lib/xmlParserAPIs-2.6.2.jar>
[INFO] Copying /home/hudson/.m2/repository/xom/xom/1.0/xom-1.0.jar to
               <https://hudson.apache.org/hudson/job/dir-studio-jdk15-ubuntu-deploy/ws/trunk/libraries/org.apache.mina.core/target/classes/lib/xom-1.0.jar>
[INFO] [compiler:compile {execution: default-compile}]
[INFO] No sources to compile
[INFO] [bundle:manifest {execution: generate-manifest}]
[WARNING] Warning in manifest for org.apache.directory.studio:org.apache.mina.core:jar:2.0.0
: Did not find matching referal for !
[INFO] [resources:testResources {execution: default-testResources}]
[INFO] Using 'UTF-8' encoding to copy filtered resources.
[INFO] skip non existing resourceDirectory <https://hudson.apache.org/hudson/job/dir-studio-jdk15-ubuntu-deploy/ws/trunk/libraries/org.apache.mina.core/src/test/resources>
[INFO] Copying 3 resources
[INFO] [compiler:testCompile {execution: default-testCompile}]
[INFO] No sources to compile
[INFO] [surefire:test {execution: default-test}]
[INFO] Tests are skipped.
[INFO] [jar:jar {execution: default-jar}]
[INFO] Building jar: <https://hudson.apache.org/hudson/job/dir-studio-jdk15-ubuntu-deploy/ws/trunk/libraries/org.apache.mina.core/target/org.apache.mina.core-2.0.0.jar>
[INFO] [tools:verify-legal-files {execution: verify-legal-files}]
[INFO] Checking legal files in: org.apache.mina.core-2.0.0.jar
[INFO] [install:install {execution: default-install}]
[INFO] Installing <https://hudson.apache.org/hudson/job/dir-studio-jdk15-ubuntu-deploy/ws/trunk/libraries/org.apache.mina.core/target/org.apache.mina.core-2.0.0.jar>
to /home/hudson/.m2/repository/org/apache/directory/studio/org.apache.mina.core/2.0.0/org.apache.mina.core-2.0.0.jar
[INFO] [deploy:deploy {execution: default-deploy}]
[INFO] Skipping artifact deployment
[HUDSON] Archiving <https://hudson.apache.org/hudson/job/dir-studio-jdk15-ubuntu-deploy/ws/trunk/libraries/org.apache.mina.core/pom.xml>
to /home/hudson/hudson/jobs/dir-studio-jdk15-ubuntu-deploy/modules/org.apache.directory.studio$org.apache.mina.core/builds/2010-10-10_04-02-08/archive/org.apache.directory.studio/org.apache.mina.core/2.0.0/pom.xml
[HUDSON] Archiving <https://hudson.apache.org/hudson/job/dir-studio-jdk15-ubuntu-deploy/ws/trunk/libraries/org.apache.mina.core/target/org.apache.mina.core-2.0.0.jar>
to /home/hudson/hudson/jobs/dir-studio-jdk15-ubuntu-deploy/modules/org.apache.directory.studio$org.apache.mina.core/builds/2010-10-10_04-02-08/archive/org.apache.directory.studio/org.apache.mina.core/2.0.0/org.apache.mina.core-2.0.0.jar
[INFO] ------------------------------------------------------------------------
[INFO] Building Apache Directory Studio Apache DS Configuration
[INFO]    task-segment: [clean, deploy]
[INFO] ------------------------------------------------------------------------
[INFO] [clean:clean {execution: default-clean}]
[INFO] Deleting <https://hudson.apache.org/hudson/job/dir-studio-jdk15-ubuntu-deploy/ws/trunk/plugins/apacheds.configuration/target>
[INFO] [remote-resources:process {execution: default}]
[INFO] [resources:resources {execution: default-resources}]
[INFO] Using 'UTF-8' encoding to copy filtered resources.
[INFO] Copying 6 resources
[INFO] Copying 9 resources to resources
[INFO] Copying 9 resources
[INFO] Copying 48 resources
[INFO] Copying 3 resources
[INFO] [studio:prepare-jar-package {execution: default}]
[INFO] [compiler:compile {execution: default-compile}]
[INFO] Compiling 244 source files to <https://hudson.apache.org/hudson/job/dir-studio-jdk15-ubuntu-deploy/ws/trunk/plugins/apacheds.configuration/target/classes>
[INFO] -------------------------------------------------------------
[ERROR] COMPILATION ERROR : 
[INFO] -------------------------------------------------------------
[ERROR] Failure executing javac, but could not parse the error:
An exception has occurred in the compiler (1.5.0_22). Please file a bug at the Java Developer
Connection (http://java.sun.com/webapps/bugreport)  after checking the Bug Parade for duplicates.
Include your program and the following diagnostic in your report.  Thank you.
com.sun.tools.javac.code.Symbol$CompletionFailure: file edu/umd/cs/findbugs/annotations/SuppressWarnings.class
not found

[INFO] 1 error
[INFO] -------------------------------------------------------------
[HUDSON] Archiving <https://hudson.apache.org/hudson/job/dir-studio-jdk15-ubuntu-deploy/ws/trunk/plugins/apacheds.configuration/pom.xml>
to /home/hudson/hudson/jobs/dir-studio-jdk15-ubuntu-deploy/modules/org.apache.directory.studio$apacheds.configuration/builds/2010-10-10_04-02-08/archive/org.apache.directory.studio/apacheds.configuration/2.0.0-SNAPSHOT/pom.xml
[INFO] ------------------------------------------------------------------------
[ERROR] BUILD FAILURE
[INFO] ------------------------------------------------------------------------
[INFO] Compilation failure
Failure executing javac, but could not parse the error:
An exception has occurred in the compiler (1.5.0_22). Please file a bug at the Java Developer
Connection (http://java.sun.com/webapps/bugreport)  after checking the Bug Parade for duplicates.
Include your program and the following diagnostic in your report.  Thank you.
com.sun.tools.javac.code.Symbol$CompletionFailure: file edu/umd/cs/findbugs/annotations/SuppressWarnings.class
not found


[INFO] ------------------------------------------------------------------------
[INFO] For more information, run Maven with the -e switch
[INFO] ------------------------------------------------------------------------
[INFO] Total time: 13 minutes 23 seconds
[INFO] Finished at: Sun Oct 10 04:15:42 UTC 2010
[INFO] Final Memory: 84M/154M
[INFO] ------------------------------------------------------------------------
Sending e-mails to: notifications@directory.apache.org
channel stopped


Mime
View raw message