directory-notifications mailing list archives

Site index · List index
Message view « Date » · « Thread »
Top « Date » · « Thread »
From Apache Hudson Server <hud...@hudson.apache.org>
Subject Build failed in Hudson: dir-apacheds-jdk16-win #41
Date Sun, 10 Oct 2010 04:16:25 GMT
See <https://hudson.apache.org/hudson/job/dir-apacheds-jdk16-win/41/>

------------------------------------------
[...truncated 1430 lines...]
[INFO] [surefire:test {execution: default-test}]
[INFO] Surefire report directory: C:\hudson\hudson-slave\workspace\dir-apacheds-jdk16-win\trunk\server-jndi\target\surefire-reports

-------------------------------------------------------
 T E S T S
-------------------------------------------------------
Running org.apache.directory.server.configuration.ApacheDSTest
TODO: Fix this the real test case and delete me!
Tests run: 1, Failures: 0, Errors: 0, Skipped: 0, Time elapsed: 0.448 sec

Results :

Tests run: 1, Failures: 0, Errors: 0, Skipped: 0

[HUDSON] Recording test results
[INFO] [jar:jar {execution: default-jar}]
[INFO] Building jar: C:\hudson\hudson-slave\workspace\dir-apacheds-jdk16-win\trunk\server-jndi\target\apacheds-server-jndi-1.5.8-SNAPSHOT.jar
[INFO] [tools:verify-legal-files {execution: verify-legal-files}]
[INFO] Checking legal files in: apacheds-server-jndi-1.5.8-SNAPSHOT.jar
[INFO] Preparing source:jar
[WARNING] Removing: jar from forked lifecycle, to prevent recursive invocation.
[INFO] No goals needed for project - skipping
[INFO] [source:jar {execution: attach-sources}]
[INFO] META-INF already added, skipping
[INFO] META-INF already added, skipping
[INFO] META-INF\DEPENDENCIES already added, skipping
[INFO] META-INF\LICENSE already added, skipping
[INFO] META-INF\NOTICE already added, skipping
[INFO] Building jar: C:\hudson\hudson-slave\workspace\dir-apacheds-jdk16-win\trunk\server-jndi\target\apacheds-server-jndi-1.5.8-SNAPSHOT-sources.jar
[INFO] META-INF already added, skipping
[INFO] META-INF already added, skipping
[INFO] META-INF\DEPENDENCIES already added, skipping
[INFO] META-INF\LICENSE already added, skipping
[INFO] META-INF\NOTICE already added, skipping
[INFO] [install:install {execution: default-install}]
[INFO] Installing C:\hudson\hudson-slave\workspace\dir-apacheds-jdk16-win\trunk\server-jndi\target\apacheds-server-jndi-1.5.8-SNAPSHOT.jar
to C:\Users\hudson\.m2\repository\org\apache\directory\server\apacheds-server-jndi\1.5.8-SNAPSHOT\apacheds-server-jndi-1.5.8-SNAPSHOT.jar
[INFO] Installing C:\hudson\hudson-slave\workspace\dir-apacheds-jdk16-win\trunk\server-jndi\target\apacheds-server-jndi-1.5.8-SNAPSHOT-sources.jar
to C:\Users\hudson\.m2\repository\org\apache\directory\server\apacheds-server-jndi\1.5.8-SNAPSHOT\apacheds-server-jndi-1.5.8-SNAPSHOT-sources.jar
[HUDSON] Archiving disabled - not archiving C:\hudson\hudson-slave\workspace\dir-apacheds-jdk16-win\trunk\server-jndi\pom.xml
[HUDSON] Archiving disabled - not archiving C:\hudson\hudson-slave\workspace\dir-apacheds-jdk16-win\trunk\server-jndi\target\apacheds-server-jndi-1.5.8-SNAPSHOT.jar
[HUDSON] Archiving disabled - not archiving C:\hudson\hudson-slave\workspace\dir-apacheds-jdk16-win\trunk\server-jndi\target\apacheds-server-jndi-1.5.8-SNAPSHOT-sources.jar
[INFO] ------------------------------------------------------------------------
[INFO] Building ApacheDS Server Replication Service
[INFO]    task-segment: [clean, install]
[INFO] ------------------------------------------------------------------------
[INFO] [clean:clean {execution: default-clean}]
[INFO] Deleting C:\hudson\hudson-slave\workspace\dir-apacheds-jdk16-win\trunk\server-replication\target
[INFO] [remote-resources:process {execution: default}]
[INFO] [resources:resources {execution: default-resources}]
[INFO] Using 'UTF-8' encoding to copy filtered resources.
[INFO] Copying 0 resource
[INFO] Copying 3 resources
[INFO] [compiler:compile {execution: default-compile}]
[INFO] Compiling 5 source files to C:\hudson\hudson-slave\workspace\dir-apacheds-jdk16-win\trunk\server-replication\target\classes
[INFO] [resources:testResources {execution: default-testResources}]
[INFO] Using 'UTF-8' encoding to copy filtered resources.
[INFO] skip non existing resourceDirectory C:\hudson\hudson-slave\workspace\dir-apacheds-jdk16-win\trunk\server-replication\src\test\resources
[INFO] Copying 3 resources
[INFO] [compiler:testCompile {execution: default-testCompile}]
[INFO] No sources to compile
[INFO] [surefire:test {execution: default-test}]
[INFO] Surefire report directory: C:\hudson\hudson-slave\workspace\dir-apacheds-jdk16-win\trunk\server-replication\target\surefire-reports

-------------------------------------------------------
 T E S T S
-------------------------------------------------------
There are no tests to run.

Results :

Tests run: 0, Failures: 0, Errors: 0, Skipped: 0

[HUDSON] Recording test results
[INFO] [jar:jar {execution: default-jar}]
[INFO] Building jar: C:\hudson\hudson-slave\workspace\dir-apacheds-jdk16-win\trunk\server-replication\target\apacheds-server-replication-1.5.8-SNAPSHOT.jar
[INFO] [tools:verify-legal-files {execution: verify-legal-files}]
[INFO] Checking legal files in: apacheds-server-replication-1.5.8-SNAPSHOT.jar
[INFO] [install:install {execution: default-install}]
[INFO] Installing C:\hudson\hudson-slave\workspace\dir-apacheds-jdk16-win\trunk\server-replication\target\apacheds-server-replication-1.5.8-SNAPSHOT.jar
to C:\Users\hudson\.m2\repository\org\apache\directory\server\apacheds-server-replication\1.5.8-SNAPSHOT\apacheds-server-replication-1.5.8-SNAPSHOT.jar
[HUDSON] Archiving disabled - not archiving C:\hudson\hudson-slave\workspace\dir-apacheds-jdk16-win\trunk\server-replication\pom.xml
[HUDSON] Archiving disabled - not archiving C:\hudson\hudson-slave\workspace\dir-apacheds-jdk16-win\trunk\server-replication\target\apacheds-server-replication-1.5.8-SNAPSHOT.jar
[INFO] ------------------------------------------------------------------------
[INFO] Building ApacheDS Test Framework
[INFO]    task-segment: [clean, install]
[INFO] ------------------------------------------------------------------------
[INFO] [clean:clean {execution: default-clean}]
[INFO] Deleting C:\hudson\hudson-slave\workspace\dir-apacheds-jdk16-win\trunk\test-framework\target
[INFO] [remote-resources:process {execution: default}]
[INFO] [resources:resources {execution: default-resources}]
[INFO] Using 'UTF-8' encoding to copy filtered resources.
[INFO] skip non existing resourceDirectory C:\hudson\hudson-slave\workspace\dir-apacheds-jdk16-win\trunk\test-framework\src\main\resources
[INFO] Copying 3 resources
[INFO] [compiler:compile {execution: default-compile}]
[INFO] Compiling 3 source files to C:\hudson\hudson-slave\workspace\dir-apacheds-jdk16-win\trunk\test-framework\target\classes
[INFO] [resources:testResources {execution: default-testResources}]
[INFO] Using 'UTF-8' encoding to copy filtered resources.
[INFO] Copying 2 resources
[INFO] Copying 3 resources
[INFO] [compiler:testCompile {execution: default-testCompile}]
[INFO] Compiling 9 source files to C:\hudson\hudson-slave\workspace\dir-apacheds-jdk16-win\trunk\test-framework\target\test-classes
[INFO] [surefire:test {execution: default-test}]
[INFO] Surefire report directory: C:\hudson\hudson-slave\workspace\dir-apacheds-jdk16-win\trunk\test-framework\target\surefire-reports

-------------------------------------------------------
 T E S T S
-------------------------------------------------------
Running org.apache.directory.server.core.integ.TestSuiteServer
Tests run: 3, Failures: 0, Errors: 0, Skipped: 0, Time elapsed: 24.037 sec
Running org.apache.directory.server.core.integ.TestWithClassLevelLdapServer
Tests run: 1, Failures: 0, Errors: 0, Skipped: 0, Time elapsed: 3.047 sec
Running org.apache.directory.server.core.integ.TestMultiLevelDS
Tests run: 2, Failures: 0, Errors: 0, Skipped: 0, Time elapsed: 5.692 sec
Running org.apache.directory.server.core.integ.TestClassServer
Tests run: 1, Failures: 0, Errors: 0, Skipped: 0, Time elapsed: 2.581 sec
Running org.apache.directory.server.core.integ.TestSuite
Tests run: 6, Failures: 0, Errors: 0, Skipped: 0, Time elapsed: 14.27 sec
Running org.apache.directory.server.core.integ.TestClassA
Tests run: 2, Failures: 0, Errors: 0, Skipped: 0, Time elapsed: 5.68 sec
Running org.apache.directory.server.core.integ.TestClassC
Tests run: 2, Failures: 0, Errors: 0, Skipped: 0, Time elapsed: 2.309 sec
Running org.apache.directory.server.core.integ.TestClassB
Tests run: 2, Failures: 0, Errors: 0, Skipped: 0, Time elapsed: 4.594 sec
Running org.apache.directory.server.core.integ.TestSuiteWithoutFactory
Tests run: 6, Failures: 0, Errors: 0, Skipped: 0, Time elapsed: 9.34 sec

Results :

Tests run: 25, Failures: 0, Errors: 0, Skipped: 0

[HUDSON] Recording test results
[INFO] [jar:jar {execution: default-jar}]
[INFO] Building jar: C:\hudson\hudson-slave\workspace\dir-apacheds-jdk16-win\trunk\test-framework\target\apacheds-test-framework-1.5.8-SNAPSHOT.jar
[INFO] [tools:verify-legal-files {execution: verify-legal-files}]
[INFO] Checking legal files in: apacheds-test-framework-1.5.8-SNAPSHOT.jar
[INFO] [install:install {execution: default-install}]
[INFO] Installing C:\hudson\hudson-slave\workspace\dir-apacheds-jdk16-win\trunk\test-framework\target\apacheds-test-framework-1.5.8-SNAPSHOT.jar
to C:\Users\hudson\.m2\repository\org\apache\directory\server\apacheds-test-framework\1.5.8-SNAPSHOT\apacheds-test-framework-1.5.8-SNAPSHOT.jar
[HUDSON] Archiving disabled - not archiving C:\hudson\hudson-slave\workspace\dir-apacheds-jdk16-win\trunk\test-framework\pom.xml
[HUDSON] Archiving disabled - not archiving C:\hudson\hudson-slave\workspace\dir-apacheds-jdk16-win\trunk\test-framework\target\apacheds-test-framework-1.5.8-SNAPSHOT.jar
[INFO] ------------------------------------------------------------------------
[INFO] Building ApacheDS Generalized (X) DBM Tools
[INFO]    task-segment: [clean, install]
[INFO] ------------------------------------------------------------------------
[INFO] [clean:clean {execution: default-clean}]
[INFO] Deleting C:\hudson\hudson-slave\workspace\dir-apacheds-jdk16-win\trunk\xdbm-tools\target
[INFO] [remote-resources:process {execution: default}]
[INFO] [resources:resources {execution: default-resources}]
[INFO] Using 'UTF-8' encoding to copy filtered resources.
[INFO] Copying 1 resource
[INFO] Copying 3 resources
[INFO] [compiler:compile {execution: default-compile}]
[INFO] Compiling 14 source files to C:\hudson\hudson-slave\workspace\dir-apacheds-jdk16-win\trunk\xdbm-tools\target\classes
[INFO] -------------------------------------------------------------
[ERROR] COMPILATION ERROR : 
[INFO] -------------------------------------------------------------
[ERROR] Failure executing javac, but could not parse the error:


The system is out of resources.
Consult the following stack trace for details.
java.lang.OutOfMemoryError: PermGen space
	at java.lang.ClassLoader.defineClass1(Native Method)
	at java.lang.ClassLoader.defineClass(ClassLoader.java:616)
	at java.security.SecureClassLoader.defineClass(SecureClassLoader.java:124)
	at java.net.URLClassLoader.defineClass(URLClassLoader.java:260)
	at java.net.URLClassLoader.access$000(URLClassLoader.java:56)
	at java.net.URLClassLoader$1.run(URLClassLoader.java:195)
	at java.security.AccessController.doPrivileged(Native Method)
	at java.net.URLClassLoader.findClass(URLClassLoader.java:188)
	at org.codehaus.plexus.compiler.javac.IsolatedClassLoader.loadClass(IsolatedClassLoader.java:56)
	at java.lang.ClassLoader.loadClassInternal(ClassLoader.java:316)
	at com.sun.tools.javac.main.JavaCompiler.<init>(JavaCompiler.java:300)
	at com.sun.tools.javac.main.JavaCompiler.instance(JavaCompiler.java:72)
	at com.sun.tools.javac.main.Main.compile(Main.java:340)
	at com.sun.tools.javac.main.Main.compile(Main.java:279)
	at com.sun.tools.javac.main.Main.compile(Main.java:270)
	at com.sun.tools.javac.Main.compile(Main.java:87)
	at sun.reflect.NativeMethodAccessorImpl.invoke0(Native Method)
	at sun.reflect.NativeMethodAccessorImpl.invoke(NativeMethodAccessorImpl.java:39)
	at sun.reflect.DelegatingMethodAccessorImpl.invoke(DelegatingMethodAccessorImpl.java:25)
	at java.lang.reflect.Method.invoke(Method.java:597)
	at org.codehaus.plexus.compiler.javac.JavacCompiler.compileInProcess(JavacCompiler.java:554)
	at org.codehaus.plexus.compiler.javac.JavacCompiler.compile(JavacCompiler.java:161)
	at org.apache.maven.plugin.AbstractCompilerMojo.execute(AbstractCompilerMojo.java:605)
	at org.apache.maven.plugin.CompilerMojo.execute(CompilerMojo.java:128)
	at org.apache.maven.plugin.DefaultPluginManager.executeMojo(DefaultPluginManager.java:490)
	at hudson.maven.agent.PluginManagerInterceptor.executeMojo(PluginManagerInterceptor.java:182)
	at org.apache.maven.lifecycle.DefaultLifecycleExecutor.executeGoals(DefaultLifecycleExecutor.java:694)
	at org.apache.maven.lifecycle.DefaultLifecycleExecutor.executeGoalWithLifecycle(DefaultLifecycleExecutor.java:556)
	at org.apache.maven.lifecycle.DefaultLifecycleExecutor.executeGoal(DefaultLifecycleExecutor.java:535)
	at org.apache.maven.lifecycle.DefaultLifecycleExecutor.executeGoalAndHandleFailures(DefaultLifecycleExecutor.java:387)
	at org.apache.maven.lifecycle.DefaultLifecycleExecutor.executeTaskSegments(DefaultLifecycleExecutor.java:348)
	at org.apache.maven.lifecycle.DefaultLifecycleExecutor.execute(DefaultLifecycleExecutor.java:180)

[INFO] 1 error
[INFO] -------------------------------------------------------------
[HUDSON] Archiving disabled - not archiving C:\hudson\hudson-slave\workspace\dir-apacheds-jdk16-win\trunk\xdbm-tools\pom.xml
[INFO] ------------------------------------------------------------------------
[ERROR] BUILD FAILURE
[INFO] ------------------------------------------------------------------------
[INFO] Compilation failure
Failure executing javac, but could not parse the error:


The system is out of resources.
Consult the following stack trace for details.
java.lang.OutOfMemoryError: PermGen space
	at java.lang.ClassLoader.defineClass1(Native Method)
	at java.lang.ClassLoader.defineClass(ClassLoader.java:616)
	at java.security.SecureClassLoader.defineClass(SecureClassLoader.java:124)
	at java.net.URLClassLoader.defineClass(URLClassLoader.java:260)
	at java.net.URLClassLoader.access$000(URLClassLoader.java:56)
	at java.net.URLClassLoader$1.run(URLClassLoader.java:195)
	at java.security.AccessController.doPrivileged(Native Method)
	at java.net.URLClassLoader.findClass(URLClassLoader.java:188)
	at org.codehaus.plexus.compiler.javac.IsolatedClassLoader.loadClass(IsolatedClassLoader.java:56)
	at java.lang.ClassLoader.loadClassInternal(ClassLoader.java:316)
	at com.sun.tools.javac.main.JavaCompiler.<init>(JavaCompiler.java:300)
	at com.sun.tools.javac.main.JavaCompiler.instance(JavaCompiler.java:72)
	at com.sun.tools.javac.main.Main.compile(Main.java:340)
	at com.sun.tools.javac.main.Main.compile(Main.java:279)
	at com.sun.tools.javac.main.Main.compile(Main.java:270)
	at com.sun.tools.javac.Main.compile(Main.java:87)
	at sun.reflect.NativeMethodAccessorImpl.invoke0(Native Method)
	at sun.reflect.NativeMethodAccessorImpl.invoke(NativeMethodAccessorImpl.java:39)
	at sun.reflect.DelegatingMethodAccessorImpl.invoke(DelegatingMethodAccessorImpl.java:25)
	at java.lang.reflect.Method.invoke(Method.java:597)
	at org.codehaus.plexus.compiler.javac.JavacCompiler.compileInProcess(JavacCompiler.java:554)
	at org.codehaus.plexus.compiler.javac.JavacCompiler.compile(JavacCompiler.java:161)
	at org.apache.maven.plugin.AbstractCompilerMojo.execute(AbstractCompilerMojo.java:605)
	at org.apache.maven.plugin.CompilerMojo.execute(CompilerMojo.java:128)
	at org.apache.maven.plugin.DefaultPluginManager.executeMojo(DefaultPluginManager.java:490)
	at hudson.maven.agent.PluginManagerInterceptor.executeMojo(PluginManagerInterceptor.java:182)
	at org.apache.maven.lifecycle.DefaultLifecycleExecutor.executeGoals(DefaultLifecycleExecutor.java:694)
	at org.apache.maven.lifecycle.DefaultLifecycleExecutor.executeGoalWithLifecycle(DefaultLifecycleExecutor.java:556)
	at org.apache.maven.lifecycle.DefaultLifecycleExecutor.executeGoal(DefaultLifecycleExecutor.java:535)
	at org.apache.maven.lifecycle.DefaultLifecycleExecutor.executeGoalAndHandleFailures(DefaultLifecycleExecutor.java:387)
	at org.apache.maven.lifecycle.DefaultLifecycleExecutor.executeTaskSegments(DefaultLifecycleExecutor.java:348)
	at org.apache.maven.lifecycle.DefaultLifecycleExecutor.execute(DefaultLifecycleExecutor.java:180)


[INFO] ------------------------------------------------------------------------
[INFO] For more information, run Maven with the -e switch
[INFO] ------------------------------------------------------------------------
[INFO] Total time: 13 minutes 6 seconds
[INFO] Finished at: Sun Oct 10 05:16:24 BST 2010
[INFO] Final Memory: 103M/494M
[INFO] ------------------------------------------------------------------------
Sending e-mails to: notifications@directory.apache.org
Sending e-mails to: notifications@directory.apache.org
channel stopped


Mime
View raw message