directory-notifications mailing list archives

Site index · List index
Message view « Date » · « Thread »
Top « Date » · « Thread »
From Apache Hudson Server <hud...@hudson.apache.org>
Subject Build failed in Hudson: dir-apacheds-jdk15-ubuntu-deploy #49
Date Tue, 12 Oct 2010 04:12:53 GMT
See <https://hudson.apache.org/hudson/job/dir-apacheds-jdk15-ubuntu-deploy/49/changes>

Changes:

[elecharny] Updated the javadoc Header

[kayyagari] o removed obsoleted 'passwordHidden' parameter and its associated methods

[kayyagari] o removed a call to ApacheDsService.start() 
  (this call is not necessary, cause ApacheDsServiceinit() will call the start() method internally)

[kayyagari] o added few checks for null values

[kayyagari] o deferring creating the system entry till it was found missing

[elecharny] Created the readPartitons method

[elecharny] Renamed the createTestEntries method to readTestEntries

[elecharny] Split the method that reads the PasswordPolicy config.

[elecharny] Added the Interceptor Bean and the code to read it from the DIT

------------------------------------------
[...truncated 1296 lines...]
Tests run: 2, Failures: 0, Errors: 0, Skipped: 0

[HUDSON] Recording test results
[INFO] [jar:jar {execution: default-jar}]
[INFO] Building jar: <https://hudson.apache.org/hudson/job/dir-apacheds-jdk15-ubuntu-deploy/ws/trunk/protocol-dhcp/target/apacheds-protocol-dhcp-1.5.8-SNAPSHOT.jar>
[INFO] [tools:verify-legal-files {execution: verify-legal-files}]
[INFO] Checking legal files in: apacheds-protocol-dhcp-1.5.8-SNAPSHOT.jar
[INFO] [install:install {execution: default-install}]
[INFO] Installing <https://hudson.apache.org/hudson/job/dir-apacheds-jdk15-ubuntu-deploy/ws/trunk/protocol-dhcp/target/apacheds-protocol-dhcp-1.5.8-SNAPSHOT.jar>
to /home/hudson/.m2/repository/org/apache/directory/server/apacheds-protocol-dhcp/1.5.8-SNAPSHOT/apacheds-protocol-dhcp-1.5.8-SNAPSHOT.jar
[INFO] [deploy:deploy {execution: default-deploy}]
[INFO] Retrieving previous build number from apache.snapshots.https
Uploading: https://repository.apache.org/content/repositories/snapshots/org/apache/directory/server/apacheds-protocol-dhcp/1.5.8-SNAPSHOT/apacheds-protocol-dhcp-1.5.8-20101012.040302-39.jar
84K uploaded  (apacheds-protocol-dhcp-1.5.8-20101012.040302-39.jar)
[INFO] Uploading project information for apacheds-protocol-dhcp 1.5.8-20101012.040302-39
[INFO] Retrieving previous metadata from apache.snapshots.https
[INFO] Uploading repository metadata for: 'snapshot org.apache.directory.server:apacheds-protocol-dhcp:1.5.8-SNAPSHOT'
[INFO] Retrieving previous metadata from apache.snapshots.https
[INFO] Uploading repository metadata for: 'artifact org.apache.directory.server:apacheds-protocol-dhcp'
[HUDSON] Archiving <https://hudson.apache.org/hudson/job/dir-apacheds-jdk15-ubuntu-deploy/ws/trunk/protocol-dhcp/pom.xml>
to /home/hudson/hudson/jobs/dir-apacheds-jdk15-ubuntu-deploy/modules/org.apache.directory.server$apacheds-protocol-dhcp/builds/2010-10-12_04-02-40/archive/org.apache.directory.server/apacheds-protocol-dhcp/1.5.8-SNAPSHOT/pom.xml
[HUDSON] Archiving <https://hudson.apache.org/hudson/job/dir-apacheds-jdk15-ubuntu-deploy/ws/trunk/protocol-dhcp/target/apacheds-protocol-dhcp-1.5.8-SNAPSHOT.jar>
to /home/hudson/hudson/jobs/dir-apacheds-jdk15-ubuntu-deploy/modules/org.apache.directory.server$apacheds-protocol-dhcp/builds/2010-10-12_04-02-40/archive/org.apache.directory.server/apacheds-protocol-dhcp/1.5.8-20101012.040302-39/apacheds-protocol-dhcp-1.5.8-SNAPSHOT.jar
[INFO] ------------------------------------------------------------------------
[INFO] Building ApacheDS Protocol Dns
[INFO]    task-segment: [clean, deploy]
[INFO] ------------------------------------------------------------------------
[INFO] [clean:clean {execution: default-clean}]
[INFO] Deleting <https://hudson.apache.org/hudson/job/dir-apacheds-jdk15-ubuntu-deploy/ws/trunk/protocol-dns/target>
[INFO] [remote-resources:process {execution: default}]
[INFO] [resources:resources {execution: default-resources}]
[INFO] Using 'UTF-8' encoding to copy filtered resources.
[INFO] Copying 0 resource
[INFO] Copying 3 resources
[INFO] [compiler:compile {execution: default-compile}]
[INFO] Compiling 79 source files to <https://hudson.apache.org/hudson/job/dir-apacheds-jdk15-ubuntu-deploy/ws/trunk/protocol-dns/target/classes>
[INFO] [resources:testResources {execution: default-testResources}]
[INFO] Using 'UTF-8' encoding to copy filtered resources.
[INFO] Copying 7 resources
[INFO] Copying 3 resources
[INFO] [compiler:testCompile {execution: default-testCompile}]
[INFO] Compiling 16 source files to <https://hudson.apache.org/hudson/job/dir-apacheds-jdk15-ubuntu-deploy/ws/trunk/protocol-dns/target/test-classes>
[INFO] [surefire:test {execution: default-test}]
[INFO] Surefire report directory: <https://hudson.apache.org/hudson/job/dir-apacheds-jdk15-ubuntu-deploy/ws/trunk/protocol-dns/target/surefire-reports>

-------------------------------------------------------
 T E S T S
-------------------------------------------------------
Running org.apache.directory.server.dns.io.encoder.TextRecordEncoderTest
Tests run: 1, Failures: 0, Errors: 0, Skipped: 0, Time elapsed: 0.089 sec
Running org.apache.directory.server.dns.io.encoder.MailExchangeRecordEncoderTest
Tests run: 1, Failures: 0, Errors: 0, Skipped: 0, Time elapsed: 0.007 sec
Running org.apache.directory.server.dns.messages.RecordClassTest
Tests run: 1, Failures: 0, Errors: 0, Skipped: 0, Time elapsed: 0.005 sec
Running org.apache.directory.server.dns.io.encoder.QuestionRecordEncoderTest
Tests run: 1, Failures: 0, Errors: 0, Skipped: 0, Time elapsed: 0.005 sec
Running org.apache.directory.server.dns.io.encoder.NameServerRecordEncoderTest
Tests run: 1, Failures: 0, Errors: 0, Skipped: 0, Time elapsed: 0.004 sec
Running org.apache.directory.server.dns.io.encoder.PointerRecordEncoderTest
Tests run: 1, Failures: 0, Errors: 0, Skipped: 0, Time elapsed: 0.005 sec
Running org.apache.directory.server.dns.io.decoder.NameServerRecordDecoderTest
Tests run: 1, Failures: 0, Errors: 0, Skipped: 0, Time elapsed: 0.007 sec
Running org.apache.directory.server.dns.io.encoder.CanonicalNameRecordEncoderTest
Tests run: 1, Failures: 0, Errors: 0, Skipped: 0, Time elapsed: 0.004 sec
Running org.apache.directory.server.dns.io.encoder.AddressRecordEncoderTest
Tests run: 1, Failures: 0, Errors: 0, Skipped: 0, Time elapsed: 0.006 sec
Running org.apache.directory.server.dns.io.decoder.MailExchangeRecordDecoderTest
Tests run: 1, Failures: 0, Errors: 0, Skipped: 0, Time elapsed: 0.004 sec
Running org.apache.directory.server.dns.io.encoder.ServerSelectionRecordEncoderTest
Tests run: 1, Failures: 0, Errors: 0, Skipped: 0, Time elapsed: 0.005 sec
Running org.apache.directory.server.dns.io.decoder.AddressRecordDecoderTest
Tests run: 1, Failures: 0, Errors: 0, Skipped: 0, Time elapsed: 0.003 sec
Running org.apache.directory.server.dns.io.encoder.StartOfAuthorityRecordEncoderTest
Tests run: 1, Failures: 0, Errors: 0, Skipped: 0, Time elapsed: 0.005 sec
Running org.apache.directory.server.dns.io.decoder.IPv6RecordDecoderTest
Tests run: 1, Failures: 0, Errors: 0, Skipped: 0, Time elapsed: 0.003 sec

Results :

Tests run: 14, Failures: 0, Errors: 0, Skipped: 0

[HUDSON] Recording test results
[INFO] [jar:jar {execution: default-jar}]
[INFO] Building jar: <https://hudson.apache.org/hudson/job/dir-apacheds-jdk15-ubuntu-deploy/ws/trunk/protocol-dns/target/apacheds-protocol-dns-1.5.8-SNAPSHOT.jar>
[INFO] [tools:verify-legal-files {execution: verify-legal-files}]
[INFO] Checking legal files in: apacheds-protocol-dns-1.5.8-SNAPSHOT.jar
[INFO] Preparing source:jar
[WARNING] Removing: jar from forked lifecycle, to prevent recursive invocation.
[INFO] No goals needed for project - skipping
[INFO] [source:jar {execution: attach-sources}]
[INFO] META-INF already added, skipping
[INFO] META-INF already added, skipping
[INFO] META-INF/NOTICE already added, skipping
[INFO] META-INF/DEPENDENCIES already added, skipping
[INFO] META-INF/LICENSE already added, skipping
[INFO] Building jar: <https://hudson.apache.org/hudson/job/dir-apacheds-jdk15-ubuntu-deploy/ws/trunk/protocol-dns/target/apacheds-protocol-dns-1.5.8-SNAPSHOT-sources.jar>
[INFO] META-INF already added, skipping
[INFO] META-INF already added, skipping
[INFO] META-INF/NOTICE already added, skipping
[INFO] META-INF/DEPENDENCIES already added, skipping
[INFO] META-INF/LICENSE already added, skipping
[INFO] [install:install {execution: default-install}]
[INFO] Installing <https://hudson.apache.org/hudson/job/dir-apacheds-jdk15-ubuntu-deploy/ws/trunk/protocol-dns/target/apacheds-protocol-dns-1.5.8-SNAPSHOT.jar>
to /home/hudson/.m2/repository/org/apache/directory/server/apacheds-protocol-dns/1.5.8-SNAPSHOT/apacheds-protocol-dns-1.5.8-SNAPSHOT.jar
[INFO] Installing <https://hudson.apache.org/hudson/job/dir-apacheds-jdk15-ubuntu-deploy/ws/trunk/protocol-dns/target/apacheds-protocol-dns-1.5.8-SNAPSHOT-sources.jar>
to /home/hudson/.m2/repository/org/apache/directory/server/apacheds-protocol-dns/1.5.8-SNAPSHOT/apacheds-protocol-dns-1.5.8-SNAPSHOT-sources.jar
[INFO] [deploy:deploy {execution: default-deploy}]
[INFO] Retrieving previous build number from apache.snapshots.https
Uploading: https://repository.apache.org/content/repositories/snapshots/org/apache/directory/server/apacheds-protocol-dns/1.5.8-SNAPSHOT/apacheds-protocol-dns-1.5.8-20101012.040302-40.jar
88K uploaded  (apacheds-protocol-dns-1.5.8-20101012.040302-40.jar)
[INFO] Retrieving previous metadata from apache.snapshots.https
[INFO] Uploading repository metadata for: 'snapshot org.apache.directory.server:apacheds-protocol-dns:1.5.8-SNAPSHOT'
[INFO] Retrieving previous metadata from apache.snapshots.https
[INFO] Uploading repository metadata for: 'artifact org.apache.directory.server:apacheds-protocol-dns'
[INFO] Uploading project information for apacheds-protocol-dns 1.5.8-20101012.040302-40
[INFO] Retrieving previous build number from apache.snapshots.https
Uploading: https://repository.apache.org/content/repositories/snapshots/org/apache/directory/server/apacheds-protocol-dns/1.5.8-SNAPSHOT/apacheds-protocol-dns-1.5.8-20101012.040302-40-sources.jar
116K uploaded  (apacheds-protocol-dns-1.5.8-20101012.040302-40-sources.jar)
[HUDSON] Archiving <https://hudson.apache.org/hudson/job/dir-apacheds-jdk15-ubuntu-deploy/ws/trunk/protocol-dns/pom.xml>
to /home/hudson/hudson/jobs/dir-apacheds-jdk15-ubuntu-deploy/modules/org.apache.directory.server$apacheds-protocol-dns/builds/2010-10-12_04-02-40/archive/org.apache.directory.server/apacheds-protocol-dns/1.5.8-SNAPSHOT/pom.xml
[HUDSON] Archiving <https://hudson.apache.org/hudson/job/dir-apacheds-jdk15-ubuntu-deploy/ws/trunk/protocol-dns/target/apacheds-protocol-dns-1.5.8-SNAPSHOT.jar>
to /home/hudson/hudson/jobs/dir-apacheds-jdk15-ubuntu-deploy/modules/org.apache.directory.server$apacheds-protocol-dns/builds/2010-10-12_04-02-40/archive/org.apache.directory.server/apacheds-protocol-dns/1.5.8-20101012.040302-40/apacheds-protocol-dns-1.5.8-SNAPSHOT.jar
[HUDSON] Archiving <https://hudson.apache.org/hudson/job/dir-apacheds-jdk15-ubuntu-deploy/ws/trunk/protocol-dns/target/apacheds-protocol-dns-1.5.8-SNAPSHOT-sources.jar>
to /home/hudson/hudson/jobs/dir-apacheds-jdk15-ubuntu-deploy/modules/org.apache.directory.server$apacheds-protocol-dns/builds/2010-10-12_04-02-40/archive/org.apache.directory.server/apacheds-protocol-dns/1.5.8-20101012.040302-40/apacheds-protocol-dns-1.5.8-SNAPSHOT-sources.jar
[INFO] ------------------------------------------------------------------------
[INFO] Building ApacheDS Protocol Kerberos
[INFO]    task-segment: [clean, deploy]
[INFO] ------------------------------------------------------------------------
[INFO] [clean:clean {execution: default-clean}]
[INFO] Deleting <https://hudson.apache.org/hudson/job/dir-apacheds-jdk15-ubuntu-deploy/ws/trunk/protocol-kerberos/target>
[INFO] [remote-resources:process {execution: default}]
[INFO] [resources:resources {execution: default-resources}]
[INFO] Using 'UTF-8' encoding to copy filtered resources.
[INFO] Copying 0 resource
[INFO] Copying 3 resources
[INFO] [compiler:compile {execution: default-compile}]
[INFO] Compiling 23 source files to <https://hudson.apache.org/hudson/job/dir-apacheds-jdk15-ubuntu-deploy/ws/trunk/protocol-kerberos/target/classes>
[INFO] [resources:testResources {execution: default-testResources}]
[INFO] Using 'UTF-8' encoding to copy filtered resources.
[INFO] Copying 2 resources
[INFO] Copying 3 resources
[INFO] [compiler:testCompile {execution: default-testCompile}]
[INFO] Compiling 12 source files to <https://hudson.apache.org/hudson/job/dir-apacheds-jdk15-ubuntu-deploy/ws/trunk/protocol-kerberos/target/test-classes>
[INFO] [surefire:test {execution: default-test}]
[INFO] Surefire report directory: <https://hudson.apache.org/hudson/job/dir-apacheds-jdk15-ubuntu-deploy/ws/trunk/protocol-kerberos/target/surefire-reports>

-------------------------------------------------------
 T E S T S
-------------------------------------------------------
Running org.apache.directory.server.kerberos.protocol.AuthenticationPolicyTest
Tests run: 7, Failures: 0, Errors: 0, Skipped: 0, Time elapsed: 0.657 sec
Running org.apache.directory.server.kerberos.protocol.AuthenticationEncryptionTypeTest
Tests run: 4, Failures: 0, Errors: 0, Skipped: 0, Time elapsed: 0.12 sec
Running org.apache.directory.server.kerberos.messages.value.OptionsTest
Tests run: 3, Failures: 0, Errors: 0, Skipped: 0, Time elapsed: 0.019 sec
Running org.apache.directory.server.kerberos.protocol.AuthenticationServiceTest
Tests run: 30, Failures: 0, Errors: 0, Skipped: 0, Time elapsed: 0.099 sec
Running org.apache.directory.server.kerberos.protocol.TicketGrantingEncryptionTypeTest
Tests run: 6, Failures: 0, Errors: 0, Skipped: 0, Time elapsed: 0.157 sec
Running org.apache.directory.server.kerberos.protocol.TicketGrantingServiceTest
Tests run: 37, Failures: 0, Errors: 0, Skipped: 0, Time elapsed: 0.19 sec
Running org.apache.directory.server.kerberos.protocol.EncTktInSkeyTest
Tests run: 1, Failures: 0, Errors: 0, Skipped: 0, Time elapsed: 0.007 sec
Running org.apache.directory.server.kerberos.protocol.TicketGrantingPolicyTest
Tests run: 12, Failures: 0, Errors: 0, Skipped: 0, Time elapsed: 0.055 sec
Running org.apache.directory.server.kerberos.protocol.PreAuthenticationTest
Tests run: 4, Failures: 0, Errors: 0, Skipped: 0, Time elapsed: 0.009 sec

Results :

Tests run: 104, Failures: 0, Errors: 0, Skipped: 0

[HUDSON] Recording test results
[INFO] [jar:jar {execution: default-jar}]
[INFO] Building jar: <https://hudson.apache.org/hudson/job/dir-apacheds-jdk15-ubuntu-deploy/ws/trunk/protocol-kerberos/target/apacheds-protocol-kerberos-1.5.8-SNAPSHOT.jar>
[INFO] [tools:verify-legal-files {execution: verify-legal-files}]
[INFO] Checking legal files in: apacheds-protocol-kerberos-1.5.8-SNAPSHOT.jar
[INFO] Preparing source:jar
[WARNING] Removing: jar from forked lifecycle, to prevent recursive invocation.
[INFO] No goals needed for project - skipping
[INFO] [source:jar {execution: attach-sources}]
[INFO] META-INF already added, skipping
[INFO] META-INF already added, skipping
[INFO] META-INF/NOTICE already added, skipping
[INFO] META-INF/DEPENDENCIES already added, skipping
[INFO] META-INF/LICENSE already added, skipping
[INFO] Building jar: <https://hudson.apache.org/hudson/job/dir-apacheds-jdk15-ubuntu-deploy/ws/trunk/protocol-kerberos/target/apacheds-protocol-kerberos-1.5.8-SNAPSHOT-sources.jar>
[INFO] META-INF already added, skipping
[INFO] META-INF already added, skipping
[INFO] META-INF/NOTICE already added, skipping
[INFO] META-INF/DEPENDENCIES already added, skipping
[INFO] META-INF/LICENSE already added, skipping
[INFO] [install:install {execution: default-install}]
[INFO] Installing <https://hudson.apache.org/hudson/job/dir-apacheds-jdk15-ubuntu-deploy/ws/trunk/protocol-kerberos/target/apacheds-protocol-kerberos-1.5.8-SNAPSHOT.jar>
to /home/hudson/.m2/repository/org/apache/directory/server/apacheds-protocol-kerberos/1.5.8-SNAPSHOT/apacheds-protocol-kerberos-1.5.8-SNAPSHOT.jar
[INFO] Installing <https://hudson.apache.org/hudson/job/dir-apacheds-jdk15-ubuntu-deploy/ws/trunk/protocol-kerberos/target/apacheds-protocol-kerberos-1.5.8-SNAPSHOT-sources.jar>
to /home/hudson/.m2/repository/org/apache/directory/server/apacheds-protocol-kerberos/1.5.8-SNAPSHOT/apacheds-protocol-kerberos-1.5.8-SNAPSHOT-sources.jar
[INFO] [deploy:deploy {execution: default-deploy}]
[INFO] Retrieving previous build number from apache.snapshots.https
Uploading: https://repository.apache.org/content/repositories/snapshots/org/apache/directory/server/apacheds-protocol-kerberos/1.5.8-SNAPSHOT/apacheds-protocol-kerberos-1.5.8-20101012.040302-40.jar
51K uploaded  (apacheds-protocol-kerberos-1.5.8-20101012.040302-40.jar)
[INFO] Retrieving previous metadata from apache.snapshots.https
[INFO] Uploading repository metadata for: 'snapshot org.apache.directory.server:apacheds-protocol-kerberos:1.5.8-SNAPSHOT'
[INFO] Uploading project information for apacheds-protocol-kerberos 1.5.8-20101012.040302-40
[INFO] Retrieving previous metadata from apache.snapshots.https
[INFO] Uploading repository metadata for: 'artifact org.apache.directory.server:apacheds-protocol-kerberos'
[INFO] Retrieving previous build number from apache.snapshots.https
Uploading: https://repository.apache.org/content/repositories/snapshots/org/apache/directory/server/apacheds-protocol-kerberos/1.5.8-SNAPSHOT/apacheds-protocol-kerberos-1.5.8-20101012.040302-40-sources.jar
48K uploaded  (apacheds-protocol-kerberos-1.5.8-20101012.040302-40-sources.jar)
[HUDSON] Archiving <https://hudson.apache.org/hudson/job/dir-apacheds-jdk15-ubuntu-deploy/ws/trunk/protocol-kerberos/pom.xml>
to /home/hudson/hudson/jobs/dir-apacheds-jdk15-ubuntu-deploy/modules/org.apache.directory.server$apacheds-protocol-kerberos/builds/2010-10-12_04-02-40/archive/org.apache.directory.server/apacheds-protocol-kerberos/1.5.8-SNAPSHOT/pom.xml
[HUDSON] Archiving <https://hudson.apache.org/hudson/job/dir-apacheds-jdk15-ubuntu-deploy/ws/trunk/protocol-kerberos/target/apacheds-protocol-kerberos-1.5.8-SNAPSHOT.jar>
to /home/hudson/hudson/jobs/dir-apacheds-jdk15-ubuntu-deploy/modules/org.apache.directory.server$apacheds-protocol-kerberos/builds/2010-10-12_04-02-40/archive/org.apache.directory.server/apacheds-protocol-kerberos/1.5.8-20101012.040302-40/apacheds-protocol-kerberos-1.5.8-SNAPSHOT.jar
[HUDSON] Archiving <https://hudson.apache.org/hudson/job/dir-apacheds-jdk15-ubuntu-deploy/ws/trunk/protocol-kerberos/target/apacheds-protocol-kerberos-1.5.8-SNAPSHOT-sources.jar>
to /home/hudson/hudson/jobs/dir-apacheds-jdk15-ubuntu-deploy/modules/org.apache.directory.server$apacheds-protocol-kerberos/builds/2010-10-12_04-02-40/archive/org.apache.directory.server/apacheds-protocol-kerberos/1.5.8-20101012.040302-40/apacheds-protocol-kerberos-1.5.8-SNAPSHOT-sources.jar
[INFO] ------------------------------------------------------------------------
[INFO] Building ApacheDS Protocol Ldap
[INFO]    task-segment: [clean, deploy]
[INFO] ------------------------------------------------------------------------
[INFO] [clean:clean {execution: default-clean}]
[INFO] Deleting <https://hudson.apache.org/hudson/job/dir-apacheds-jdk15-ubuntu-deploy/ws/trunk/protocol-ldap/target>
[INFO] [remote-resources:process {execution: default}]
[INFO] [resources:resources {execution: default-resources}]
[INFO] Using 'UTF-8' encoding to copy filtered resources.
[INFO] Copying 0 resource
[INFO] Copying 3 resources
[INFO] [compiler:compile {execution: default-compile}]
[INFO] Compiling 63 source files to <https://hudson.apache.org/hudson/job/dir-apacheds-jdk15-ubuntu-deploy/ws/trunk/protocol-ldap/target/classes>
[INFO] -------------------------------------------------------------
[ERROR] COMPILATION ERROR : 
[INFO] -------------------------------------------------------------
[ERROR] <https://hudson.apache.org/hudson/job/dir-apacheds-jdk15-ubuntu-deploy/ws/trunk/protocol-ldap/src/main/java/org/apache/directory/server/ldap/handlers/SearchHandler.java>:[889,39]
cannot find symbol
symbol  : method isPasswordHidden()
location: interface org.apache.directory.server.core.DirectoryService
[ERROR] <https://hudson.apache.org/hudson/job/dir-apacheds-jdk15-ubuntu-deploy/ws/trunk/protocol-ldap/src/main/java/org/apache/directory/server/ldap/replication/SyncReplProvider.java>:[660,39]
cannot find symbol
symbol  : method isPasswordHidden()
location: interface org.apache.directory.server.core.DirectoryService
[INFO] 2 errors 
[INFO] -------------------------------------------------------------
[HUDSON] Archiving <https://hudson.apache.org/hudson/job/dir-apacheds-jdk15-ubuntu-deploy/ws/trunk/protocol-ldap/pom.xml>
to /home/hudson/hudson/jobs/dir-apacheds-jdk15-ubuntu-deploy/modules/org.apache.directory.server$apacheds-protocol-ldap/builds/2010-10-12_04-02-40/archive/org.apache.directory.server/apacheds-protocol-ldap/1.5.8-SNAPSHOT/pom.xml
[INFO] ------------------------------------------------------------------------
[ERROR] BUILD FAILURE
[INFO] ------------------------------------------------------------------------
[INFO] Compilation failure

<https://hudson.apache.org/hudson/job/dir-apacheds-jdk15-ubuntu-deploy/ws/trunk/protocol-ldap/src/main/java/org/apache/directory/server/ldap/handlers/SearchHandler.java>:[889,39]
cannot find symbol
symbol  : method isPasswordHidden()
location: interface org.apache.directory.server.core.DirectoryService
<https://hudson.apache.org/hudson/job/dir-apacheds-jdk15-ubuntu-deploy/ws/trunk/protocol-ldap/src/main/java/org/apache/directory/server/ldap/replication/SyncReplProvider.java>:[660,39]
cannot find symbol
symbol  : method isPasswordHidden()
location: interface org.apache.directory.server.core.DirectoryService

[INFO] ------------------------------------------------------------------------
[INFO] For more information, run Maven with the -e switch
[INFO] ------------------------------------------------------------------------
[INFO] Total time: 10 minutes 1 second
[INFO] Finished at: Tue Oct 12 04:12:51 UTC 2010
[INFO] Final Memory: 59M/114M
[INFO] ------------------------------------------------------------------------
Sending e-mails to: notifications@directory.apache.org
Sending e-mails to: notifications@directory.apache.org
channel stopped


Mime
View raw message