directory-notifications mailing list archives

Site index · List index
Message view « Date » · « Thread »
Top « Date » · « Thread »
From Continuum VMBuild Server <contin...@vm094.oxylos.org>
Subject [continuum] BUILD SUCCESSFUL: Default Project Group - Apache Directory Studio Plugin - Build Def: Build and deploy the site for studio-plugin
Date Wed, 18 Feb 2009 01:09:11 GMT
Online report : http://vm094.oxylos.org/continuum/buildResult.action?buildId=3351&projectId=31

Build statistics:
  State: Ok
  Previous State: Error
  Started at: Tue 17 Feb 2009 20:08:20 -0500
  Finished at: Tue 17 Feb 2009 20:09:06 -0500
  Total time: 45s
  Build Trigger: Schedule
  Build Number: 34
  Exit code: 0
  Building machine hostname: vm094.oxylos.org
  Operating system : Linux(unknown)
  Java Home version : 
          java version "1.6.0_06"
          Java(TM) SE Runtime Environment (build 1.6.0_06-b02)
          Java HotSpot(TM) Client VM (build 10.0-b22, mixed mode, sharing)
        
  Builder version :
          Maven version: 2.0.9
          Java version: 1.6.0_06
          OS name: "linux" version: "2.6.18-92.1.10.el5" arch: "i386" Family: "unix"
    
****************************************************************************
SCM Changes:
****************************************************************************
No files changed

****************************************************************************
Dependencies Changes:
****************************************************************************
No dependencies changed


****************************************************************************
Build Defintion:
****************************************************************************
POM filename: pom.xml
Goals: clean site-deploy   
Arguments: --batch-mode
Build Fresh: false
Always Build: false
Default Build Definition: false
Schedule: DAILY_AFTERNOON
Description: Build and deploy the site for studio-plugin

****************************************************************************
Test Summary:
****************************************************************************
Tests: 0
Failures: 0
Total time: 0.0


****************************************************************************
Output:
****************************************************************************
[INFO] Scanning for projects...
[INFO] ------------------------------------------------------------------------
[INFO] Building Apache Directory Studio Plugin
[INFO]    task-segment: [clean, site-deploy]
[INFO] ------------------------------------------------------------------------
[INFO] [clean:clean]
[INFO] Deleting directory /home/continuum/continuum-1.1/apps/continuum/webapp/WEB-INF/working-directory/31/target
[INFO] Setting property: classpath.resource.loader.class => 'org.codehaus.plexus.velocity.ContextClassLoaderResourceLoader'.
[INFO] Setting property: velocimacro.messages.on => 'false'.
[INFO] Setting property: resource.loader => 'classpath'.
[INFO] Setting property: resource.manager.logwhenfound => 'false'.
[INFO] ************************************************************** 
[INFO] Starting Jakarta Velocity v1.4
[INFO] RuntimeInstance initializing.
[INFO] Default Properties File: org/apache/velocity/runtime/defaults/velocity.properties
[INFO] Default ResourceManager initializing. (class org.apache.velocity.runtime.resource.ResourceManagerImpl)
[INFO] Resource Loader Instantiated: org.codehaus.plexus.velocity.ContextClassLoaderResourceLoader
[INFO] ClasspathResourceLoader : initialization starting.
[INFO] ClasspathResourceLoader : initialization complete.
[INFO] ResourceCache : initialized. (class org.apache.velocity.runtime.resource.ResourceCacheImpl)
[INFO] Default ResourceManager initialization complete.
[INFO] Loaded System Directive: org.apache.velocity.runtime.directive.Literal
[INFO] Loaded System Directive: org.apache.velocity.runtime.directive.Macro
[INFO] Loaded System Directive: org.apache.velocity.runtime.directive.Parse
[INFO] Loaded System Directive: org.apache.velocity.runtime.directive.Include
[INFO] Loaded System Directive: org.apache.velocity.runtime.directive.Foreach
[INFO] Created: 20 parsers.
[INFO] Velocimacro : initialization starting.
[INFO] Velocimacro : adding VMs from VM library template : VM_global_library.vm
[ERROR] ResourceManager : unable to find resource 'VM_global_library.vm' in any resource loader.
[INFO] Velocimacro : error using  VM library template VM_global_library.vm : org.apache.velocity.exception.ResourceNotFoundException: Unable to find resource 'VM_global_library.vm'
[INFO] Velocimacro :  VM library template macro registration complete.
[INFO] Velocimacro : allowInline = true : VMs can be defined inline in templates
[INFO] Velocimacro : allowInlineToOverride = false : VMs defined inline may NOT replace previous VM definitions
[INFO] Velocimacro : allowInlineLocal = false : VMs defined inline will be  global in scope if allowed.
[INFO] Velocimacro : initialization complete.
[INFO] Velocity successfully started.
[INFO] Setting property: classpath.resource.loader.class => 'org.codehaus.plexus.velocity.ContextClassLoaderResourceLoader'.
[INFO] Setting property: velocimacro.messages.on => 'false'.
[INFO] Setting property: resource.loader => 'classpath'.
[INFO] Setting property: resource.manager.logwhenfound => 'false'.
[INFO] Preparing javadoc:javadoc
[INFO] No goals needed for project - skipping
[INFO] Preparing javadoc:test-aggregate
[INFO] ------------------------------------------------------------------------
[INFO] Building Apache Directory Studio Plugin
[INFO] ------------------------------------------------------------------------
[INFO] [plugin:descriptor]
[INFO] Using 2 extractors.
[INFO] Applying extractor for language: java
[INFO] Extractor for language: java found 6 mojo descriptors.
[INFO] Applying extractor for language: bsh
[INFO] Extractor for language: bsh found 0 mojo descriptors.
[INFO] Setting property: classpath.resource.loader.class => 'org.codehaus.plexus.velocity.ContextClassLoaderResourceLoader'.
[INFO] Setting property: velocimacro.messages.on => 'false'.
[INFO] Setting property: resource.loader => 'classpath'.
[INFO] Setting property: resource.manager.logwhenfound => 'false'.
[INFO] [remote-resources:process {execution: default}]
[INFO] [resources:resources]
[INFO] Using default encoding to copy filtered resources.
[INFO] [compiler:compile]
[INFO] Compiling 8 source files to /home/continuum/continuum-1.1/apps/continuum/webapp/WEB-INF/working-directory/31/target/classes
[INFO] Preparing javadoc:aggregate
[INFO] ------------------------------------------------------------------------
[INFO] Building Apache Directory Studio Plugin
[INFO] ------------------------------------------------------------------------
[INFO] No goals needed for project - skipping
[INFO] Preparing javadoc:test-javadoc
[INFO] [plugin:descriptor]
[INFO] Using 2 extractors.
[INFO] Applying extractor for language: java
[INFO] Extractor for language: java found 6 mojo descriptors.
[INFO] Applying extractor for language: bsh
[INFO] Extractor for language: bsh found 0 mojo descriptors.
[INFO] [remote-resources:process {execution: default}]
[INFO] [resources:resources]
[INFO] Using default encoding to copy filtered resources.
[INFO] [compiler:compile]
[INFO] Nothing to compile - all classes are up to date
[INFO] Preparing plugin:report
[INFO] [plugin:descriptor]
[INFO] Using 2 extractors.
[INFO] Applying extractor for language: java
[INFO] Extractor for language: java found 6 mojo descriptors.
[INFO] Applying extractor for language: bsh
[INFO] Extractor for language: bsh found 0 mojo descriptors.
[INFO] [remote-resources:process {execution: default}]
[INFO] [resources:resources]
[INFO] Using default encoding to copy filtered resources.
[INFO] [compiler:compile]
[INFO] Nothing to compile - all classes are up to date
[INFO] Preparing surefire-report:report
[INFO] [plugin:descriptor]
[INFO] Using 2 extractors.
[INFO] Applying extractor for language: java
[INFO] Extractor for language: java found 6 mojo descriptors.
[INFO] Applying extractor for language: bsh
[INFO] Extractor for language: bsh found 0 mojo descriptors.
[INFO] [remote-resources:process {execution: default}]
[INFO] [resources:resources]
[INFO] Using default encoding to copy filtered resources.
[INFO] [compiler:compile]
[INFO] Nothing to compile - all classes are up to date
[INFO] [resources:testResources]
[INFO] Using default encoding to copy filtered resources.
[INFO] [compiler:testCompile]
[INFO] Compiling 6 source files to /home/continuum/continuum-1.1/apps/continuum/webapp/WEB-INF/working-directory/31/target/test-classes
[INFO] [surefire:test]
[INFO] Surefire report directory: /home/continuum/continuum-1.1/apps/continuum/webapp/WEB-INF/working-directory/31/target/surefire-reports

-------------------------------------------------------
 T E S T S
-------------------------------------------------------
There are no tests to run.

Results :

Tests run: 0, Failures: 0, Errors: 0, Skipped: 0

[INFO] Preparing surefire-report:report-only
[INFO] No goals needed for project - skipping
[INFO] Preparing cobertura:cobertura
[INFO] [plugin:descriptor]
[INFO] Using 2 extractors.
[INFO] Applying extractor for language: java
[INFO] Extractor for language: java found 6 mojo descriptors.
[INFO] Applying extractor for language: bsh
[INFO] Extractor for language: bsh found 0 mojo descriptors.
[INFO] [remote-resources:process {execution: default}]
[INFO] [resources:resources]
[INFO] Using default encoding to copy filtered resources.
[INFO] [compiler:compile]
[INFO] Nothing to compile - all classes are up to date
[INFO] [cobertura:instrument]
[INFO] Cobertura 1.9 - GNU GPL License (NO WARRANTY) - See COPYRIGHT file
Instrumenting 9 files to /home/continuum/continuum-1.1/apps/continuum/webapp/WEB-INF/working-directory/31/target/generated-classes/cobertura
Cobertura: Saved information on 9 classes.
Instrument time: 212ms

[INFO] Instrumentation was successful.
[INFO] [resources:testResources]
[INFO] Using default encoding to copy filtered resources.
[INFO] [compiler:testCompile]
[INFO] Nothing to compile - all classes are up to date
[INFO] [surefire:test]
[INFO] Surefire report directory: /home/continuum/continuum-1.1/apps/continuum/webapp/WEB-INF/working-directory/31/target/surefire-reports

-------------------------------------------------------
 T E S T S
-------------------------------------------------------
There are no tests to run.

Results :

Tests run: 0, Failures: 0, Errors: 0, Skipped: 0

[INFO] [site:site]
[INFO] Unable to load parent project from a relative path: Could not find the model file '/home/continuum/continuum-1.1/apps/continuum/webapp/WEB-INF/working-directory/pom.xml'. for project unknown
[INFO] Parent project loaded from repository.
[INFO] Parent project loaded from repository.
[INFO] snapshot org.apache.directory.skins:studio-skin:1.0.0-SNAPSHOT: checking for updates from apache.snapshots
[INFO] Skipped "About" report, file "index.html" already exists for the English version.
[INFO] Skipped "Surefire Report" report, file "surefire-report.html" already exists for the English version.
[INFO] Generating "Project Team" report.
[INFO] Generating "PMD Report" report.
[INFO] Generating "Continuous Integration" report.
[INFO] Generating "Dependencies" report.
[WARNING] The repository url 'http://snapshots.maven.codehaus.org/maven2' is invalid - Repository 'snapshots' will be blacklisted.
[INFO] Generating "Plugin Management" report.
[INFO] Generating "Mailing Lists" report.
[INFO] Generating "Source Repository" report.
[INFO] Generating "Tag List" report.
[INFO] Generating "Test JavaDocs" report.
Loading source files for package org.apache.directory.studio.maven.plugins...
Loading source files for package org.apache.directory.studio.maven.plugins.stubs...
Constructing Javadoc information...
Standard Doclet version 1.6.0_06
Building tree for all the packages and classes...
Generating /home/continuum/continuum-1.1/apps/continuum/webapp/WEB-INF/working-directory/31/target/site/testapidocs/org/apache/directory/studio/maven/plugins//StudioCleanMojoTest.html...
Generating /home/continuum/continuum-1.1/apps/continuum/webapp/WEB-INF/working-directory/31/target/site/testapidocs/org/apache/directory/studio/maven/plugins//StudioCopyEclipseDependencyMojoTest.html...
Generating /home/continuum/continuum-1.1/apps/continuum/webapp/WEB-INF/working-directory/31/target/site/testapidocs/org/apache/directory/studio/maven/plugins//StudioUnpackPrefixedMojoTest.html...
Generating /home/continuum/continuum-1.1/apps/continuum/webapp/WEB-INF/working-directory/31/target/site/testapidocs/org/apache/directory/studio/maven/plugins/stubs//StudioCleanProjectStub.html...
Generating /home/continuum/continuum-1.1/apps/continuum/webapp/WEB-INF/working-directory/31/target/site/testapidocs/org/apache/directory/studio/maven/plugins/stubs//StudioCopyEclipseDependencyProjectStub.html...
Generating /home/continuum/continuum-1.1/apps/continuum/webapp/WEB-INF/working-directory/31/target/site/testapidocs/org/apache/directory/studio/maven/plugins/stubs//StudioUnpackPrefixedProjectStub.html...
Generating /home/continuum/continuum-1.1/apps/continuum/webapp/WEB-INF/working-directory/31/target/site/testapidocs/overview-frame.html...
Generating /home/continuum/continuum-1.1/apps/continuum/webapp/WEB-INF/working-directory/31/target/site/testapidocs/org/apache/directory/studio/maven/plugins//package-frame.html...
Generating /home/continuum/continuum-1.1/apps/continuum/webapp/WEB-INF/working-directory/31/target/site/testapidocs/org/apache/directory/studio/maven/plugins//package-summary.html...
Generating /home/continuum/continuum-1.1/apps/continuum/webapp/WEB-INF/working-directory/31/target/site/testapidocs/org/apache/directory/studio/maven/plugins//package-tree.html...
Generating /home/continuum/continuum-1.1/apps/continuum/webapp/WEB-INF/working-directory/31/target/site/testapidocs/org/apache/directory/studio/maven/plugins/stubs//package-frame.html...
Generating /home/continuum/continuum-1.1/apps/continuum/webapp/WEB-INF/working-directory/31/target/site/testapidocs/org/apache/directory/studio/maven/plugins/stubs//package-summary.html...
Generating /home/continuum/continuum-1.1/apps/continuum/webapp/WEB-INF/working-directory/31/target/site/testapidocs/org/apache/directory/studio/maven/plugins/stubs//package-tree.html...
Generating /home/continuum/continuum-1.1/apps/continuum/webapp/WEB-INF/working-directory/31/target/site/testapidocs/constant-values.html...
Generating /home/continuum/continuum-1.1/apps/continuum/webapp/WEB-INF/working-directory/31/target/site/testapidocs/org/apache/directory/studio/maven/plugins//class-use/StudioCleanMojoTest.html...
Generating /home/continuum/continuum-1.1/apps/continuum/webapp/WEB-INF/working-directory/31/target/site/testapidocs/org/apache/directory/studio/maven/plugins//class-use/StudioUnpackPrefixedMojoTest.html...
Generating /home/continuum/continuum-1.1/apps/continuum/webapp/WEB-INF/working-directory/31/target/site/testapidocs/org/apache/directory/studio/maven/plugins//class-use/StudioCopyEclipseDependencyMojoTest.html...
Generating /home/continuum/continuum-1.1/apps/continuum/webapp/WEB-INF/working-directory/31/target/site/testapidocs/org/apache/directory/studio/maven/plugins/stubs//class-use/StudioCleanProjectStub.html...
Generating /home/continuum/continuum-1.1/apps/continuum/webapp/WEB-INF/working-directory/31/target/site/testapidocs/org/apache/directory/studio/maven/plugins/stubs//class-use/StudioUnpackPrefixedProjectStub.html...
Generating /home/continuum/continuum-1.1/apps/continuum/webapp/WEB-INF/working-directory/31/target/site/testapidocs/org/apache/directory/studio/maven/plugins/stubs//class-use/StudioCopyEclipseDependencyProjectStub.html...
Generating /home/continuum/continuum-1.1/apps/continuum/webapp/WEB-INF/working-directory/31/target/site/testapidocs/org/apache/directory/studio/maven/plugins//package-use.html...
Generating /home/continuum/continuum-1.1/apps/continuum/webapp/WEB-INF/working-directory/31/target/site/testapidocs/org/apache/directory/studio/maven/plugins/stubs//package-use.html...
Building index for all the packages and classes...
Generating /home/continuum/continuum-1.1/apps/continuum/webapp/WEB-INF/working-directory/31/target/site/testapidocs/overview-tree.html...
Generating /home/continuum/continuum-1.1/apps/continuum/webapp/WEB-INF/working-directory/31/target/site/testapidocs/index-all.html...
Generating /home/continuum/continuum-1.1/apps/continuum/webapp/WEB-INF/working-directory/31/target/site/testapidocs/deprecated-list.html...
Building index for all classes...
Generating /home/continuum/continuum-1.1/apps/continuum/webapp/WEB-INF/working-directory/31/target/site/testapidocs/allclasses-frame.html...
Generating /home/continuum/continuum-1.1/apps/continuum/webapp/WEB-INF/working-directory/31/target/site/testapidocs/allclasses-noframe.html...
Generating /home/continuum/continuum-1.1/apps/continuum/webapp/WEB-INF/working-directory/31/target/site/testapidocs/index.html...
Generating /home/continuum/continuum-1.1/apps/continuum/webapp/WEB-INF/working-directory/31/target/site/testapidocs/overview-summary.html...
Generating /home/continuum/continuum-1.1/apps/continuum/webapp/WEB-INF/working-directory/31/target/site/testapidocs/help-doc.html...
Generating /home/continuum/continuum-1.1/apps/continuum/webapp/WEB-INF/working-directory/31/target/site/testapidocs/stylesheet.css...
[INFO] Generating "JavaDocs" report.
Loading source files for package org.apache.directory.studio.maven.plugins...
Constructing Javadoc information...
Standard Doclet version 1.6.0_06
Building tree for all the packages and classes...
Generating /home/continuum/continuum-1.1/apps/continuum/webapp/WEB-INF/working-directory/31/target/site/apidocs/org/apache/directory/studio/maven/plugins//AbstractStudioMojo.html...
Generating /home/continuum/continuum-1.1/apps/continuum/webapp/WEB-INF/working-directory/31/target/site/apidocs/org/apache/directory/studio/maven/plugins//ArtifactItem.html...
Generating /home/continuum/continuum-1.1/apps/continuum/webapp/WEB-INF/working-directory/31/target/site/apidocs/org/apache/directory/studio/maven/plugins//StudioCleanMojo.html...
Generating /home/continuum/continuum-1.1/apps/continuum/webapp/WEB-INF/working-directory/31/target/site/apidocs/org/apache/directory/studio/maven/plugins//StudioCopyEclipseDependencyMojo.html...
Generating /home/continuum/continuum-1.1/apps/continuum/webapp/WEB-INF/working-directory/31/target/site/apidocs/org/apache/directory/studio/maven/plugins//StudioEclipseMojo.html...
Generating /home/continuum/continuum-1.1/apps/continuum/webapp/WEB-INF/working-directory/31/target/site/apidocs/org/apache/directory/studio/maven/plugins//StudioPrepareJarPackageMojo.html...
Generating /home/continuum/continuum-1.1/apps/continuum/webapp/WEB-INF/working-directory/31/target/site/apidocs/org/apache/directory/studio/maven/plugins//StudioReplaceFileInJarMojo.html...
Generating /home/continuum/continuum-1.1/apps/continuum/webapp/WEB-INF/working-directory/31/target/site/apidocs/org/apache/directory/studio/maven/plugins//StudioUnpackPrefixedMojo.html...
Generating /home/continuum/continuum-1.1/apps/continuum/webapp/WEB-INF/working-directory/31/target/site/apidocs/org/apache/directory/studio/maven/plugins//package-frame.html...
Generating /home/continuum/continuum-1.1/apps/continuum/webapp/WEB-INF/working-directory/31/target/site/apidocs/org/apache/directory/studio/maven/plugins//package-summary.html...
Generating /home/continuum/continuum-1.1/apps/continuum/webapp/WEB-INF/working-directory/31/target/site/apidocs/org/apache/directory/studio/maven/plugins//package-tree.html...
Generating /home/continuum/continuum-1.1/apps/continuum/webapp/WEB-INF/working-directory/31/target/site/apidocs/constant-values.html...
Generating /home/continuum/continuum-1.1/apps/continuum/webapp/WEB-INF/working-directory/31/target/site/apidocs/org/apache/directory/studio/maven/plugins//class-use/StudioPrepareJarPackageMojo.html...
Generating /home/continuum/continuum-1.1/apps/continuum/webapp/WEB-INF/working-directory/31/target/site/apidocs/org/apache/directory/studio/maven/plugins//class-use/AbstractStudioMojo.html...
Generating /home/continuum/continuum-1.1/apps/continuum/webapp/WEB-INF/working-directory/31/target/site/apidocs/org/apache/directory/studio/maven/plugins//class-use/StudioCopyEclipseDependencyMojo.html...
Generating /home/continuum/continuum-1.1/apps/continuum/webapp/WEB-INF/working-directory/31/target/site/apidocs/org/apache/directory/studio/maven/plugins//class-use/ArtifactItem.html...
Generating /home/continuum/continuum-1.1/apps/continuum/webapp/WEB-INF/working-directory/31/target/site/apidocs/org/apache/directory/studio/maven/plugins//class-use/StudioReplaceFileInJarMojo.html...
Generating /home/continuum/continuum-1.1/apps/continuum/webapp/WEB-INF/working-directory/31/target/site/apidocs/org/apache/directory/studio/maven/plugins//class-use/StudioEclipseMojo.html...
Generating /home/continuum/continuum-1.1/apps/continuum/webapp/WEB-INF/working-directory/31/target/site/apidocs/org/apache/directory/studio/maven/plugins//class-use/StudioCleanMojo.html...
Generating /home/continuum/continuum-1.1/apps/continuum/webapp/WEB-INF/working-directory/31/target/site/apidocs/org/apache/directory/studio/maven/plugins//class-use/StudioUnpackPrefixedMojo.html...
Generating /home/continuum/continuum-1.1/apps/continuum/webapp/WEB-INF/working-directory/31/target/site/apidocs/org/apache/directory/studio/maven/plugins//package-use.html...
Building index for all the packages and classes...
Generating /home/continuum/continuum-1.1/apps/continuum/webapp/WEB-INF/working-directory/31/target/site/apidocs/overview-tree.html...
Generating /home/continuum/continuum-1.1/apps/continuum/webapp/WEB-INF/working-directory/31/target/site/apidocs/index-all.html...
Generating /home/continuum/continuum-1.1/apps/continuum/webapp/WEB-INF/working-directory/31/target/site/apidocs/deprecated-list.html...
Building index for all classes...
Generating /home/continuum/continuum-1.1/apps/continuum/webapp/WEB-INF/working-directory/31/target/site/apidocs/allclasses-frame.html...
Generating /home/continuum/continuum-1.1/apps/continuum/webapp/WEB-INF/working-directory/31/target/site/apidocs/allclasses-noframe.html...
Generating /home/continuum/continuum-1.1/apps/continuum/webapp/WEB-INF/working-directory/31/target/site/apidocs/index.html...
Generating /home/continuum/continuum-1.1/apps/continuum/webapp/WEB-INF/working-directory/31/target/site/apidocs/help-doc.html...
Generating /home/continuum/continuum-1.1/apps/continuum/webapp/WEB-INF/working-directory/31/target/site/apidocs/stylesheet.css...
70 warnings
[WARNING] Javadoc Warnings
[WARNING] /home/continuum/continuum-1.1/apps/continuum/webapp/WEB-INF/working-directory/31/src/main/java/org/apache/directory/studio/maven/plugins/AbstractStudioMojo.java:430: warning - @return tag has no arguments.
[WARNING] /home/continuum/continuum-1.1/apps/continuum/webapp/WEB-INF/working-directory/31/src/main/java/org/apache/directory/studio/maven/plugins/AbstractStudioMojo.java:405: warning - @return tag has no arguments.
[WARNING] /home/continuum/continuum-1.1/apps/continuum/webapp/WEB-INF/working-directory/31/src/main/java/org/apache/directory/studio/maven/plugins/AbstractStudioMojo.java:73: warning - @parameter is an unknown tag.
[WARNING] /home/continuum/continuum-1.1/apps/continuum/webapp/WEB-INF/working-directory/31/src/main/java/org/apache/directory/studio/maven/plugins/AbstractStudioMojo.java:73: warning - @required is an unknown tag.
[WARNING] /home/continuum/continuum-1.1/apps/continuum/webapp/WEB-INF/working-directory/31/src/main/java/org/apache/directory/studio/maven/plugins/AbstractStudioMojo.java:73: warning - @readonly is an unknown tag.
[WARNING] /home/continuum/continuum-1.1/apps/continuum/webapp/WEB-INF/working-directory/31/src/main/java/org/apache/directory/studio/maven/plugins/AbstractStudioMojo.java:82: warning - @parameter is an unknown tag.
[WARNING] /home/continuum/continuum-1.1/apps/continuum/webapp/WEB-INF/working-directory/31/src/main/java/org/apache/directory/studio/maven/plugins/AbstractStudioMojo.java:82: warning - @required is an unknown tag.
[WARNING] /home/continuum/continuum-1.1/apps/continuum/webapp/WEB-INF/working-directory/31/src/main/java/org/apache/directory/studio/maven/plugins/AbstractStudioMojo.java:82: warning - @readonly is an unknown tag.
[WARNING] /home/continuum/continuum-1.1/apps/continuum/webapp/WEB-INF/working-directory/31/src/main/java/org/apache/directory/studio/maven/plugins/AbstractStudioMojo.java:91: warning - @parameter is an unknown tag.
[WARNING] /home/continuum/continuum-1.1/apps/continuum/webapp/WEB-INF/working-directory/31/src/main/java/org/apache/directory/studio/maven/plugins/AbstractStudioMojo.java:91: warning - @required is an unknown tag.
[WARNING] /home/continuum/continuum-1.1/apps/continuum/webapp/WEB-INF/working-directory/31/src/main/java/org/apache/directory/studio/maven/plugins/AbstractStudioMojo.java:91: warning - @readonly is an unknown tag.
[WARNING] /home/continuum/continuum-1.1/apps/continuum/webapp/WEB-INF/working-directory/31/src/main/java/org/apache/directory/studio/maven/plugins/AbstractStudioMojo.java:100: warning - @parameter is an unknown tag.
[WARNING] /home/continuum/continuum-1.1/apps/continuum/webapp/WEB-INF/working-directory/31/src/main/java/org/apache/directory/studio/maven/plugins/AbstractStudioMojo.java:100: warning - @required is an unknown tag.
[WARNING] /home/continuum/continuum-1.1/apps/continuum/webapp/WEB-INF/working-directory/31/src/main/java/org/apache/directory/studio/maven/plugins/AbstractStudioMojo.java:100: warning - @readonly is an unknown tag.
[WARNING] /home/continuum/continuum-1.1/apps/continuum/webapp/WEB-INF/working-directory/31/src/main/java/org/apache/directory/studio/maven/plugins/AbstractStudioMojo.java:109: warning - @parameter is an unknown tag.
[WARNING] /home/continuum/continuum-1.1/apps/continuum/webapp/WEB-INF/working-directory/31/src/main/java/org/apache/directory/studio/maven/plugins/AbstractStudioMojo.java:109: warning - @required is an unknown tag.
[WARNING] /home/continuum/continuum-1.1/apps/continuum/webapp/WEB-INF/working-directory/31/src/main/java/org/apache/directory/studio/maven/plugins/AbstractStudioMojo.java:109: warning - @readonly is an unknown tag.
[WARNING] /home/continuum/continuum-1.1/apps/continuum/webapp/WEB-INF/working-directory/31/src/main/java/org/apache/directory/studio/maven/plugins/AbstractStudioMojo.java:118: warning - @component is an unknown tag.
[WARNING] /home/continuum/continuum-1.1/apps/continuum/webapp/WEB-INF/working-directory/31/src/main/java/org/apache/directory/studio/maven/plugins/AbstractStudioMojo.java:118: warning - @required is an unknown tag.
[WARNING] /home/continuum/continuum-1.1/apps/continuum/webapp/WEB-INF/working-directory/31/src/main/java/org/apache/directory/studio/maven/plugins/AbstractStudioMojo.java:118: warning - @readonly is an unknown tag.
[WARNING] /home/continuum/continuum-1.1/apps/continuum/webapp/WEB-INF/working-directory/31/src/main/java/org/apache/directory/studio/maven/plugins/AbstractStudioMojo.java:126: warning - @component is an unknown tag.
[WARNING] /home/continuum/continuum-1.1/apps/continuum/webapp/WEB-INF/working-directory/31/src/main/java/org/apache/directory/studio/maven/plugins/AbstractStudioMojo.java:126: warning - @required is an unknown tag.
[WARNING] /home/continuum/continuum-1.1/apps/continuum/webapp/WEB-INF/working-directory/31/src/main/java/org/apache/directory/studio/maven/plugins/AbstractStudioMojo.java:126: warning - @readonly is an unknown tag.
[WARNING] /home/continuum/continuum-1.1/apps/continuum/webapp/WEB-INF/working-directory/31/src/main/java/org/apache/directory/studio/maven/plugins/AbstractStudioMojo.java:135: warning - @parameter is an unknown tag.
[WARNING] /home/continuum/continuum-1.1/apps/continuum/webapp/WEB-INF/working-directory/31/src/main/java/org/apache/directory/studio/maven/plugins/AbstractStudioMojo.java:135: warning - @readonly is an unknown tag.
[WARNING] /home/continuum/continuum-1.1/apps/continuum/webapp/WEB-INF/working-directory/31/src/main/java/org/apache/directory/studio/maven/plugins/AbstractStudioMojo.java:135: warning - @required is an unknown tag.
[WARNING] /home/continuum/continuum-1.1/apps/continuum/webapp/WEB-INF/working-directory/31/src/main/java/org/apache/directory/studio/maven/plugins/AbstractStudioMojo.java:144: warning - @parameter is an unknown tag.
[WARNING] /home/continuum/continuum-1.1/apps/continuum/webapp/WEB-INF/working-directory/31/src/main/java/org/apache/directory/studio/maven/plugins/AbstractStudioMojo.java:144: warning - @readonly is an unknown tag.
[WARNING] /home/continuum/continuum-1.1/apps/continuum/webapp/WEB-INF/working-directory/31/src/main/java/org/apache/directory/studio/maven/plugins/AbstractStudioMojo.java:144: warning - @required is an unknown tag.
[WARNING] /home/continuum/continuum-1.1/apps/continuum/webapp/WEB-INF/working-directory/31/src/main/java/org/apache/directory/studio/maven/plugins/AbstractStudioMojo.java:153: warning - @parameter is an unknown tag.
[WARNING] /home/continuum/continuum-1.1/apps/continuum/webapp/WEB-INF/working-directory/31/src/main/java/org/apache/directory/studio/maven/plugins/AbstractStudioMojo.java:153: warning - @readonly is an unknown tag.
[WARNING] /home/continuum/continuum-1.1/apps/continuum/webapp/WEB-INF/working-directory/31/src/main/java/org/apache/directory/studio/maven/plugins/AbstractStudioMojo.java:153: warning - @required is an unknown tag.
[WARNING] /home/continuum/continuum-1.1/apps/continuum/webapp/WEB-INF/working-directory/31/src/main/java/org/apache/directory/studio/maven/plugins/AbstractStudioMojo.java:593: warning - @param argument "libraryPath" is not a parameter name.
[WARNING] /home/continuum/continuum-1.1/apps/continuum/webapp/WEB-INF/working-directory/31/src/main/java/org/apache/directory/studio/maven/plugins/ArtifactItem.java:122: warning - @param argument "artifactId" is not a parameter name.
[WARNING] /home/continuum/continuum-1.1/apps/continuum/webapp/WEB-INF/working-directory/31/src/main/java/org/apache/directory/studio/maven/plugins/StudioCleanMojo.java:39: warning - @goal is an unknown tag.
[WARNING] /home/continuum/continuum-1.1/apps/continuum/webapp/WEB-INF/working-directory/31/src/main/java/org/apache/directory/studio/maven/plugins/StudioCleanMojo.java:39: warning - @execute is an unknown tag.
[WARNING] /home/continuum/continuum-1.1/apps/continuum/webapp/WEB-INF/working-directory/31/src/main/java/org/apache/directory/studio/maven/plugins/StudioCleanMojo.java:39: warning - @description is an unknown tag.
[WARNING] /home/continuum/continuum-1.1/apps/continuum/webapp/WEB-INF/working-directory/31/src/main/java/org/apache/directory/studio/maven/plugins/StudioCleanMojo.java:39: warning - @requiresProject is an unknown tag.
[WARNING] /home/continuum/continuum-1.1/apps/continuum/webapp/WEB-INF/working-directory/31/src/main/java/org/apache/directory/studio/maven/plugins/StudioCopyEclipseDependencyMojo.java:48: warning - @goal is an unknown tag.
[WARNING] /home/continuum/continuum-1.1/apps/continuum/webapp/WEB-INF/working-directory/31/src/main/java/org/apache/directory/studio/maven/plugins/StudioCopyEclipseDependencyMojo.java:48: warning - @description is an unknown tag.
[WARNING] /home/continuum/continuum-1.1/apps/continuum/webapp/WEB-INF/working-directory/31/src/main/java/org/apache/directory/studio/maven/plugins/StudioCopyEclipseDependencyMojo.java:48: warning - @requiresProject is an unknown tag.
[WARNING] /home/continuum/continuum-1.1/apps/continuum/webapp/WEB-INF/working-directory/31/src/main/java/org/apache/directory/studio/maven/plugins/StudioCopyEclipseDependencyMojo.java:48: warning - @requiresDependencyResolution is an unknown tag.
[WARNING] /home/continuum/continuum-1.1/apps/continuum/webapp/WEB-INF/working-directory/31/src/main/java/org/apache/directory/studio/maven/plugins/StudioCopyEclipseDependencyMojo.java:60: warning - @parameter is an unknown tag.
[WARNING] /home/continuum/continuum-1.1/apps/continuum/webapp/WEB-INF/working-directory/31/src/main/java/org/apache/directory/studio/maven/plugins/StudioCopyEclipseDependencyMojo.java:60: warning - @required is an unknown tag.
[WARNING] /home/continuum/continuum-1.1/apps/continuum/webapp/WEB-INF/working-directory/31/src/main/java/org/apache/directory/studio/maven/plugins/StudioEclipseMojo.java:65: warning - @goal is an unknown tag.
[WARNING] /home/continuum/continuum-1.1/apps/continuum/webapp/WEB-INF/working-directory/31/src/main/java/org/apache/directory/studio/maven/plugins/StudioEclipseMojo.java:65: warning - @execute is an unknown tag.
[WARNING] /home/continuum/continuum-1.1/apps/continuum/webapp/WEB-INF/working-directory/31/src/main/java/org/apache/directory/studio/maven/plugins/StudioEclipseMojo.java:65: warning - @description is an unknown tag.
[WARNING] /home/continuum/continuum-1.1/apps/continuum/webapp/WEB-INF/working-directory/31/src/main/java/org/apache/directory/studio/maven/plugins/StudioEclipseMojo.java:65: warning - @requiresProject is an unknown tag.
[WARNING] /home/continuum/continuum-1.1/apps/continuum/webapp/WEB-INF/working-directory/31/src/main/java/org/apache/directory/studio/maven/plugins/StudioEclipseMojo.java:65: warning - @requiresDependencyResolution is an unknown tag.
[WARNING] /home/continuum/continuum-1.1/apps/continuum/webapp/WEB-INF/working-directory/31/src/main/java/org/apache/directory/studio/maven/plugins/StudioEclipseMojo.java:90: warning - @parameter is an unknown tag.
[WARNING] /home/continuum/continuum-1.1/apps/continuum/webapp/WEB-INF/working-directory/31/src/main/java/org/apache/directory/studio/maven/plugins/StudioEclipseMojo.java:90: warning - @required is an unknown tag.
[WARNING] /home/continuum/continuum-1.1/apps/continuum/webapp/WEB-INF/working-directory/31/src/main/java/org/apache/directory/studio/maven/plugins/StudioEclipseMojo.java:98: warning - @parameter is an unknown tag.
[WARNING] /home/continuum/continuum-1.1/apps/continuum/webapp/WEB-INF/working-directory/31/src/main/java/org/apache/directory/studio/maven/plugins/StudioPrepareJarPackageMojo.java:47: warning - @goal is an unknown tag.
[WARNING] /home/continuum/continuum-1.1/apps/continuum/webapp/WEB-INF/working-directory/31/src/main/java/org/apache/directory/studio/maven/plugins/StudioPrepareJarPackageMojo.java:47: warning - @phase is an unknown tag.
[WARNING] /home/continuum/continuum-1.1/apps/continuum/webapp/WEB-INF/working-directory/31/src/main/java/org/apache/directory/studio/maven/plugins/StudioPrepareJarPackageMojo.java:47: warning - @aggregate is an unknown tag.
[WARNING] /home/continuum/continuum-1.1/apps/continuum/webapp/WEB-INF/working-directory/31/src/main/java/org/apache/directory/studio/maven/plugins/StudioPrepareJarPackageMojo.java:47: warning - @description is an unknown tag.
[WARNING] /home/continuum/continuum-1.1/apps/continuum/webapp/WEB-INF/working-directory/31/src/main/java/org/apache/directory/studio/maven/plugins/StudioPrepareJarPackageMojo.java:47: warning - @requiresProject is an unknown tag.
[WARNING] /home/continuum/continuum-1.1/apps/continuum/webapp/WEB-INF/working-directory/31/src/main/java/org/apache/directory/studio/maven/plugins/StudioPrepareJarPackageMojo.java:47: warning - @requiresDependencyResolution is an unknown tag.
[WARNING] /home/continuum/continuum-1.1/apps/continuum/webapp/WEB-INF/working-directory/31/src/main/java/org/apache/directory/studio/maven/plugins/StudioReplaceFileInJarMojo.java:45: warning - @goal is an unknown tag.
[WARNING] /home/continuum/continuum-1.1/apps/continuum/webapp/WEB-INF/working-directory/31/src/main/java/org/apache/directory/studio/maven/plugins/StudioReplaceFileInJarMojo.java:45: warning - @description is an unknown tag.
[WARNING] /home/continuum/continuum-1.1/apps/continuum/webapp/WEB-INF/working-directory/31/src/main/java/org/apache/directory/studio/maven/plugins/StudioReplaceFileInJarMojo.java:45: warning - @requiresProject is an unknown tag.
[WARNING] /home/continuum/continuum-1.1/apps/continuum/webapp/WEB-INF/working-directory/31/src/main/java/org/apache/directory/studio/maven/plugins/StudioReplaceFileInJarMojo.java:45: warning - @requiresDependencyResolution is an unknown tag.
[WARNING] /home/continuum/continuum-1.1/apps/continuum/webapp/WEB-INF/working-directory/31/src/main/java/org/apache/directory/studio/maven/plugins/StudioReplaceFileInJarMojo.java:57: warning - @parameter is an unknown tag.
[WARNING] /home/continuum/continuum-1.1/apps/continuum/webapp/WEB-INF/working-directory/31/src/main/java/org/apache/directory/studio/maven/plugins/StudioReplaceFileInJarMojo.java:57: warning - @required is an unknown tag.
[WARNING] /home/continuum/continuum-1.1/apps/continuum/webapp/WEB-INF/working-directory/31/src/main/java/org/apache/directory/studio/maven/plugins/StudioUnpackPrefixedMojo.java:45: warning - @goal is an unknown tag.
[WARNING] /home/continuum/continuum-1.1/apps/continuum/webapp/WEB-INF/working-directory/31/src/main/java/org/apache/directory/studio/maven/plugins/StudioUnpackPrefixedMojo.java:45: warning - @description is an unknown tag.
[WARNING] /home/continuum/continuum-1.1/apps/continuum/webapp/WEB-INF/working-directory/31/src/main/java/org/apache/directory/studio/maven/plugins/StudioUnpackPrefixedMojo.java:45: warning - @requiresProject is an unknown tag.
[WARNING] /home/continuum/continuum-1.1/apps/continuum/webapp/WEB-INF/working-directory/31/src/main/java/org/apache/directory/studio/maven/plugins/StudioUnpackPrefixedMojo.java:45: warning - @requiresDependencyResolution is an unknown tag.
[WARNING] /home/continuum/continuum-1.1/apps/continuum/webapp/WEB-INF/working-directory/31/src/main/java/org/apache/directory/studio/maven/plugins/StudioUnpackPrefixedMojo.java:57: warning - @parameter is an unknown tag.
[WARNING] /home/continuum/continuum-1.1/apps/continuum/webapp/WEB-INF/working-directory/31/src/main/java/org/apache/directory/studio/maven/plugins/StudioUnpackPrefixedMojo.java:57: warning - @required is an unknown tag.
[INFO] Generating "CPD Report" report.
[INFO] Generating "Plugin Documentation" report.
[INFO] Using 2 extractors.
[INFO] Applying extractor for language: java
[INFO] Extractor for language: java found 6 mojo descriptors.
[INFO] Applying extractor for language: bsh
[INFO] Extractor for language: bsh found 0 mojo descriptors.
[INFO] Generating "RAT Report" report.
[INFO] Generating "Issue Tracking" report.
[INFO] Generating "Surefire Report" report.
[INFO] Generating "Test Source Xref" report.
[INFO] Generating "Cobertura Test Coverage" report.
[INFO] Cobertura 1.9 - GNU GPL License (NO WARRANTY) - See COPYRIGHT file
Cobertura: Loaded information on 9 classes.
Report time: 438ms

[INFO] Cobertura Report generation was successful.
[INFO] Generating "Project License" report.
[INFO] Generating "Source Xref" report.
[INFO] [site:deploy]
scpexe://vm094.oxylos.org/var/www/html/projects/studio-plugin/ - Session: Opened  
Using private key: /home/continuum/.ssh/id_dsa
Executing command: /bin/sh -c ssh -i /home/continuum/.ssh/id_dsa -o 'BatchMode yes' continuum@vm094.oxylos.org 'mkdir -p /var/www/html/projects/studio-plugin/.'


Using private key: /home/continuum/.ssh/id_dsa
Executing command: /bin/sh -c ssh -i /home/continuum/.ssh/id_dsa -o 'BatchMode yes' continuum@vm094.oxylos.org 'mkdir -p /var/www/html/projects/studio-plugin//.
'


Uploading: ./wagon48521.zip to scpexe://vm094.oxylos.org/var/www/html/projects/studio-plugin/

Using private key: /home/continuum/.ssh/id_dsa
Executing command: /bin/sh -c cd /tmp && scp -i /home/continuum/.ssh/id_dsa -o 'BatchMode yes' wagon48521.zip continuum@vm094.oxylos.org:/var/www/html/projects/studio-plugin//./wagon48521.zip
#####################################################################################################################################Using private key: /home/continuum/.ssh/id_dsa
Executing command: /bin/sh -c ssh -i /home/continuum/.ssh/id_dsa -o 'BatchMode yes' continuum@vm094.oxylos.org 'chmod -f 644 /var/www/html/projects/studio-plugin//./wagon48521.zip
'



Transfer finished. 541861 bytes copied in 0.901 seconds
Using private key: /home/continuum/.ssh/id_dsa
Executing command: /bin/sh -c ssh -i /home/continuum/.ssh/id_dsa -o 'BatchMode yes' continuum@vm094.oxylos.org 'cd /var/www/html/projects/studio-plugin/.; unzip -o wagon48521.zip; rm -f wagon48521.zip'
Archive:  wagon48521.zip
  inflating: css/site.css            
  inflating: css/maven-theme.css     
  inflating: index.html              
  inflating: pmd.xml                 
  inflating: copy-eclipse-artifact-mojo.html  
  inflating: surefire-report.html    
  inflating: project-reports.html    
  inflating: apidocs/options         
  inflating: apidocs/package-list    
  inflating: apidocs/overview-tree.html  
  inflating: apidocs/index.html      
  inflating: apidocs/constant-values.html  
  inflating: apidocs/allclasses-frame.html  
  inflating: apidocs/org/apache/directory/studio/maven/plugins/package-use.html  
  inflating: apidocs/org/apache/directory/studio/maven/plugins/StudioUnpackPrefixedMojo.html  
  inflating: apidocs/org/apache/directory/studio/maven/plugins/package-frame.html  
  inflating: apidocs/org/apache/directory/studio/maven/plugins/ArtifactItem.html  
  inflating: apidocs/org/apache/directory/studio/maven/plugins/StudioPrepareJarPackageMojo.html  
  inflating: apidocs/org/apache/directory/studio/maven/plugins/package-summary.html  
  inflating: apidocs/org/apache/directory/studio/maven/plugins/StudioCopyEclipseDependencyMojo.html  
  inflating: apidocs/org/apache/directory/studio/maven/plugins/StudioCleanMojo.html  
  inflating: apidocs/org/apache/directory/studio/maven/plugins/class-use/StudioUnpackPrefixedMojo.html  
  inflating: apidocs/org/apache/directory/studio/maven/plugins/class-use/ArtifactItem.html  
  inflating: apidocs/org/apache/directory/studio/maven/plugins/class-use/StudioPrepareJarPackageMojo.html  
  inflating: apidocs/org/apache/directory/studio/maven/plugins/class-use/StudioCopyEclipseDependencyMojo.html  
  inflating: apidocs/org/apache/directory/studio/maven/plugins/class-use/StudioCleanMojo.html  
  inflating: apidocs/org/apache/directory/studio/maven/plugins/class-use/AbstractStudioMojo.html  
  inflating: apidocs/org/apache/directory/studio/maven/plugins/class-use/StudioEclipseMojo.html  
  inflating: apidocs/org/apache/directory/studio/maven/plugins/class-use/StudioReplaceFileInJarMojo.html  
  inflating: apidocs/org/apache/directory/studio/maven/plugins/package-tree.html  
  inflating: apidocs/org/apache/directory/studio/maven/plugins/AbstractStudioMojo.html  
  inflating: apidocs/org/apache/directory/studio/maven/plugins/StudioEclipseMojo.html  
  inflating: apidocs/org/apache/directory/studio/maven/plugins/StudioReplaceFileInJarMojo.html  
  inflating: apidocs/index-all.html  
  inflating: apidocs/allclasses-noframe.html  
  inflating: apidocs/stylesheet.css  
  inflating: apidocs/deprecated-list.html  
  inflating: apidocs/packages        
  inflating: apidocs/resources/inherit.gif  
  inflating: apidocs/help-doc.html   
  inflating: faq.html                
  inflating: mail-lists.html         
  inflating: cpd.html                
  inflating: plugin-info.html        
  inflating: rat-report.html         
  inflating: cobertura/css/tooltip.css  
  inflating: cobertura/css/sortabletable.css  
  inflating: cobertura/css/source-viewer.css  
  inflating: cobertura/css/help.css  
  inflating: cobertura/css/main.css  
  inflating: cobertura/index.html    
  inflating: cobertura/help.html     
  inflating: cobertura/org.apache.directory.studio.maven.plugins.StudioEclipseMojo.html  
  inflating: cobertura/org.apache.directory.studio.maven.plugins.StudioCopyEclipseDependencyMojo.html  
  inflating: cobertura/org.apache.directory.studio.maven.plugins.AbstractStudioMojo.html  
  inflating: cobertura/frame-sourcefiles-org.apache.directory.studio.maven.plugins.html  
  inflating: cobertura/frame-sourcefiles.html  
  inflating: cobertura/org.apache.directory.studio.maven.plugins.StudioPrepareJarPackageMojo.html  
  inflating: cobertura/org.apache.directory.studio.maven.plugins.StudioCleanMojo.html  
  inflating: cobertura/frame-summary-org.apache.directory.studio.maven.plugins.html  
  inflating: cobertura/js/popup.js   
  inflating: cobertura/js/customsorttypes.js  
  inflating: cobertura/js/sortabletable.js  
  inflating: cobertura/js/stringbuilder.js  
  inflating: cobertura/org.apache.directory.studio.maven.plugins.StudioReplaceFileInJarMojo.html  
  inflating: cobertura/org.apache.directory.studio.maven.plugins.StudioUnpackPrefixedMojo.html  
  inflating: cobertura/frame-packages.html  
  inflating: cobertura/images/blank.png  
  inflating: cobertura/images/upsimple.png  
  inflating: cobertura/images/downsimple.png  
  inflating: cobertura/frame-summary.html  
  inflating: cobertura/org.apache.directory.studio.maven.plugins.ArtifactItem.html  
  inflating: team-list.html          
  inflating: clean-mojo.html         
  inflating: plugin-management.html  
  inflating: prepare-jar-package-mojo.html  
  inflating: xref/index.html         
  inflating: xref/allclasses-frame.html  
  inflating: xref/org/apache/directory/studio/maven/plugins/StudioUnpackPrefixedMojo.html  
  inflating: xref/org/apache/directory/studio/maven/plugins/package-frame.html  
  inflating: xref/org/apache/directory/studio/maven/plugins/ArtifactItem.html  
  inflating: xref/org/apache/directory/studio/maven/plugins/StudioPrepareJarPackageMojo.html  
  inflating: xref/org/apache/directory/studio/maven/plugins/package-summary.html  
  inflating: xref/org/apache/directory/studio/maven/plugins/StudioCopyEclipseDependencyMojo.html  
  inflating: xref/org/apache/directory/studio/maven/plugins/StudioCleanMojo.html  
  inflating: xref/org/apache/directory/studio/maven/plugins/AbstractStudioMojo.html  
  inflating: xref/org/apache/directory/studio/maven/plugins/StudioEclipseMojo.html  
  inflating: xref/org/apache/directory/studio/maven/plugins/StudioReplaceFileInJarMojo.html  
  inflating: xref/overview-summary.html  
  inflating: xref/overview-frame.html  
  inflating: xref/stylesheet.css     
  inflating: issue-tracking.html     
  inflating: license.html            
  inflating: eclipse-mojo.html       
  inflating: xref-test/index.html    
  inflating: xref-test/allclasses-frame.html  
  inflating: xref-test/org/apache/directory/studio/maven/plugins/StudioUnpackPrefixedMojoTest.html  
  inflating: xref-test/org/apache/directory/studio/maven/plugins/package-frame.html  
  inflating: xref-test/org/apache/directory/studio/maven/plugins/package-summary.html  
  inflating: xref-test/org/apache/directory/studio/maven/plugins/StudioCopyEclipseDependencyMojoTest.html  
  inflating: xref-test/org/apache/directory/studio/maven/plugins/stubs/package-frame.html  
  inflating: xref-test/org/apache/directory/studio/maven/plugins/stubs/package-summary.html  
  inflating: xref-test/org/apache/directory/studio/maven/plugins/stubs/StudioCopyEclipseDependencyProjectStub.html  
  inflating: xref-test/org/apache/directory/studio/maven/plugins/stubs/StudioUnpackPrefixedProjectStub.html  
  inflating: xref-test/org/apache/directory/studio/maven/plugins/stubs/StudioCleanProjectStub.html  
  inflating: xref-test/org/apache/directory/studio/maven/plugins/StudioCleanMojoTest.html  
  inflating: xref-test/overview-summary.html  
  inflating: xref-test/overview-frame.html  
  inflating: xref-test/stylesheet.css  
  inflating: cpd.xml                 
  inflating: dependencies.html       
  inflating: unpack-with-artifactid-prefix-mojo.html  
  inflating: source-repository.html  
  inflating: testapidocs/options     
  inflating: testapidocs/package-list  
  inflating: testapidocs/overview-tree.html  
  inflating: testapidocs/index.html  
  inflating: testapidocs/constant-values.html  
  inflating: testapidocs/allclasses-frame.html  
  inflating: testapidocs/org/apache/directory/studio/maven/plugins/StudioUnpackPrefixedMojoTest.html  
  inflating: testapidocs/org/apache/directory/studio/maven/plugins/package-use.html  
  inflating: testapidocs/org/apache/directory/studio/maven/plugins/package-frame.html  
  inflating: testapidocs/org/apache/directory/studio/maven/plugins/package-summary.html  
  inflating: testapidocs/org/apache/directory/studio/maven/plugins/StudioCopyEclipseDependencyMojoTest.html  
  inflating: testapidocs/org/apache/directory/studio/maven/plugins/class-use/StudioUnpackPrefixedMojoTest.html  
  inflating: testapidocs/org/apache/directory/studio/maven/plugins/class-use/StudioCopyEclipseDependencyMojoTest.html  
  inflating: testapidocs/org/apache/directory/studio/maven/plugins/class-use/StudioCleanMojoTest.html  
  inflating: testapidocs/org/apache/directory/studio/maven/plugins/package-tree.html  
  inflating: testapidocs/org/apache/directory/studio/maven/plugins/stubs/package-use.html  
  inflating: testapidocs/org/apache/directory/studio/maven/plugins/stubs/package-frame.html  
  inflating: testapidocs/org/apache/directory/studio/maven/plugins/stubs/package-summary.html  
  inflating: testapidocs/org/apache/directory/studio/maven/plugins/stubs/StudioCopyEclipseDependencyProjectStub.html  
  inflating: testapidocs/org/apache/directory/studio/maven/plugins/stubs/class-use/StudioCopyEclipseDependencyProjectStub.html  
  inflating: testapidocs/org/apache/directory/studio/maven/plugins/stubs/class-use/StudioUnpackPrefixedProjectStub.html  
  inflating: testapidocs/org/apache/directory/studio/maven/plugins/stubs/class-use/StudioCleanProjectStub.html  
  inflating: testapidocs/org/apache/directory/studio/maven/plugins/stubs/StudioUnpackPrefixedProjectStub.html  
  inflating: testapidocs/org/apache/directory/studio/maven/plugins/stubs/package-tree.html  
  inflating: testapidocs/org/apache/directory/studio/maven/plugins/stubs/StudioCleanProjectStub.html  
  inflating: testapidocs/org/apache/directory/studio/maven/plugins/StudioCleanMojoTest.html  
  inflating: testapidocs/index-all.html  
  inflating: testapidocs/allclasses-noframe.html  
  inflating: testapidocs/overview-summary.html  
  inflating: testapidocs/overview-frame.html  
  inflating: testapidocs/stylesheet.css  
  inflating: testapidocs/deprecated-list.html  
  inflating: testapidocs/packages    
  inflating: testapidocs/resources/inherit.gif  
  inflating: testapidocs/help-doc.html  
  inflating: examples/unpack-with-artifactid-prefix.html  
  inflating: examples/replace-file-in-eclipse-artifact.html  
  inflating: examples/prepare-jar-package.html  
  inflating: examples/copy-eclipse-artifact.html  
  inflating: taglist.html            
  inflating: replace-file-in-eclipse-artifact-mojo.html  
  inflating: usage.html              
  inflating: pmd.html                
  inflating: project-info.html       
  inflating: images/header-blue.png  
  inflating: images/news-blue.png    
  inflating: images/icon_info_sml.gif  
  inflating: images/studio-icon_128x128.png  
  inflating: images/icon_error_sml.gif  
  inflating: images/icon_warning_sml.gif  
  inflating: images/footer.png       
  inflating: images/expanded.gif     
  inflating: images/collapsed.gif    
  inflating: images/logos/maven-feather.png  
  inflating: images/icon_success_sml.gif  
  inflating: images/close.gif        
  inflating: images/content-background.png  
  inflating: images/external.png     
  inflating: images/edit_out.png     
  inflating: images/edit_over.png    
  inflating: images/studio-icon_16x16.png  
  inflating: images/newwindow.png    
  inflating: images/body-bg.png      
  inflating: images/post-blue.png    
  inflating: integration.html        


Using private key: /home/continuum/.ssh/id_dsa
Executing command: /bin/sh -c ssh -i /home/continuum/.ssh/id_dsa -o 'BatchMode yes' continuum@vm094.oxylos.org 'chmod -Rf g+w,a+rX /var/www/html/projects/studio-plugin/'


scpexe://vm094.oxylos.org/var/www/html/projects/studio-plugin/ - Session: Disconnecting  
scpexe://vm094.oxylos.org/var/www/html/projects/studio-plugin/ - Session: Disconnected
[INFO] ------------------------------------------------------------------------
[INFO] BUILD SUCCESSFUL
[INFO] ------------------------------------------------------------------------
[INFO] Total time: 43 seconds
[INFO] Finished at: Tue Feb 17 20:09:05 EST 2009
[INFO] Final Memory: 75M/508M
[INFO] ------------------------------------------------------------------------

****************************************************************************



Mime
View raw message