directory-notifications mailing list archives

Site index · List index
Message view « Date » · « Thread »
Top « Date » · « Thread »
From Continuum VMBuild Server <contin...@vm094.oxylos.org>
Subject [continuum] BUILD FAILURE: Default Project Group - Apache Directory Shared - Build Def: default maven2 buildDefinition
Date Wed, 21 Jan 2009 03:31:27 GMT
Online report : http://vm094.oxylos.org/continuum/buildResult.action?buildId=3020&projectId=6

Build statistics:
  State: Failed
  Previous State: Failed
  Started at: Tue 20 Jan 2009 22:30:11 -0500
  Finished at: Tue 20 Jan 2009 22:31:26 -0500
  Total time: 1m 14s
  Build Trigger: Schedule
  Build Number: 262
  Exit code: 1
  Building machine hostname: vm094.oxylos.org
  Operating system : Linux(unknown)
  Java Home version : 
          java version "1.6.0_06"
          Java(TM) SE Runtime Environment (build 1.6.0_06-b02)
          Java HotSpot(TM) Client VM (build 10.0-b22, mixed mode, sharing)
        
  Builder version :
          Maven version: 2.0.9
          Java version: 1.6.0_06
          OS name: "linux" version: "2.6.18-92.1.10.el5" arch: "i386" Family: "unix"
    
****************************************************************************
SCM Changes:
****************************************************************************
Changed: no author @ no date
Comment: no comment
Files changed:
  ldap/src/test/java/org/apache/directory/shared/ldap/schema/SchemaUtilsTest.java ( no revision
)
  ldap/src/test/java/org/apache/directory/shared/ldap/schema/syntax/parser/MatchingRuleUseDescriptionSchemaParserTest.java
( no revision )
  ldap/src/test/java/org/apache/directory/shared/ldap/schema/syntax/parser/MatchingRuleDescriptionSchemaParserTest.java
( no revision )
  ldap/src/test/java/org/apache/directory/shared/ldap/schema/syntax/parser/NormalizerDescriptionSchemaParserTest.java
( no revision )
  ldap/src/test/java/org/apache/directory/shared/ldap/schema/syntax/parser/DITContentRuleDescriptionSchemaParserTest.java
( no revision )
  ldap/src/test/java/org/apache/directory/shared/ldap/schema/syntax/parser/NameFormDescriptionSchemaParserTest.java
( no revision )
  ldap/src/test/java/org/apache/directory/shared/ldap/schema/syntax/parser/AttributeTypeDescriptionSchemaParserTest.java
( no revision )
  ldap/src/test/java/org/apache/directory/shared/ldap/schema/syntax/parser/ComparatorDescriptionSchemaParserTest.java
( no revision )
  ldap/src/test/java/org/apache/directory/shared/ldap/schema/syntax/parser/LdapSyntaxDescriptionSchemaParserTest.java
( no revision )
  ldap/src/test/java/org/apache/directory/shared/ldap/schema/syntax/parser/DITStructureRuleDescriptionSchemaParserTest.java
( no revision )
  ldap/src/test/java/org/apache/directory/shared/ldap/schema/syntax/parser/SyntaxCheckerDescriptionSchemaParserTest.java
( no revision )
  ldap/src/test/java/org/apache/directory/shared/ldap/schema/syntax/parser/ObjectClassDescriptionSchemaParserTest.java
( no revision )
  ldap/src/test/java/org/apache/directory/shared/ldap/schema/syntax/parser/SchemaParserTestUtils.java
( no revision )
  ldap/src/test/java/org/apache/directory/shared/ldap/entry/client/ClientBinaryValueTest.java
( no revision )
  ldap/src/main/java/org/apache/directory/shared/ldap/schema/parsers/OpenLdapSchemaParser.java
( no revision )
  ldap/src/main/java/org/apache/directory/shared/ldap/schema/parsers/MatchingRuleUseDescriptionSchemaParser.java
( no revision )
  ldap/src/main/java/org/apache/directory/shared/ldap/schema/parsers/AbstractSchemaParser.java
( no revision )
  ldap/src/main/java/org/apache/directory/shared/ldap/schema/parsers/AttributeTypeDescriptionSchemaParser.java
( no revision )
  ldap/src/main/java/org/apache/directory/shared/ldap/schema/parsers/DITContentRuleDescription.java
( no revision )
  ldap/src/main/java/org/apache/directory/shared/ldap/schema/parsers/NameFormDescription.java
( no revision )
  ldap/src/main/java/org/apache/directory/shared/ldap/schema/parsers/ComparatorDescription.java
( no revision )
  ldap/src/main/java/org/apache/directory/shared/ldap/schema/parsers/SyntaxCheckerDescriptionSchemaParser.java
( no revision )
  ldap/src/main/java/org/apache/directory/shared/ldap/schema/parsers/AbstractAdsSchemaDescription.java
( no revision )
  ldap/src/main/java/org/apache/directory/shared/ldap/schema/parsers/MatchingRuleDescriptionSchemaParser.java
( no revision )
  ldap/src/main/java/org/apache/directory/shared/ldap/schema/parsers/NormalizerDescription.java
( no revision )
  ldap/src/main/java/org/apache/directory/shared/ldap/schema/parsers/LdapSyntaxDescriptionSchemaParser.java
( no revision )
  ldap/src/main/java/org/apache/directory/shared/ldap/schema/parsers/DITStructureRuleDescriptionSchemaParser.java
( no revision )
  ldap/src/main/java/org/apache/directory/shared/ldap/schema/parsers/ObjectClassDescription.java
( no revision )
  ldap/src/main/java/org/apache/directory/shared/ldap/schema/parsers/MatchingRuleUseDescription.java
( no revision )
  ldap/src/main/java/org/apache/directory/shared/ldap/schema/parsers/DITContentRuleDescriptionSchemaParser.java
( no revision )
  ldap/src/main/java/org/apache/directory/shared/ldap/schema/parsers/NameFormDescriptionSchemaParser.java
( no revision )
  ldap/src/main/java/org/apache/directory/shared/ldap/schema/parsers/ComparatorDescriptionSchemaParser.java
( no revision )
  ldap/src/main/java/org/apache/directory/shared/ldap/schema/parsers/AttributeTypeDescription.java
( no revision )
  ldap/src/main/java/org/apache/directory/shared/ldap/schema/parsers/SyntaxCheckerDescription.java
( no revision )
  ldap/src/main/java/org/apache/directory/shared/ldap/schema/parsers/ParserDescriptionUtils.java
( no revision )
  ldap/src/main/java/org/apache/directory/shared/ldap/schema/parsers/NormalizerDescriptionSchemaParser.java
( no revision )
  ldap/src/main/java/org/apache/directory/shared/ldap/schema/parsers/MatchingRuleDescription.java
( no revision )
  ldap/src/main/java/org/apache/directory/shared/ldap/schema/parsers/AbstractSchemaDescription.java
( no revision )
  ldap/src/main/java/org/apache/directory/shared/ldap/schema/parsers/LdapSyntaxDescription.java
( no revision )
  ldap/src/main/java/org/apache/directory/shared/ldap/schema/parsers/DITStructureRuleDescription.java
( no revision )
  ldap/src/main/java/org/apache/directory/shared/ldap/schema/parsers/ObjectClassDescriptionSchemaParser.java
( no revision )
  ldap/src/main/java/org/apache/directory/shared/ldap/schema/AbstractSyntaxChecker.java (
no revision )
  ldap/src/main/java/org/apache/directory/shared/ldap/schema/SchemaUtils.java ( no revision
)
  ldap/src/main/java/org/apache/directory/shared/ldap/schema/syntaxes/CountrySyntaxChecker.java
( no revision )
  ldap/src/main/java/org/apache/directory/shared/ldap/schema/syntaxes/Ia5StringSyntaxChecker.java
( no revision )
  ldap/src/main/java/org/apache/directory/shared/ldap/schema/syntaxes/BitStringSyntaxChecker.java
( no revision )
  ldap/src/main/java/org/apache/directory/shared/ldap/schema/syntaxes/OctetStringSyntaxChecker.java
( no revision )
  ldap/src/main/java/org/apache/directory/shared/ldap/schema/syntaxes/PrintableStringSyntaxChecker.java
( no revision )
  ldap/src/main/java/org/apache/directory/shared/ldap/schema/syntaxes/ProtocolInformationSyntaxChecker.java
( no revision )
  ldap/src/main/java/org/apache/directory/shared/ldap/schema/syntaxes/NameFormDescriptionSyntaxChecker.java
( no revision )
  ldap/src/main/java/org/apache/directory/shared/ldap/schema/syntaxes/TeletexTerminalIdentifierSyntaxChecker.java
( no revision )
  ldap/src/main/java/org/apache/directory/shared/ldap/schema/syntaxes/AttributeTypeDescriptionSyntaxChecker.java
( no revision )
  ldap/src/main/java/org/apache/directory/shared/ldap/schema/syntaxes/UtcTimeSyntaxChecker.java
( no revision )
  ldap/src/main/java/org/apache/directory/shared/ldap/schema/syntaxes/AccessPointSyntaxChecker.java
( no revision )
  ldap/src/main/java/org/apache/directory/shared/ldap/schema/syntaxes/DSETypeSyntaxChecker.java
( no revision )
  ldap/src/main/java/org/apache/directory/shared/ldap/schema/syntaxes/CertificateListSyntaxChecker.java
( no revision )
  ldap/src/main/java/org/apache/directory/shared/ldap/schema/syntaxes/SupplierOrConsumerSyntaxChecker.java
( no revision )
  ldap/src/main/java/org/apache/directory/shared/ldap/schema/syntaxes/BinarySyntaxChecker.java
( no revision )
  ldap/src/main/java/org/apache/directory/shared/ldap/schema/syntaxes/LdapSyntaxDescriptionSyntaxChecker.java
( no revision )
  ldap/src/main/java/org/apache/directory/shared/ldap/schema/syntaxes/SupportedAlgorithmSyntaxChecker.java
( no revision )
  ldap/src/main/java/org/apache/directory/shared/ldap/schema/syntaxes/ObjectClassTypeSyntaxChecker.java
( no revision )
  ldap/src/main/java/org/apache/directory/shared/ldap/schema/syntaxes/MHSORAddressSyntaxChecker.java
( no revision )
  ldap/src/main/java/org/apache/directory/shared/ldap/schema/syntaxes/ObjectClassDescriptionSyntaxChecker.java
( no revision )
  ldap/src/main/java/org/apache/directory/shared/ldap/schema/syntaxes/ObjectNameSyntaxChecker.java
( no revision )
  ldap/src/main/java/org/apache/directory/shared/ldap/schema/syntaxes/SubtreeSpecificationSyntaxChecker.java
( no revision )
  ldap/src/main/java/org/apache/directory/shared/ldap/schema/syntaxes/NameAndOptionalUIDSyntaxChecker.java
( no revision )
  ldap/src/main/java/org/apache/directory/shared/ldap/schema/syntaxes/MailPreferenceSyntaxChecker.java
( no revision )
  ldap/src/main/java/org/apache/directory/shared/ldap/schema/syntaxes/MatchingRuleDescriptionSyntaxChecker.java
( no revision )
  ldap/src/main/java/org/apache/directory/shared/ldap/schema/syntaxes/DSAQualitySyntaxSyntaxChecker.java
( no revision )
  ldap/src/main/java/org/apache/directory/shared/ldap/schema/syntaxes/NumericStringSyntaxChecker.java
( no revision )
  ldap/src/main/java/org/apache/directory/shared/ldap/schema/syntaxes/DLSubmitPermissionSyntaxChecker.java
( no revision )
  ldap/src/main/java/org/apache/directory/shared/ldap/schema/syntaxes/NumericOidSyntaxChecker.java
( no revision )
  ldap/src/main/java/org/apache/directory/shared/ldap/schema/syntaxes/CertificatePairSyntaxChecker.java
( no revision )
  ldap/src/main/java/org/apache/directory/shared/ldap/schema/syntaxes/JavaLongSyntaxChecker.java
( no revision )
  ldap/src/main/java/org/apache/directory/shared/ldap/schema/syntaxes/MatchingRuleUseDescriptionSyntaxChecker.java
( no revision )
  ldap/src/main/java/org/apache/directory/shared/ldap/schema/syntaxes/JavaByteSyntaxChecker.java
( no revision )
  ldap/src/main/java/org/apache/directory/shared/ldap/schema/syntaxes/MasterAndShadowAccessPointSyntaxChecker.java
( no revision )
  ldap/src/main/java/org/apache/directory/shared/ldap/schema/syntaxes/CertificateSyntaxChecker.java
( no revision )
  ldap/src/main/java/org/apache/directory/shared/ldap/schema/syntaxes/EnhancedGuideSyntaxChecker.java
( no revision )
  ldap/src/main/java/org/apache/directory/shared/ldap/schema/syntaxes/DeliveryMethodSyntaxChecker.java
( no revision )
  ldap/src/main/java/org/apache/directory/shared/ldap/schema/syntaxes/JpegSyntaxChecker.java
( no revision )
  ldap/src/main/java/org/apache/directory/shared/ldap/schema/syntaxes/AcceptAllSyntaxChecker.java
( no revision )
  ldap/src/main/java/org/apache/directory/shared/ldap/schema/syntaxes/NumberSyntaxChecker.java
( no revision )
  ldap/src/main/java/org/apache/directory/shared/ldap/schema/syntaxes/TelexNumberSyntaxChecker.java
( no revision )
  ldap/src/main/java/org/apache/directory/shared/ldap/schema/syntaxes/DITStructureRuleDescriptionSyntaxChecker.java
( no revision )
  ldap/src/main/java/org/apache/directory/shared/ldap/schema/syntaxes/OtherMailboxSyntaxChecker.java
( no revision )
  ldap/src/main/java/org/apache/directory/shared/ldap/schema/syntaxes/AudioSyntaxChecker.java
( no revision )
  ldap/src/main/java/org/apache/directory/shared/ldap/schema/syntaxes/DITContentRuleDescriptionSyntaxChecker.java
( no revision )
  ldap/src/main/java/org/apache/directory/shared/ldap/schema/syntaxes/GeneralizedTimeSyntaxChecker.java
( no revision )
  ldap/src/main/java/org/apache/directory/shared/ldap/schema/syntaxes/PostalAddressSyntaxChecker.java
( no revision )
  ldap/src/main/java/org/apache/directory/shared/ldap/schema/syntaxes/SubstringAssertionSyntaxChecker.java
( no revision )
  ldap/src/main/java/org/apache/directory/shared/ldap/schema/syntaxes/SupplierInformationSyntaxChecker.java
( no revision )
  ldap/src/main/java/org/apache/directory/shared/ldap/schema/syntaxes/OidLenSyntaxChecker.java
( no revision )
  ldap/src/main/java/org/apache/directory/shared/ldap/schema/syntaxes/RegexSyntaxChecker.java
( no revision )
  ldap/src/main/java/org/apache/directory/shared/ldap/schema/syntaxes/ACIItemSyntaxChecker.java
( no revision )
  ldap/src/main/java/org/apache/directory/shared/ldap/schema/syntaxes/OidSyntaxChecker.java
( no revision )
  ldap/src/main/java/org/apache/directory/shared/ldap/schema/syntaxes/FaxSyntaxChecker.java
( no revision )
  ldap/src/main/java/org/apache/directory/shared/ldap/schema/syntaxes/BooleanSyntaxChecker.java
( no revision )
  ldap/src/main/java/org/apache/directory/shared/ldap/schema/syntaxes/PresentationAddressSyntaxChecker.java
( no revision )
  ldap/src/main/java/org/apache/directory/shared/ldap/schema/syntaxes/DataQualitySyntaxSyntaxChecker.java
( no revision )
  ldap/src/main/java/org/apache/directory/shared/ldap/schema/syntaxes/AttributeTypeUsageSyntaxChecker.java
( no revision )
  ldap/src/main/java/org/apache/directory/shared/ldap/schema/syntaxes/DirectoryStringSyntaxChecker.java
( no revision )
  ldap/src/main/java/org/apache/directory/shared/ldap/schema/syntaxes/TelephoneNumberSyntaxChecker.java
( no revision )
  ldap/src/main/java/org/apache/directory/shared/ldap/schema/syntaxes/IntegerSyntaxChecker.java
( no revision )
  ldap/src/main/java/org/apache/directory/shared/ldap/schema/syntaxes/GuideSyntaxChecker.java
( no revision )
  ldap/src/main/java/org/apache/directory/shared/ldap/schema/syntaxes/JavaIntegerSyntaxChecker.java
( no revision )
  ldap/src/main/java/org/apache/directory/shared/ldap/schema/syntaxes/JavaShortSyntaxChecker.java
( no revision )
  ldap/src/main/java/org/apache/directory/shared/ldap/schema/syntaxes/DNSyntaxChecker.java
( no revision )
  ldap/src/main/java/org/apache/directory/shared/ldap/schema/syntaxes/SupplierAndConsumerSyntaxChecker.java
( no revision )
  ldap/src/main/java/org/apache/directory/shared/ldap/schema/SyntaxChecker.java ( no revision
)
  ldap/src/main/java/org/apache/directory/shared/ldap/schema/Syntax.java ( no revision )
  ldap/src/main/java/org/apache/directory/shared/ldap/entry/AbstractValue.java ( no revision
)
  ldap/src/main/java/org/apache/directory/shared/ldap/entry/Value.java ( no revision )
  ldap/src/main/java/org/apache/directory/shared/ldap/entry/client/ClientAttribute.java (
no revision )
  ldap/src/main/java/org/apache/directory/shared/ldap/entry/client/DefaultClientAttribute.java
( no revision )

****************************************************************************
Dependencies Changes:
****************************************************************************
No dependencies changed


****************************************************************************
Build Defintion:
****************************************************************************
POM filename: pom.xml
Goals: clean deploy   
Arguments: --batch-mode
Build Fresh: false
Always Build: false
Default Build Definition: true
Schedule: EVERY_30_MINUTES
Description: default maven2 buildDefinition

****************************************************************************
Test Summary:
****************************************************************************
Tests: 101
Failures: 0
Total time: 0.61700004


****************************************************************************
Output:
****************************************************************************
[INFO] Scanning for projects...
[INFO] Reactor build order: 
[INFO]   Apache Directory Shared
[INFO]   Apache Directory ASN.1 Shared
[INFO]   Apache Directory Protocol Ldap Shared Constants
[INFO]   Apache Directory Protocol Ldap Shared
[INFO]   Apache Directory JNDI Shared
[INFO]   Apache Directory MINA ASN.1 Codec Shared
[INFO]   Apache Directory Protocol Ldap Converters
[INFO] ------------------------------------------------------------------------
[INFO] Building Apache Directory Shared
[INFO]    task-segment: [clean, deploy]
[INFO] ------------------------------------------------------------------------
[INFO] [clean:clean]
[INFO] Deleting directory /home/continuum/continuum-1.1/apps/continuum/webapp/WEB-INF/working-directory/6/target
[INFO] Setting property: classpath.resource.loader.class => 'org.codehaus.plexus.velocity.ContextClassLoaderResourceLoader'.
[INFO] Setting property: velocimacro.messages.on => 'false'.
[INFO] Setting property: resource.loader => 'classpath'.
[INFO] Setting property: resource.manager.logwhenfound => 'false'.
[INFO] [remote-resources:process {execution: default}]
[INFO] [site:attach-descriptor]
[INFO] Unable to load parent project from a relative path: Could not find the model file '/home/continuum/continuum-1.1/apps/continuum/webapp/WEB-INF/working-directory/pom.xml'.
for project unknown
[INFO] Parent project loaded from repository.
[INFO] [tools:verify-legal-files {execution: verify-legal-files}]
[INFO] [install:install]
[INFO] Installing /home/continuum/continuum-1.1/apps/continuum/webapp/WEB-INF/working-directory/6/pom.xml
to /home/continuum/.m2/repository/org/apache/directory/shared/shared-parent/0.9.14-SNAPSHOT/shared-parent-0.9.14-SNAPSHOT.pom
[INFO] [deploy:deploy]
altDeploymentRepository = null
[INFO] Retrieving previous build number from apache.directory.snapshot.repo
Uploading: scpexe://vm094.oxylos.org/var/www/html/mirror-maven2/org/apache/directory/shared/shared-parent/0.9.14-SNAPSHOT/shared-parent-0.9.14-SNAPSHOT.pom
[INFO] Retrieving previous metadata from apache.directory.snapshot.repo
[INFO] Uploading repository metadata for: 'snapshot org.apache.directory.shared:shared-parent:0.9.14-SNAPSHOT'
[INFO] Uploading site descriptor for shared-parent 0.9.14-SNAPSHOT site.xml
[INFO] Retrieving previous metadata from apache.directory.snapshot.repo
[INFO] Uploading repository metadata for: 'artifact org.apache.directory.shared:shared-parent'
[INFO] ------------------------------------------------------------------------
[INFO] Building Apache Directory ASN.1 Shared
[INFO]    task-segment: [clean, deploy]
[INFO] ------------------------------------------------------------------------
[INFO] [clean:clean]
[INFO] Deleting directory /home/continuum/continuum-1.1/apps/continuum/webapp/WEB-INF/working-directory/6/asn1/target
[INFO] [remote-resources:process {execution: default}]
[INFO] [resources:resources]
[INFO] Using default encoding to copy filtered resources.
[INFO] [compiler:compile]
[INFO] Compiling 83 source files to /home/continuum/continuum-1.1/apps/continuum/webapp/WEB-INF/working-directory/6/asn1/target/classes
[INFO] [resources:testResources]
[INFO] Using default encoding to copy filtered resources.
[INFO] [compiler:testCompile]
[INFO] Compiling 8 source files to /home/continuum/continuum-1.1/apps/continuum/webapp/WEB-INF/working-directory/6/asn1/target/test-classes
[INFO] [surefire:test]
[INFO] Surefire report directory: /home/continuum/continuum-1.1/apps/continuum/webapp/WEB-INF/working-directory/6/asn1/target/surefire-reports

-------------------------------------------------------
 T E S T S
-------------------------------------------------------
Running org.apache.directory.shared.asn1.primitives.PrimitivesTest
Tests run: 1, Failures: 0, Errors: 0, Skipped: 0, Time elapsed: 0.029 sec
Running org.apache.directory.shared.asn1.ber.tlv.LengthTest
Tests run: 2, Failures: 0, Errors: 0, Skipped: 0, Time elapsed: 0.007 sec
Running org.apache.directory.shared.asn1.primitives.BitStringTest
Tests run: 9, Failures: 0, Errors: 0, Skipped: 0, Time elapsed: 0.013 sec
Running org.apache.directory.shared.asn1.codec.stateful.DecoderStackTest
Tests run: 4, Failures: 0, Errors: 0, Skipped: 0, Time elapsed: 0.01 sec
Running org.apache.directory.shared.asn1.codec.stateful.examples.HexDecoderTest
Tests run: 10, Failures: 0, Errors: 0, Skipped: 0, Time elapsed: 0.018 sec
Running org.apache.directory.shared.asn1.primitives.OIDTest
Tests run: 12, Failures: 0, Errors: 0, Skipped: 0, Time elapsed: 0.158 sec
Running org.apache.directory.shared.asn1.ber.tlv.ValueTest
Tests run: 11, Failures: 0, Errors: 0, Skipped: 0, Time elapsed: 0.01 sec
Running org.apache.directory.shared.asn1.codec.stateful.examples.HexEncoderTest
Tests run: 8, Failures: 0, Errors: 0, Skipped: 0, Time elapsed: 0.007 sec

Results :

Tests run: 57, Failures: 0, Errors: 0, Skipped: 0

[INFO] [jar:jar]
[INFO] Building jar: /home/continuum/continuum-1.1/apps/continuum/webapp/WEB-INF/working-directory/6/asn1/target/shared-asn1-0.9.14-SNAPSHOT.jar
[INFO] [tools:verify-legal-files {execution: verify-legal-files}]
[INFO] Checking legal files in: shared-asn1-0.9.14-SNAPSHOT.jar
[INFO] [install:install]
[INFO] Installing /home/continuum/continuum-1.1/apps/continuum/webapp/WEB-INF/working-directory/6/asn1/target/shared-asn1-0.9.14-SNAPSHOT.jar
to /home/continuum/.m2/repository/org/apache/directory/shared/shared-asn1/0.9.14-SNAPSHOT/shared-asn1-0.9.14-SNAPSHOT.jar
[INFO] [deploy:deploy]
altDeploymentRepository = null
[INFO] Retrieving previous build number from apache.directory.snapshot.repo
Uploading: scpexe://vm094.oxylos.org/var/www/html/mirror-maven2/org/apache/directory/shared/shared-asn1/0.9.14-SNAPSHOT/shared-asn1-0.9.14-SNAPSHOT.jar
[INFO] Retrieving previous metadata from apache.directory.snapshot.repo
[INFO] Uploading repository metadata for: 'snapshot org.apache.directory.shared:shared-asn1:0.9.14-SNAPSHOT'
[INFO] Uploading project information for shared-asn1 0.9.14-SNAPSHOT
[INFO] Retrieving previous metadata from apache.directory.snapshot.repo
[INFO] Uploading repository metadata for: 'artifact org.apache.directory.shared:shared-asn1'
[INFO] ------------------------------------------------------------------------
[INFO] Building Apache Directory Protocol Ldap Shared Constants
[INFO]    task-segment: [clean, deploy]
[INFO] ------------------------------------------------------------------------
[INFO] [clean:clean]
[INFO] Deleting directory /home/continuum/continuum-1.1/apps/continuum/webapp/WEB-INF/working-directory/6/ldap-constants/target
[INFO] [remote-resources:process {execution: default}]
[INFO] [resources:resources]
[INFO] Using default encoding to copy filtered resources.
[INFO] [compiler:compile]
[INFO] Compiling 6 source files to /home/continuum/continuum-1.1/apps/continuum/webapp/WEB-INF/working-directory/6/ldap-constants/target/classes
[INFO] [resources:testResources]
[INFO] Using default encoding to copy filtered resources.
[INFO] [compiler:testCompile]
[INFO] No sources to compile
[INFO] [surefire:test]
[INFO] Surefire report directory: /home/continuum/continuum-1.1/apps/continuum/webapp/WEB-INF/working-directory/6/ldap-constants/target/surefire-reports

-------------------------------------------------------
 T E S T S
-------------------------------------------------------
There are no tests to run.

Results :

Tests run: 0, Failures: 0, Errors: 0, Skipped: 0

[INFO] [jar:jar]
[INFO] Building jar: /home/continuum/continuum-1.1/apps/continuum/webapp/WEB-INF/working-directory/6/ldap-constants/target/shared-ldap-constants-0.9.14-SNAPSHOT.jar
[INFO] [tools:verify-legal-files {execution: verify-legal-files}]
[INFO] Checking legal files in: shared-ldap-constants-0.9.14-SNAPSHOT.jar
[INFO] [install:install]
[INFO] Installing /home/continuum/continuum-1.1/apps/continuum/webapp/WEB-INF/working-directory/6/ldap-constants/target/shared-ldap-constants-0.9.14-SNAPSHOT.jar
to /home/continuum/.m2/repository/org/apache/directory/shared/shared-ldap-constants/0.9.14-SNAPSHOT/shared-ldap-constants-0.9.14-SNAPSHOT.jar
[INFO] [deploy:deploy]
altDeploymentRepository = null
[INFO] Retrieving previous build number from apache.directory.snapshot.repo
Uploading: scpexe://vm094.oxylos.org/var/www/html/mirror-maven2/org/apache/directory/shared/shared-ldap-constants/0.9.14-SNAPSHOT/shared-ldap-constants-0.9.14-SNAPSHOT.jar
[INFO] Retrieving previous metadata from apache.directory.snapshot.repo
[INFO] Uploading repository metadata for: 'artifact org.apache.directory.shared:shared-ldap-constants'
[INFO] Uploading project information for shared-ldap-constants 0.9.14-SNAPSHOT
[INFO] Retrieving previous metadata from apache.directory.snapshot.repo
[INFO] Uploading repository metadata for: 'snapshot org.apache.directory.shared:shared-ldap-constants:0.9.14-SNAPSHOT'
[INFO] ------------------------------------------------------------------------
[INFO] Building Apache Directory Protocol Ldap Shared
[INFO]    task-segment: [clean, deploy]
[INFO] ------------------------------------------------------------------------
[INFO] [clean:clean]
[INFO] Deleting directory /home/continuum/continuum-1.1/apps/continuum/webapp/WEB-INF/working-directory/6/ldap/target
[INFO] [antrun:run {execution: default}]
[INFO] Executing tasks
[INFO] Executed tasks
[INFO] [antlr:generate {execution: default}]
[INFO] grammar: /home/continuum/continuum-1.1/apps/continuum/webapp/WEB-INF/working-directory/6/ldap/src/main/antlr/ACIItem.g
[INFO] grammar: /home/continuum/continuum-1.1/apps/continuum/webapp/WEB-INF/working-directory/6/ldap/src/main/antlr/ACIItemChecker.g
ANTLR Parser Generator   Version 2.7.4   1989-2004 jGuru.com
ANTLR Parser Generator   Version 2.7.4   1989-2004 jGuru.com
[INFO] grammar: /home/continuum/continuum-1.1/apps/continuum/webapp/WEB-INF/working-directory/6/ldap/src/main/antlr/schema-extension.g
[INFO] grammar: /home/continuum/continuum-1.1/apps/continuum/webapp/WEB-INF/working-directory/6/ldap/src/main/antlr/schema-qdstring.g
[INFO] grammar: /home/continuum/continuum-1.1/apps/continuum/webapp/WEB-INF/working-directory/6/ldap/src/main/antlr/schema-value.g
ANTLR Parser Generator   Version 2.7.4   1989-2004 jGuru.com
ANTLR Parser Generator   Version 2.7.4   1989-2004 jGuru.com
ANTLR Parser Generator   Version 2.7.4   1989-2004 jGuru.com
[INFO] grammar: /home/continuum/continuum-1.1/apps/continuum/webapp/WEB-INF/working-directory/6/ldap/src/main/antlr/schema.g
ANTLR Parser Generator   Version 2.7.4   1989-2004 jGuru.com
[INFO] grammar: /home/continuum/continuum-1.1/apps/continuum/webapp/WEB-INF/working-directory/6/ldap/src/main/antlr/subtree-specification.g
ANTLR Parser Generator   Version 2.7.4   1989-2004 jGuru.com
[INFO] grammar: /home/continuum/continuum-1.1/apps/continuum/webapp/WEB-INF/working-directory/6/ldap/src/main/antlr/SubtreeSpecificationChecker.g
ANTLR Parser Generator   Version 2.7.4   1989-2004 jGuru.com
[INFO] grammar: /home/continuum/continuum-1.1/apps/continuum/webapp/WEB-INF/working-directory/6/ldap/src/main/antlr/TriggerSpecification.g
ANTLR Parser Generator   Version 2.7.4   1989-2004 jGuru.com
[INFO] [remote-resources:process {execution: default}]
[INFO] [resources:resources]
[INFO] Using default encoding to copy filtered resources.
[INFO] [compiler:compile]
[INFO] Compiling 571 source files to /home/continuum/continuum-1.1/apps/continuum/webapp/WEB-INF/working-directory/6/ldap/target/classes
[INFO] ------------------------------------------------------------------------
[ERROR] BUILD FAILURE
[INFO] ------------------------------------------------------------------------
[INFO] Compilation failure

/home/continuum/continuum-1.1/apps/continuum/webapp/WEB-INF/working-directory/6/ldap/target/generated-sources/antlr/org/apache/directory/shared/ldap/schema/syntax/AntlrSchemaLexer.java:[30,53]
package org.apache.directory.shared.ldap.schema.parser does not exist

/home/continuum/continuum-1.1/apps/continuum/webapp/WEB-INF/working-directory/6/ldap/target/generated-sources/antlr/org/apache/directory/shared/ldap/schema/syntax/AntlrSchemaTokenTypes.java:[30,53]
package org.apache.directory.shared.ldap.schema.parser does not exist

/home/continuum/continuum-1.1/apps/continuum/webapp/WEB-INF/working-directory/6/ldap/target/generated-sources/antlr/org/apache/directory/shared/ldap/schema/syntax/AntlrSchemaQdstringParser.java:[27,53]
package org.apache.directory.shared.ldap.schema.parser does not exist

/home/continuum/continuum-1.1/apps/continuum/webapp/WEB-INF/working-directory/6/ldap/target/generated-sources/antlr/org/apache/directory/shared/ldap/schema/syntax/AntlrSchemaQdstringTokenTypes.java:[27,53]
package org.apache.directory.shared.ldap.schema.parser does not exist

/home/continuum/continuum-1.1/apps/continuum/webapp/WEB-INF/working-directory/6/ldap/target/generated-sources/antlr/org/apache/directory/shared/ldap/schema/syntax/AntlrSchemaQdstringParser.java:[54,12]
cannot find symbol
symbol  : class ParserMonitor
location: class org.apache.directory.shared.ldap.schema.syntax.AntlrSchemaQdstringParser

/home/continuum/continuum-1.1/apps/continuum/webapp/WEB-INF/working-directory/6/ldap/target/generated-sources/antlr/org/apache/directory/shared/ldap/schema/syntax/AntlrSchemaQdstringParser.java:[55,34]
cannot find symbol
symbol  : class ParserMonitor
location: class org.apache.directory.shared.ldap.schema.syntax.AntlrSchemaQdstringParser

/home/continuum/continuum-1.1/apps/continuum/webapp/WEB-INF/working-directory/6/ldap/target/generated-sources/antlr/org/apache/directory/shared/ldap/subtree/AntlrSubtreeSpecificationParserTokenTypes.java:[44,46]
cannot find symbol
symbol  : class OidNormalizer
location: package org.apache.directory.shared.ldap.schema

/home/continuum/continuum-1.1/apps/continuum/webapp/WEB-INF/working-directory/6/ldap/target/generated-sources/antlr/org/apache/directory/shared/ldap/schema/syntax/AntlrSchemaParser.java:[30,53]
package org.apache.directory.shared.ldap.schema.parser does not exist

/home/continuum/continuum-1.1/apps/continuum/webapp/WEB-INF/working-directory/6/ldap/target/generated-sources/antlr/org/apache/directory/shared/ldap/schema/syntax/AntlrSchemaParser.java:[58,12]
cannot find symbol
symbol  : class ParserMonitor
location: class org.apache.directory.shared.ldap.schema.syntax.AntlrSchemaParser

/home/continuum/continuum-1.1/apps/continuum/webapp/WEB-INF/working-directory/6/ldap/target/generated-sources/antlr/org/apache/directory/shared/ldap/schema/syntax/AntlrSchemaParser.java:[60,34]
cannot find symbol
symbol  : class ParserMonitor
location: class org.apache.directory.shared.ldap.schema.syntax.AntlrSchemaParser

/home/continuum/continuum-1.1/apps/continuum/webapp/WEB-INF/working-directory/6/ldap/target/generated-sources/antlr/org/apache/directory/shared/ldap/schema/syntax/AntlrSchemaParser.java:[176,14]
cannot find symbol
symbol  : class OpenLdapObjectIdentifierMacro
location: class org.apache.directory.shared.ldap.schema.syntax.AntlrSchemaParser

/home/continuum/continuum-1.1/apps/continuum/webapp/WEB-INF/working-directory/6/ldap/target/generated-sources/antlr/org/apache/directory/shared/ldap/schema/syntax/AntlrSchemaParser.java:[197,14]
cannot find symbol
symbol  : class AttributeTypeDescription
location: class org.apache.directory.shared.ldap.schema.syntax.AntlrSchemaParser

/home/continuum/continuum-1.1/apps/continuum/webapp/WEB-INF/working-directory/6/ldap/target/generated-sources/antlr/org/apache/directory/shared/ldap/schema/syntax/AntlrSchemaParser.java:[213,14]
cannot find symbol
symbol  : class ObjectClassDescription
location: class org.apache.directory.shared.ldap.schema.syntax.AntlrSchemaParser

/home/continuum/continuum-1.1/apps/continuum/webapp/WEB-INF/working-directory/6/ldap/target/generated-sources/antlr/org/apache/directory/shared/ldap/schema/syntax/AntlrSchemaParser.java:[251,14]
cannot find symbol
symbol  : class ObjectClassDescription
location: class org.apache.directory.shared.ldap.schema.syntax.AntlrSchemaParser

/home/continuum/continuum-1.1/apps/continuum/webapp/WEB-INF/working-directory/6/ldap/target/generated-sources/antlr/org/apache/directory/shared/ldap/schema/syntax/AntlrSchemaParser.java:[422,14]
cannot find symbol
symbol  : class AttributeTypeDescription
location: class org.apache.directory.shared.ldap.schema.syntax.AntlrSchemaParser

/home/continuum/continuum-1.1/apps/continuum/webapp/WEB-INF/working-directory/6/ldap/target/generated-sources/antlr/org/apache/directory/shared/ldap/schema/syntax/AntlrSchemaParser.java:[663,14]
cannot find symbol
symbol  : class LdapSyntaxDescription
location: class org.apache.directory.shared.ldap.schema.syntax.AntlrSchemaParser

/home/continuum/continuum-1.1/apps/continuum/webapp/WEB-INF/working-directory/6/ldap/target/generated-sources/antlr/org/apache/directory/shared/ldap/schema/syntax/AntlrSchemaParser.java:[740,14]
cannot find symbol
symbol  : class MatchingRuleDescription
location: class org.apache.directory.shared.ldap.schema.syntax.AntlrSchemaParser

/home/continuum/continuum-1.1/apps/continuum/webapp/WEB-INF/working-directory/6/ldap/target/generated-sources/antlr/org/apache/directory/shared/ldap/schema/syntax/AntlrSchemaParser.java:[846,14]
cannot find symbol
symbol  : class MatchingRuleUseDescription
location: class org.apache.directory.shared.ldap.schema.syntax.AntlrSchemaParser

/home/continuum/continuum-1.1/apps/continuum/webapp/WEB-INF/working-directory/6/ldap/target/generated-sources/antlr/org/apache/directory/shared/ldap/schema/syntax/AntlrSchemaParser.java:[955,14]
cannot find symbol
symbol  : class DITContentRuleDescription
location: class org.apache.directory.shared.ldap.schema.syntax.AntlrSchemaParser

/home/continuum/continuum-1.1/apps/continuum/webapp/WEB-INF/working-directory/6/ldap/target/generated-sources/antlr/org/apache/directory/shared/ldap/schema/syntax/AntlrSchemaParser.java:[1087,14]
cannot find symbol
symbol  : class DITStructureRuleDescription
location: class org.apache.directory.shared.ldap.schema.syntax.AntlrSchemaParser

/home/continuum/continuum-1.1/apps/continuum/webapp/WEB-INF/working-directory/6/ldap/target/generated-sources/antlr/org/apache/directory/shared/ldap/schema/syntax/AntlrSchemaParser.java:[1205,14]
cannot find symbol
symbol  : class NameFormDescription
location: class org.apache.directory.shared.ldap.schema.syntax.AntlrSchemaParser

/home/continuum/continuum-1.1/apps/continuum/webapp/WEB-INF/working-directory/6/ldap/target/generated-sources/antlr/org/apache/directory/shared/ldap/schema/syntax/AntlrSchemaParser.java:[1346,14]
cannot find symbol
symbol  : class ComparatorDescription
location: class org.apache.directory.shared.ldap.schema.syntax.AntlrSchemaParser

/home/continuum/continuum-1.1/apps/continuum/webapp/WEB-INF/working-directory/6/ldap/target/generated-sources/antlr/org/apache/directory/shared/ldap/schema/syntax/AntlrSchemaParser.java:[1451,14]
cannot find symbol
symbol  : class NormalizerDescription
location: class org.apache.directory.shared.ldap.schema.syntax.AntlrSchemaParser

/home/continuum/continuum-1.1/apps/continuum/webapp/WEB-INF/working-directory/6/ldap/target/generated-sources/antlr/org/apache/directory/shared/ldap/schema/syntax/AntlrSchemaParser.java:[1556,14]
cannot find symbol
symbol  : class SyntaxCheckerDescription
location: class org.apache.directory.shared.ldap.schema.syntax.AntlrSchemaParser

/home/continuum/continuum-1.1/apps/continuum/webapp/WEB-INF/working-directory/6/ldap/target/generated-sources/antlr/org/apache/directory/shared/ldap/aci/AntlrACIItemParserTokenTypes.java:[57,46]
cannot find symbol
symbol  : class OidNormalizer
location: package org.apache.directory.shared.ldap.schema

/home/continuum/continuum-1.1/apps/continuum/webapp/WEB-INF/working-directory/6/ldap/target/generated-sources/antlr/org/apache/directory/shared/ldap/aci/AntlrACIItemParser.java:[57,46]
cannot find symbol
symbol  : class OidNormalizer
location: package org.apache.directory.shared.ldap.schema

/home/continuum/continuum-1.1/apps/continuum/webapp/WEB-INF/working-directory/6/ldap/target/generated-sources/antlr/org/apache/directory/shared/ldap/aci/AntlrACIItemParser.java:[108,24]
cannot find symbol
symbol  : class OidNormalizer
location: class org.apache.directory.shared.ldap.aci.AntlrACIItemParser

/home/continuum/continuum-1.1/apps/continuum/webapp/WEB-INF/working-directory/6/ldap/target/generated-sources/antlr/org/apache/directory/shared/ldap/aci/AntlrACIItemParser.java:[127,34]
cannot find symbol
symbol  : class OidNormalizer
location: class org.apache.directory.shared.ldap.aci.AntlrACIItemParser

/home/continuum/continuum-1.1/apps/continuum/webapp/WEB-INF/working-directory/6/ldap/target/generated-sources/antlr/org/apache/directory/shared/ldap/subtree/AntlrSubtreeSpecificationParser.java:[44,46]
cannot find symbol
symbol  : class OidNormalizer
location: package org.apache.directory.shared.ldap.schema

/home/continuum/continuum-1.1/apps/continuum/webapp/WEB-INF/working-directory/6/ldap/target/generated-sources/antlr/org/apache/directory/shared/ldap/subtree/AntlrSubtreeSpecificationParser.java:[86,24]
cannot find symbol
symbol  : class OidNormalizer
location: class org.apache.directory.shared.ldap.subtree.AntlrSubtreeSpecificationParser

/home/continuum/continuum-1.1/apps/continuum/webapp/WEB-INF/working-directory/6/ldap/target/generated-sources/antlr/org/apache/directory/shared/ldap/subtree/AntlrSubtreeSpecificationParser.java:[93,34]
cannot find symbol
symbol  : class OidNormalizer
location: class org.apache.directory.shared.ldap.subtree.AntlrSubtreeSpecificationParser

/home/continuum/continuum-1.1/apps/continuum/webapp/WEB-INF/working-directory/6/ldap/target/generated-sources/antlr/org/apache/directory/shared/ldap/schema/syntax/AntlrSchemaValueParser.java:[27,53]
package org.apache.directory.shared.ldap.schema.parser does not exist

/home/continuum/continuum-1.1/apps/continuum/webapp/WEB-INF/working-directory/6/ldap/target/generated-sources/antlr/org/apache/directory/shared/ldap/schema/syntax/AntlrSchemaValueTokenTypes.java:[27,53]
package org.apache.directory.shared.ldap.schema.parser does not exist

/home/continuum/continuum-1.1/apps/continuum/webapp/WEB-INF/working-directory/6/ldap/target/generated-sources/antlr/org/apache/directory/shared/ldap/schema/syntax/AntlrSchemaValueParser.java:[54,12]
cannot find symbol
symbol  : class ParserMonitor
location: class org.apache.directory.shared.ldap.schema.syntax.AntlrSchemaValueParser

/home/continuum/continuum-1.1/apps/continuum/webapp/WEB-INF/working-directory/6/ldap/target/generated-sources/antlr/org/apache/directory/shared/ldap/schema/syntax/AntlrSchemaValueParser.java:[55,34]
cannot find symbol
symbol  : class ParserMonitor
location: class org.apache.directory.shared.ldap.schema.syntax.AntlrSchemaValueParser

/home/continuum/continuum-1.1/apps/continuum/webapp/WEB-INF/working-directory/6/ldap/target/generated-sources/antlr/org/apache/directory/shared/ldap/schema/syntax/AntlrSchemaValueLexer.java:[27,53]
package org.apache.directory.shared.ldap.schema.parser does not exist

/home/continuum/continuum-1.1/apps/continuum/webapp/WEB-INF/working-directory/6/ldap/target/generated-sources/antlr/org/apache/directory/shared/ldap/aci/AntlrACIItemLexer.java:[57,46]
cannot find symbol
symbol  : class OidNormalizer
location: package org.apache.directory.shared.ldap.schema

/home/continuum/continuum-1.1/apps/continuum/webapp/WEB-INF/working-directory/6/ldap/target/generated-sources/antlr/org/apache/directory/shared/ldap/subtree/AntlrSubtreeSpecificationLexer.java:[44,46]
cannot find symbol
symbol  : class OidNormalizer
location: package org.apache.directory.shared.ldap.schema

/home/continuum/continuum-1.1/apps/continuum/webapp/WEB-INF/working-directory/6/ldap/target/generated-sources/antlr/org/apache/directory/shared/ldap/schema/syntax/AntlrSchemaQdstringLexer.java:[27,53]
package org.apache.directory.shared.ldap.schema.parser does not exist

/home/continuum/continuum-1.1/apps/continuum/webapp/WEB-INF/working-directory/6/ldap/target/generated-sources/antlr/org/apache/directory/shared/ldap/schema/syntax/AntlrSchemaParser.java:[139,2]
cannot find symbol
symbol  : class AttributeTypeDescription
location: class org.apache.directory.shared.ldap.schema.syntax.AntlrSchemaParser

/home/continuum/continuum-1.1/apps/continuum/webapp/WEB-INF/working-directory/6/ldap/target/generated-sources/antlr/org/apache/directory/shared/ldap/schema/syntax/AntlrSchemaParser.java:[140,2]
cannot find symbol
symbol  : class ObjectClassDescription
location: class org.apache.directory.shared.ldap.schema.syntax.AntlrSchemaParser

/home/continuum/continuum-1.1/apps/continuum/webapp/WEB-INF/working-directory/6/ldap/target/generated-sources/antlr/org/apache/directory/shared/ldap/schema/syntax/AntlrSchemaParser.java:[141,2]
cannot find symbol
symbol  : class OpenLdapObjectIdentifierMacro
location: class org.apache.directory.shared.ldap.schema.syntax.AntlrSchemaParser

/home/continuum/continuum-1.1/apps/continuum/webapp/WEB-INF/working-directory/6/ldap/target/generated-sources/antlr/org/apache/directory/shared/ldap/schema/syntax/AntlrSchemaParser.java:[177,2]
cannot find symbol
symbol  : class OpenLdapObjectIdentifierMacro
location: class org.apache.directory.shared.ldap.schema.syntax.AntlrSchemaParser

/home/continuum/continuum-1.1/apps/continuum/webapp/WEB-INF/working-directory/6/ldap/target/generated-sources/antlr/org/apache/directory/shared/ldap/schema/syntax/AntlrSchemaParser.java:[189,14]
cannot find symbol
symbol  : class OpenLdapObjectIdentifierMacro
location: class org.apache.directory.shared.ldap.schema.syntax.AntlrSchemaParser

/home/continuum/continuum-1.1/apps/continuum/webapp/WEB-INF/working-directory/6/ldap/target/generated-sources/antlr/org/apache/directory/shared/ldap/schema/syntax/AntlrSchemaParser.java:[198,2]
cannot find symbol
symbol  : class AttributeTypeDescription
location: class org.apache.directory.shared.ldap.schema.syntax.AntlrSchemaParser

/home/continuum/continuum-1.1/apps/continuum/webapp/WEB-INF/working-directory/6/ldap/target/generated-sources/antlr/org/apache/directory/shared/ldap/schema/syntax/AntlrSchemaParser.java:[214,2]
cannot find symbol
symbol  : class ObjectClassDescription
location: class org.apache.directory.shared.ldap.schema.syntax.AntlrSchemaParser

/home/continuum/continuum-1.1/apps/continuum/webapp/WEB-INF/working-directory/6/ldap/target/generated-sources/antlr/org/apache/directory/shared/ldap/schema/syntax/AntlrSchemaParser.java:[252,2]
cannot find symbol
symbol  : class ObjectClassDescription
location: class org.apache.directory.shared.ldap.schema.syntax.AntlrSchemaParser

/home/continuum/continuum-1.1/apps/continuum/webapp/WEB-INF/working-directory/6/ldap/target/generated-sources/antlr/org/apache/directory/shared/ldap/schema/syntax/AntlrSchemaParser.java:[252,35]
cannot find symbol
symbol  : class ObjectClassDescription
location: class org.apache.directory.shared.ldap.schema.syntax.AntlrSchemaParser

/home/continuum/continuum-1.1/apps/continuum/webapp/WEB-INF/working-directory/6/ldap/target/generated-sources/antlr/org/apache/directory/shared/ldap/schema/syntax/AntlrSchemaParser.java:[423,2]
cannot find symbol
symbol  : class AttributeTypeDescription
location: class org.apache.directory.shared.ldap.schema.syntax.AntlrSchemaParser

/home/continuum/continuum-1.1/apps/continuum/webapp/WEB-INF/working-directory/6/ldap/target/generated-sources/antlr/org/apache/directory/shared/ldap/schema/syntax/AntlrSchemaParser.java:[423,37]
cannot find symbol
symbol  : class AttributeTypeDescription
location: class org.apache.directory.shared.ldap.schema.syntax.AntlrSchemaParser

/home/continuum/continuum-1.1/apps/continuum/webapp/WEB-INF/working-directory/6/ldap/target/generated-sources/antlr/org/apache/directory/shared/ldap/schema/syntax/AntlrSchemaParser.java:[664,2]
cannot find symbol
symbol  : class LdapSyntaxDescription
location: class org.apache.directory.shared.ldap.schema.syntax.AntlrSchemaParser

/home/continuum/continuum-1.1/apps/continuum/webapp/WEB-INF/working-directory/6/ldap/target/generated-sources/antlr/org/apache/directory/shared/ldap/schema/syntax/AntlrSchemaParser.java:[664,34]
cannot find symbol
symbol  : class LdapSyntaxDescription
location: class org.apache.directory.shared.ldap.schema.syntax.AntlrSchemaParser

/home/continuum/continuum-1.1/apps/continuum/webapp/WEB-INF/working-directory/6/ldap/target/generated-sources/antlr/org/apache/directory/shared/ldap/schema/syntax/AntlrSchemaParser.java:[741,2]
cannot find symbol
symbol  : class MatchingRuleDescription
location: class org.apache.directory.shared.ldap.schema.syntax.AntlrSchemaParser

/home/continuum/continuum-1.1/apps/continuum/webapp/WEB-INF/working-directory/6/ldap/target/generated-sources/antlr/org/apache/directory/shared/ldap/schema/syntax/AntlrSchemaParser.java:[741,36]
cannot find symbol
symbol  : class MatchingRuleDescription
location: class org.apache.directory.shared.ldap.schema.syntax.AntlrSchemaParser

/home/continuum/continuum-1.1/apps/continuum/webapp/WEB-INF/working-directory/6/ldap/target/generated-sources/antlr/org/apache/directory/shared/ldap/schema/syntax/AntlrSchemaParser.java:[847,2]
cannot find symbol
symbol  : class MatchingRuleUseDescription
location: class org.apache.directory.shared.ldap.schema.syntax.AntlrSchemaParser

/home/continuum/continuum-1.1/apps/continuum/webapp/WEB-INF/working-directory/6/ldap/target/generated-sources/antlr/org/apache/directory/shared/ldap/schema/syntax/AntlrSchemaParser.java:[847,40]
cannot find symbol
symbol  : class MatchingRuleUseDescription
location: class org.apache.directory.shared.ldap.schema.syntax.AntlrSchemaParser

/home/continuum/continuum-1.1/apps/continuum/webapp/WEB-INF/working-directory/6/ldap/target/generated-sources/antlr/org/apache/directory/shared/ldap/schema/syntax/AntlrSchemaParser.java:[956,2]
cannot find symbol
symbol  : class DITContentRuleDescription
location: class org.apache.directory.shared.ldap.schema.syntax.AntlrSchemaParser

/home/continuum/continuum-1.1/apps/continuum/webapp/WEB-INF/working-directory/6/ldap/target/generated-sources/antlr/org/apache/directory/shared/ldap/schema/syntax/AntlrSchemaParser.java:[956,39]
cannot find symbol
symbol  : class DITContentRuleDescription
location: class org.apache.directory.shared.ldap.schema.syntax.AntlrSchemaParser

/home/continuum/continuum-1.1/apps/continuum/webapp/WEB-INF/working-directory/6/ldap/target/generated-sources/antlr/org/apache/directory/shared/ldap/schema/syntax/AntlrSchemaParser.java:[1088,2]
cannot find symbol
symbol  : class DITStructureRuleDescription
location: class org.apache.directory.shared.ldap.schema.syntax.AntlrSchemaParser

/home/continuum/continuum-1.1/apps/continuum/webapp/WEB-INF/working-directory/6/ldap/target/generated-sources/antlr/org/apache/directory/shared/ldap/schema/syntax/AntlrSchemaParser.java:[1088,41]
cannot find symbol
symbol  : class DITStructureRuleDescription
location: class org.apache.directory.shared.ldap.schema.syntax.AntlrSchemaParser

/home/continuum/continuum-1.1/apps/continuum/webapp/WEB-INF/working-directory/6/ldap/target/generated-sources/antlr/org/apache/directory/shared/ldap/schema/syntax/AntlrSchemaParser.java:[1206,2]
cannot find symbol
symbol  : class NameFormDescription
location: class org.apache.directory.shared.ldap.schema.syntax.AntlrSchemaParser

/home/continuum/continuum-1.1/apps/continuum/webapp/WEB-INF/working-directory/6/ldap/target/generated-sources/antlr/org/apache/directory/shared/ldap/schema/syntax/AntlrSchemaParser.java:[1206,32]
cannot find symbol
symbol  : class NameFormDescription
location: class org.apache.directory.shared.ldap.schema.syntax.AntlrSchemaParser

/home/continuum/continuum-1.1/apps/continuum/webapp/WEB-INF/working-directory/6/ldap/target/generated-sources/antlr/org/apache/directory/shared/ldap/schema/syntax/AntlrSchemaParser.java:[1347,2]
cannot find symbol
symbol  : class ComparatorDescription
location: class org.apache.directory.shared.ldap.schema.syntax.AntlrSchemaParser

/home/continuum/continuum-1.1/apps/continuum/webapp/WEB-INF/working-directory/6/ldap/target/generated-sources/antlr/org/apache/directory/shared/ldap/schema/syntax/AntlrSchemaParser.java:[1347,33]
cannot find symbol
symbol  : class ComparatorDescription
location: class org.apache.directory.shared.ldap.schema.syntax.AntlrSchemaParser

/home/continuum/continuum-1.1/apps/continuum/webapp/WEB-INF/working-directory/6/ldap/target/generated-sources/antlr/org/apache/directory/shared/ldap/schema/syntax/AntlrSchemaParser.java:[1452,2]
cannot find symbol
symbol  : class NormalizerDescription
location: class org.apache.directory.shared.ldap.schema.syntax.AntlrSchemaParser

/home/continuum/continuum-1.1/apps/continuum/webapp/WEB-INF/working-directory/6/ldap/target/generated-sources/antlr/org/apache/directory/shared/ldap/schema/syntax/AntlrSchemaParser.java:[1452,33]
cannot find symbol
symbol  : class NormalizerDescription
location: class org.apache.directory.shared.ldap.schema.syntax.AntlrSchemaParser

/home/continuum/continuum-1.1/apps/continuum/webapp/WEB-INF/working-directory/6/ldap/target/generated-sources/antlr/org/apache/directory/shared/ldap/schema/syntax/AntlrSchemaParser.java:[1557,2]
cannot find symbol
symbol  : class SyntaxCheckerDescription
location: class org.apache.directory.shared.ldap.schema.syntax.AntlrSchemaParser

/home/continuum/continuum-1.1/apps/continuum/webapp/WEB-INF/working-directory/6/ldap/target/generated-sources/antlr/org/apache/directory/shared/ldap/schema/syntax/AntlrSchemaParser.java:[1557,37]
cannot find symbol
symbol  : class SyntaxCheckerDescription
location: class org.apache.directory.shared.ldap.schema.syntax.AntlrSchemaParser


[INFO] ------------------------------------------------------------------------
[INFO] For more information, run Maven with the -e switch
[INFO] ------------------------------------------------------------------------
[INFO] Total time: 1 minute 13 seconds
[INFO] Finished at: Tue Jan 20 22:31:26 EST 2009
[INFO] Final Memory: 57M/508M
[INFO] ------------------------------------------------------------------------

****************************************************************************



Mime
View raw message