directory-notifications mailing list archives

Site index · List index
Message view « Date » · « Thread »
Top « Date » · « Thread »
From Continuum VMBuild Server <contin...@vm094.oxylos.org>
Subject [continuum] BUILD FAILURE: Apache Directory Studio - Apache Directory Studio - Build Def: Build and deployment of studio snapshot distributions
Date Wed, 21 Jan 2009 19:32:44 GMT
Online report : http://vm094.oxylos.org/continuum/buildResult.action?buildId=3023&projectId=23

Build statistics:
  State: Failed
  Previous State: Ok
  Started at: Wed 21 Jan 2009 14:30:12 -0500
  Finished at: Wed 21 Jan 2009 14:32:16 -0500
  Total time: 2m 4s
  Build Trigger: Schedule
  Build Number: 323
  Exit code: 1
  Building machine hostname: vm094.oxylos.org
  Operating system : Linux(unknown)
  Java Home version : 
          java version "1.6.0_06"
          Java(TM) SE Runtime Environment (build 1.6.0_06-b02)
          Java HotSpot(TM) Client VM (build 10.0-b22, mixed mode, sharing)
        
  Builder version :
          Maven version: 2.0.9
          Java version: 1.6.0_06
          OS name: "linux" version: "2.6.18-92.1.10.el5" arch: "i386" Family: "unix"
    
****************************************************************************
SCM Changes:
****************************************************************************
Changed: no author @ no date
Comment: no comment
Files changed:
  apacheds/src/main/java/org/apache/directory/studio/apacheds/dialogs/messages_fr.properties ( no revision )
  apacheds/src/main/java/org/apache/directory/studio/apacheds/actions/messages.properties ( no revision )
  apacheds/src/main/java/org/apache/directory/studio/apacheds/actions/messages_fr.properties ( no revision )

****************************************************************************
Dependencies Changes:
****************************************************************************
No dependencies changed


****************************************************************************
Build Defintion:
****************************************************************************
POM filename: pom.xml
Goals: clean deploy   
Arguments: -Pintegration-tests,linux-x86,linux-x86_64,linux-ppc,macosx,win32,CI --batch-mode -DaltDeploymentRepository=id::default::scpexe://vm094.oxylos.org/var/www/html/mirror-maven2/
Build Fresh: false
Always Build: false
Default Build Definition: true
Schedule: EVERY_30_MINUTES
Description: Build and deployment of studio snapshot distributions

****************************************************************************
Test Summary:
****************************************************************************
Tests: 519
Failures: 0
Total time: 1.1140001


****************************************************************************
Output:
****************************************************************************
[INFO] Scanning for projects...
[INFO] Reactor build order: 
[INFO]   Apache Directory Studio
[INFO]   Apache Directory Studio Repository
[INFO]   Apache Directory Studio DSML Parser
[INFO]   Apache Directory Studio Jars
[INFO]   Apache Directory Studio LDIF Parser
[INFO]   Apache Directory Studio Connection Core
[INFO]   Apache Directory Studio LDAP Browser Core
[INFO]   Apache Directory Studio Connection UI
[INFO]   Apache Directory Studio LDAP Browser Common
[INFO]   Apache Directory Studio Value Editors
[INFO]   Apache Directory Studio ACI Item Editor
[INFO]   Apache Directory Studio Schema Editor
[INFO]   Apache Directory Studio Schema Editor Feature
[INFO]   Apache Directory Studio RCP
[INFO]   Apache Directory Studio RCP Feature
[INFO]   Apache Directory Studio LDIF Editor
[INFO]   Apache Directory Studio LDIF Editor Feature
[INFO]   Apache Directory Studio LDAP Browser UI
[INFO]   Apache Directory Studio LDAP Browser Feature
[INFO]   Apache Directory Studio Apache DS Configuration
[INFO]   Apache Directory Studio Apache DS Configuration Feature
[INFO]   Apache Directory Studio Apache DS Launcher
[INFO]   Apache Directory Studio Apache DS
[INFO]   Apache Directory Studio Apache DS Feature
[INFO]   Apache Directory Studio Core Integration Tests
[INFO]   Apache Directory Studio UI Integration Tests
[INFO]   Apache Directory Studio Schema Editor Help
[INFO]   Apache Directory Studio LDIF Editor Help
[INFO]   Apache Directory Studio LDAP Browser Help
[INFO]   Apache Directory Studio Apache DS Configuration Help
[INFO]   Apache Directory Studio RCP Help
[INFO]   Apache Directory Studio Apache DS Help
[INFO]   Apache Directory Studio Update Site
[INFO]   Apache Directory Studio Build
[INFO] ------------------------------------------------------------------------
[INFO] Building Apache Directory Studio
[INFO]    task-segment: [clean, deploy]
[INFO] ------------------------------------------------------------------------
[INFO] [clean:clean]
[INFO] Deleting directory /home/continuum/continuum-1.1/apps/continuum/webapp/WEB-INF/working-directory/23/target
[INFO] Setting property: classpath.resource.loader.class => 'org.codehaus.plexus.velocity.ContextClassLoaderResourceLoader'.
[INFO] Setting property: velocimacro.messages.on => 'false'.
[INFO] Setting property: resource.loader => 'classpath'.
[INFO] Setting property: resource.manager.logwhenfound => 'false'.
[INFO] [remote-resources:process {execution: default}]
[INFO] [site:attach-descriptor]
[INFO] Unable to load parent project from a relative path: Could not find the model file '/home/continuum/continuum-1.1/apps/continuum/webapp/WEB-INF/working-directory/pom.xml'. for project unknown
[INFO] Parent project loaded from repository.
[INFO] [tools:verify-legal-files {execution: verify-legal-files}]
[INFO] [install:install]
[INFO] Installing /home/continuum/continuum-1.1/apps/continuum/webapp/WEB-INF/working-directory/23/pom.xml to /home/continuum/.m2/repository/org/apache/directory/studio/parent/1.4.0-SNAPSHOT/parent-1.4.0-SNAPSHOT.pom
[INFO] [deploy:deploy]
altDeploymentRepository = id::default::scpexe://vm094.oxylos.org/var/www/html/mirror-maven2/
[INFO] Using alternate deployment repository id::default::scpexe://vm094.oxylos.org/var/www/html/mirror-maven2/
[INFO] Retrieving previous build number from id
Uploading: scpexe://vm094.oxylos.org/var/www/html/mirror-maven2//org/apache/directory/studio/parent/1.4.0-SNAPSHOT/parent-1.4.0-SNAPSHOT.pom
[INFO] Retrieving previous metadata from id
[INFO] Uploading repository metadata for: 'artifact org.apache.directory.studio:parent'
[INFO] Retrieving previous metadata from id
[INFO] Uploading repository metadata for: 'snapshot org.apache.directory.studio:parent:1.4.0-SNAPSHOT'
[INFO] Uploading site descriptor for parent 1.4.0-SNAPSHOT site.xml
[INFO] ------------------------------------------------------------------------
[INFO] Building Apache Directory Studio Repository
[INFO]    task-segment: [clean, deploy]
[INFO] ------------------------------------------------------------------------
[INFO] [clean:clean]
[INFO] Deleting directory /home/continuum/continuum-1.1/apps/continuum/webapp/WEB-INF/working-directory/23/repository/target
[INFO] [remote-resources:process {execution: default}]
[INFO] [site:attach-descriptor]
[INFO] [tools:verify-legal-files {execution: verify-legal-files}]
[INFO] [install:install]
[INFO] Installing /home/continuum/continuum-1.1/apps/continuum/webapp/WEB-INF/working-directory/23/repository/pom.xml to /home/continuum/.m2/repository/org/apache/directory/studio/repository/1.4.0-SNAPSHOT/repository-1.4.0-SNAPSHOT.pom
[INFO] [deploy:deploy]
altDeploymentRepository = id::default::scpexe://vm094.oxylos.org/var/www/html/mirror-maven2/
[INFO] Using alternate deployment repository id::default::scpexe://vm094.oxylos.org/var/www/html/mirror-maven2/
[INFO] Retrieving previous build number from id
Uploading: scpexe://vm094.oxylos.org/var/www/html/mirror-maven2//org/apache/directory/studio/repository/1.4.0-SNAPSHOT/repository-1.4.0-SNAPSHOT.pom
[INFO] Retrieving previous metadata from id
[INFO] Uploading repository metadata for: 'artifact org.apache.directory.studio:repository'
[INFO] Uploading site descriptor for repository 1.4.0-SNAPSHOT site.xml
[INFO] Retrieving previous metadata from id
[INFO] Uploading repository metadata for: 'snapshot org.apache.directory.studio:repository:1.4.0-SNAPSHOT'
[INFO] ------------------------------------------------------------------------
[INFO] Building Apache Directory Studio DSML Parser
[INFO]    task-segment: [clean, deploy]
[INFO] ------------------------------------------------------------------------
[INFO] [clean:clean]
[INFO] Deleting directory /home/continuum/continuum-1.1/apps/continuum/webapp/WEB-INF/working-directory/23/studio-dsml-parser/target
[INFO] snapshot org.apache.directory.shared:shared-ldap:0.9.14-SNAPSHOT: checking for updates from apache.snapshots
[INFO] snapshot org.apache.directory.shared:shared-parent:0.9.14-SNAPSHOT: checking for updates from apache.snapshots
[INFO] snapshot org.apache.directory.shared:shared-asn1:0.9.14-SNAPSHOT: checking for updates from apache.snapshots
[INFO] snapshot org.apache.directory.shared:shared-ldap-constants:0.9.14-SNAPSHOT: checking for updates from apache.snapshots
[INFO] [remote-resources:process {execution: default}]
[INFO] [resources:resources]
[INFO] Using default encoding to copy filtered resources.
[INFO] [compiler:compile]
[INFO] Compiling 49 source files to /home/continuum/continuum-1.1/apps/continuum/webapp/WEB-INF/working-directory/23/studio-dsml-parser/target/classes
[INFO] [resources:testResources]
[INFO] Using default encoding to copy filtered resources.
[INFO] [compiler:testCompile]
[INFO] Compiling 26 source files to /home/continuum/continuum-1.1/apps/continuum/webapp/WEB-INF/working-directory/23/studio-dsml-parser/target/test-classes
[WARNING] /home/continuum/continuum-1.1/apps/continuum/webapp/WEB-INF/working-directory/23/studio-dsml-parser/src/test/java/org/apache/directory/studio/dsmlv2/addResponse/AddResponseTest.java:[36,24] com.sun.jndi.ldap.LdapURL is Sun proprietary API and may be removed in a future release

[WARNING] /home/continuum/continuum-1.1/apps/continuum/webapp/WEB-INF/working-directory/23/studio-dsml-parser/src/test/java/org/apache/directory/studio/dsmlv2/compareResponse/CompareResponseTest.java:[36,24] com.sun.jndi.ldap.LdapURL is Sun proprietary API and may be removed in a future release

[WARNING] /home/continuum/continuum-1.1/apps/continuum/webapp/WEB-INF/working-directory/23/studio-dsml-parser/src/test/java/org/apache/directory/studio/dsmlv2/delResponse/DelResponseTest.java:[36,24] com.sun.jndi.ldap.LdapURL is Sun proprietary API and may be removed in a future release

[WARNING] /home/continuum/continuum-1.1/apps/continuum/webapp/WEB-INF/working-directory/23/studio-dsml-parser/src/test/java/org/apache/directory/studio/dsmlv2/searchResponse/searchResultDone/SearchResultDoneTest.java:[37,24] com.sun.jndi.ldap.LdapURL is Sun proprietary API and may be removed in a future release

[WARNING] /home/continuum/continuum-1.1/apps/continuum/webapp/WEB-INF/working-directory/23/studio-dsml-parser/src/test/java/org/apache/directory/studio/dsmlv2/extendedResponse/ExtendedResponseTest.java:[38,24] com.sun.jndi.ldap.LdapURL is Sun proprietary API and may be removed in a future release

[WARNING] /home/continuum/continuum-1.1/apps/continuum/webapp/WEB-INF/working-directory/23/studio-dsml-parser/src/test/java/org/apache/directory/studio/dsmlv2/modDNResponse/ModifyDNResponseTest.java:[36,24] com.sun.jndi.ldap.LdapURL is Sun proprietary API and may be removed in a future release

[WARNING] /home/continuum/continuum-1.1/apps/continuum/webapp/WEB-INF/working-directory/23/studio-dsml-parser/src/test/java/org/apache/directory/studio/dsmlv2/modifyResponse/ModifyResponseTest.java:[36,24] com.sun.jndi.ldap.LdapURL is Sun proprietary API and may be removed in a future release

[WARNING] /home/continuum/continuum-1.1/apps/continuum/webapp/WEB-INF/working-directory/23/studio-dsml-parser/src/test/java/org/apache/directory/studio/dsmlv2/authResponse/AuthResponseTest.java:[36,24] com.sun.jndi.ldap.LdapURL is Sun proprietary API and may be removed in a future release

[WARNING] /home/continuum/continuum-1.1/apps/continuum/webapp/WEB-INF/working-directory/23/studio-dsml-parser/src/test/java/org/apache/directory/studio/dsmlv2/addResponse/AddResponseTest.java:[347,30] com.sun.jndi.ldap.LdapURL is Sun proprietary API and may be removed in a future release

[WARNING] /home/continuum/continuum-1.1/apps/continuum/webapp/WEB-INF/working-directory/23/studio-dsml-parser/src/test/java/org/apache/directory/studio/dsmlv2/addResponse/AddResponseTest.java:[418,30] com.sun.jndi.ldap.LdapURL is Sun proprietary API and may be removed in a future release

[WARNING] /home/continuum/continuum-1.1/apps/continuum/webapp/WEB-INF/working-directory/23/studio-dsml-parser/src/test/java/org/apache/directory/studio/dsmlv2/addResponse/AddResponseTest.java:[429,30] com.sun.jndi.ldap.LdapURL is Sun proprietary API and may be removed in a future release

[WARNING] /home/continuum/continuum-1.1/apps/continuum/webapp/WEB-INF/working-directory/23/studio-dsml-parser/src/test/java/org/apache/directory/studio/dsmlv2/addResponse/AddResponseTest.java:[470,30] com.sun.jndi.ldap.LdapURL is Sun proprietary API and may be removed in a future release

[WARNING] /home/continuum/continuum-1.1/apps/continuum/webapp/WEB-INF/working-directory/23/studio-dsml-parser/src/test/java/org/apache/directory/studio/dsmlv2/compareResponse/CompareResponseTest.java:[350,30] com.sun.jndi.ldap.LdapURL is Sun proprietary API and may be removed in a future release

[WARNING] /home/continuum/continuum-1.1/apps/continuum/webapp/WEB-INF/working-directory/23/studio-dsml-parser/src/test/java/org/apache/directory/studio/dsmlv2/compareResponse/CompareResponseTest.java:[421,30] com.sun.jndi.ldap.LdapURL is Sun proprietary API and may be removed in a future release

[WARNING] /home/continuum/continuum-1.1/apps/continuum/webapp/WEB-INF/working-directory/23/studio-dsml-parser/src/test/java/org/apache/directory/studio/dsmlv2/compareResponse/CompareResponseTest.java:[432,30] com.sun.jndi.ldap.LdapURL is Sun proprietary API and may be removed in a future release

[WARNING] /home/continuum/continuum-1.1/apps/continuum/webapp/WEB-INF/working-directory/23/studio-dsml-parser/src/test/java/org/apache/directory/studio/dsmlv2/compareResponse/CompareResponseTest.java:[473,30] com.sun.jndi.ldap.LdapURL is Sun proprietary API and may be removed in a future release

[WARNING] /home/continuum/continuum-1.1/apps/continuum/webapp/WEB-INF/working-directory/23/studio-dsml-parser/src/test/java/org/apache/directory/studio/dsmlv2/delResponse/DelResponseTest.java:[347,30] com.sun.jndi.ldap.LdapURL is Sun proprietary API and may be removed in a future release

[WARNING] /home/continuum/continuum-1.1/apps/continuum/webapp/WEB-INF/working-directory/23/studio-dsml-parser/src/test/java/org/apache/directory/studio/dsmlv2/delResponse/DelResponseTest.java:[418,30] com.sun.jndi.ldap.LdapURL is Sun proprietary API and may be removed in a future release

[WARNING] /home/continuum/continuum-1.1/apps/continuum/webapp/WEB-INF/working-directory/23/studio-dsml-parser/src/test/java/org/apache/directory/studio/dsmlv2/delResponse/DelResponseTest.java:[429,30] com.sun.jndi.ldap.LdapURL is Sun proprietary API and may be removed in a future release

[WARNING] /home/continuum/continuum-1.1/apps/continuum/webapp/WEB-INF/working-directory/23/studio-dsml-parser/src/test/java/org/apache/directory/studio/dsmlv2/delResponse/DelResponseTest.java:[470,30] com.sun.jndi.ldap.LdapURL is Sun proprietary API and may be removed in a future release

[WARNING] /home/continuum/continuum-1.1/apps/continuum/webapp/WEB-INF/working-directory/23/studio-dsml-parser/src/test/java/org/apache/directory/studio/dsmlv2/searchResponse/searchResultDone/SearchResultDoneTest.java:[359,30] com.sun.jndi.ldap.LdapURL is Sun proprietary API and may be removed in a future release

[WARNING] /home/continuum/continuum-1.1/apps/continuum/webapp/WEB-INF/working-directory/23/studio-dsml-parser/src/test/java/org/apache/directory/studio/dsmlv2/searchResponse/searchResultDone/SearchResultDoneTest.java:[432,30] com.sun.jndi.ldap.LdapURL is Sun proprietary API and may be removed in a future release

[WARNING] /home/continuum/continuum-1.1/apps/continuum/webapp/WEB-INF/working-directory/23/studio-dsml-parser/src/test/java/org/apache/directory/studio/dsmlv2/searchResponse/searchResultDone/SearchResultDoneTest.java:[443,30] com.sun.jndi.ldap.LdapURL is Sun proprietary API and may be removed in a future release

[WARNING] /home/continuum/continuum-1.1/apps/continuum/webapp/WEB-INF/working-directory/23/studio-dsml-parser/src/test/java/org/apache/directory/studio/dsmlv2/searchResponse/searchResultDone/SearchResultDoneTest.java:[485,30] com.sun.jndi.ldap.LdapURL is Sun proprietary API and may be removed in a future release

[WARNING] /home/continuum/continuum-1.1/apps/continuum/webapp/WEB-INF/working-directory/23/studio-dsml-parser/src/test/java/org/apache/directory/studio/dsmlv2/extendedResponse/ExtendedResponseTest.java:[352,30] com.sun.jndi.ldap.LdapURL is Sun proprietary API and may be removed in a future release

[WARNING] /home/continuum/continuum-1.1/apps/continuum/webapp/WEB-INF/working-directory/23/studio-dsml-parser/src/test/java/org/apache/directory/studio/dsmlv2/extendedResponse/ExtendedResponseTest.java:[423,30] com.sun.jndi.ldap.LdapURL is Sun proprietary API and may be removed in a future release

[WARNING] /home/continuum/continuum-1.1/apps/continuum/webapp/WEB-INF/working-directory/23/studio-dsml-parser/src/test/java/org/apache/directory/studio/dsmlv2/extendedResponse/ExtendedResponseTest.java:[434,30] com.sun.jndi.ldap.LdapURL is Sun proprietary API and may be removed in a future release

[WARNING] /home/continuum/continuum-1.1/apps/continuum/webapp/WEB-INF/working-directory/23/studio-dsml-parser/src/test/java/org/apache/directory/studio/dsmlv2/extendedResponse/ExtendedResponseTest.java:[475,30] com.sun.jndi.ldap.LdapURL is Sun proprietary API and may be removed in a future release

[WARNING] /home/continuum/continuum-1.1/apps/continuum/webapp/WEB-INF/working-directory/23/studio-dsml-parser/src/test/java/org/apache/directory/studio/dsmlv2/modDNResponse/ModifyDNResponseTest.java:[350,30] com.sun.jndi.ldap.LdapURL is Sun proprietary API and may be removed in a future release

[WARNING] /home/continuum/continuum-1.1/apps/continuum/webapp/WEB-INF/working-directory/23/studio-dsml-parser/src/test/java/org/apache/directory/studio/dsmlv2/modDNResponse/ModifyDNResponseTest.java:[421,30] com.sun.jndi.ldap.LdapURL is Sun proprietary API and may be removed in a future release

[WARNING] /home/continuum/continuum-1.1/apps/continuum/webapp/WEB-INF/working-directory/23/studio-dsml-parser/src/test/java/org/apache/directory/studio/dsmlv2/modDNResponse/ModifyDNResponseTest.java:[432,30] com.sun.jndi.ldap.LdapURL is Sun proprietary API and may be removed in a future release

[WARNING] /home/continuum/continuum-1.1/apps/continuum/webapp/WEB-INF/working-directory/23/studio-dsml-parser/src/test/java/org/apache/directory/studio/dsmlv2/modDNResponse/ModifyDNResponseTest.java:[473,30] com.sun.jndi.ldap.LdapURL is Sun proprietary API and may be removed in a future release

[WARNING] /home/continuum/continuum-1.1/apps/continuum/webapp/WEB-INF/working-directory/23/studio-dsml-parser/src/test/java/org/apache/directory/studio/dsmlv2/modifyResponse/ModifyResponseTest.java:[350,30] com.sun.jndi.ldap.LdapURL is Sun proprietary API and may be removed in a future release

[WARNING] /home/continuum/continuum-1.1/apps/continuum/webapp/WEB-INF/working-directory/23/studio-dsml-parser/src/test/java/org/apache/directory/studio/dsmlv2/modifyResponse/ModifyResponseTest.java:[421,30] com.sun.jndi.ldap.LdapURL is Sun proprietary API and may be removed in a future release

[WARNING] /home/continuum/continuum-1.1/apps/continuum/webapp/WEB-INF/working-directory/23/studio-dsml-parser/src/test/java/org/apache/directory/studio/dsmlv2/modifyResponse/ModifyResponseTest.java:[432,30] com.sun.jndi.ldap.LdapURL is Sun proprietary API and may be removed in a future release

[WARNING] /home/continuum/continuum-1.1/apps/continuum/webapp/WEB-INF/working-directory/23/studio-dsml-parser/src/test/java/org/apache/directory/studio/dsmlv2/modifyResponse/ModifyResponseTest.java:[473,30] com.sun.jndi.ldap.LdapURL is Sun proprietary API and may be removed in a future release

[WARNING] /home/continuum/continuum-1.1/apps/continuum/webapp/WEB-INF/working-directory/23/studio-dsml-parser/src/test/java/org/apache/directory/studio/dsmlv2/authResponse/AuthResponseTest.java:[349,30] com.sun.jndi.ldap.LdapURL is Sun proprietary API and may be removed in a future release

[WARNING] /home/continuum/continuum-1.1/apps/continuum/webapp/WEB-INF/working-directory/23/studio-dsml-parser/src/test/java/org/apache/directory/studio/dsmlv2/authResponse/AuthResponseTest.java:[420,30] com.sun.jndi.ldap.LdapURL is Sun proprietary API and may be removed in a future release

[WARNING] /home/continuum/continuum-1.1/apps/continuum/webapp/WEB-INF/working-directory/23/studio-dsml-parser/src/test/java/org/apache/directory/studio/dsmlv2/authResponse/AuthResponseTest.java:[431,30] com.sun.jndi.ldap.LdapURL is Sun proprietary API and may be removed in a future release

[WARNING] /home/continuum/continuum-1.1/apps/continuum/webapp/WEB-INF/working-directory/23/studio-dsml-parser/src/test/java/org/apache/directory/studio/dsmlv2/authResponse/AuthResponseTest.java:[472,30] com.sun.jndi.ldap.LdapURL is Sun proprietary API and may be removed in a future release

[INFO] [surefire:test]
[INFO] Surefire report directory: /home/continuum/continuum-1.1/apps/continuum/webapp/WEB-INF/working-directory/23/studio-dsml-parser/target/surefire-reports

-------------------------------------------------------
 T E S T S
-------------------------------------------------------
Running org.apache.directory.studio.dsmlv2.modifyResponse.ModifyResponseTest
Tests run: 18, Failures: 0, Errors: 0, Skipped: 0, Time elapsed: 0.324 sec
Running org.apache.directory.studio.dsmlv2.searchRequest.SearchRequestTest
Tests run: 95, Failures: 0, Errors: 0, Skipped: 0, Time elapsed: 0.208 sec
Running org.apache.directory.studio.dsmlv2.authResponse.AuthResponseTest
Tests run: 18, Failures: 0, Errors: 0, Skipped: 0, Time elapsed: 0.018 sec
Running org.apache.directory.studio.dsmlv2.errorResponse.ErrorResponseTest
Tests run: 14, Failures: 0, Errors: 0, Skipped: 0, Time elapsed: 0.014 sec
Running org.apache.directory.studio.dsmlv2.batchResponse.BatchResponseTest
Tests run: 21, Failures: 0, Errors: 0, Skipped: 0, Time elapsed: 0.022 sec
Running org.apache.directory.studio.dsmlv2.addRequest.AddRequestTest
Tests run: 17, Failures: 0, Errors: 0, Skipped: 0, Time elapsed: 0.043 sec
Running org.apache.directory.studio.dsmlv2.modDNResponse.ModifyDNResponseTest
Tests run: 18, Failures: 0, Errors: 0, Skipped: 0, Time elapsed: 0.018 sec
Running org.apache.directory.studio.dsmlv2.searchResponse.searchResultReference.SearchResultReferenceTest
Tests run: 11, Failures: 0, Errors: 0, Skipped: 0, Time elapsed: 0.015 sec
Running org.apache.directory.studio.dsmlv2.searchResponse.searchResultEntry.SearchResultEntryTest
Tests run: 17, Failures: 0, Errors: 0, Skipped: 0, Time elapsed: 0.018 sec
Running org.apache.directory.studio.dsmlv2.modifyRequest.ModifyRequestTest
Tests run: 21, Failures: 0, Errors: 0, Skipped: 0, Time elapsed: 0.026 sec
Running org.apache.directory.studio.dsmlv2.authRequest.AuthRequestTest
Tests run: 10, Failures: 0, Errors: 0, Skipped: 0, Time elapsed: 0.012 sec
Running org.apache.directory.studio.dsmlv2.extendedRequest.ExtendedRequestTest
Tests run: 14, Failures: 0, Errors: 0, Skipped: 0, Time elapsed: 0.012 sec
Running org.apache.directory.studio.dsmlv2.delRequest.DelRequestTest
Tests run: 10, Failures: 0, Errors: 0, Skipped: 0, Time elapsed: 0.011 sec
Running org.apache.directory.studio.dsmlv2.modDNRequest.ModifyDNRequestTest
Tests run: 17, Failures: 0, Errors: 0, Skipped: 0, Time elapsed: 0.029 sec
Running org.apache.directory.studio.dsmlv2.compareRequest.CompareRequestTest
Tests run: 18, Failures: 0, Errors: 0, Skipped: 0, Time elapsed: 0.019 sec
Running org.apache.directory.studio.dsmlv2.addResponse.AddResponseTest
Tests run: 18, Failures: 0, Errors: 0, Skipped: 0, Time elapsed: 0.027 sec
Running org.apache.directory.studio.dsmlv2.searchResponse.searchResultDone.SearchResultDoneTest
Tests run: 18, Failures: 0, Errors: 0, Skipped: 0, Time elapsed: 0.019 sec
Running org.apache.directory.studio.dsmlv2.delResponse.DelResponseTest
Tests run: 18, Failures: 0, Errors: 0, Skipped: 0, Time elapsed: 0.027 sec
Running org.apache.directory.studio.dsmlv2.compareResponse.CompareResponseTest
Tests run: 18, Failures: 0, Errors: 0, Skipped: 0, Time elapsed: 0.053 sec
Running org.apache.directory.studio.dsmlv2.searchResponse.SearchResponseTest
Tests run: 12, Failures: 0, Errors: 0, Skipped: 0, Time elapsed: 0.014 sec
Running org.apache.directory.studio.dsmlv2.abandonRequest.AbandonRequestTest
Tests run: 10, Failures: 0, Errors: 0, Skipped: 0, Time elapsed: 0.011 sec
Running org.apache.directory.studio.dsmlv2.extendedResponse.ExtendedResponseTest
Tests run: 25, Failures: 0, Errors: 0, Skipped: 0, Time elapsed: 0.019 sec
Running org.apache.directory.studio.dsmlv2.batchRequest.BatchRequestTest
Tests run: 22, Failures: 0, Errors: 0, Skipped: 0, Time elapsed: 0.02 sec

Results :

Tests run: 460, Failures: 0, Errors: 0, Skipped: 0

[INFO] [jar:jar]
[INFO] Building jar: /home/continuum/continuum-1.1/apps/continuum/webapp/WEB-INF/working-directory/23/studio-dsml-parser/target/studio-dsml-parser-0.4.4-SNAPSHOT.jar
[INFO] [tools:verify-legal-files {execution: verify-legal-files}]
[INFO] Checking legal files in: studio-dsml-parser-0.4.4-SNAPSHOT.jar
[INFO] [install:install]
[INFO] Installing /home/continuum/continuum-1.1/apps/continuum/webapp/WEB-INF/working-directory/23/studio-dsml-parser/target/studio-dsml-parser-0.4.4-SNAPSHOT.jar to /home/continuum/.m2/repository/org/apache/directory/studio/studio-dsml-parser/0.4.4-SNAPSHOT/studio-dsml-parser-0.4.4-SNAPSHOT.jar
[INFO] [deploy:deploy]
altDeploymentRepository = id::default::scpexe://vm094.oxylos.org/var/www/html/mirror-maven2/
[INFO] Using alternate deployment repository id::default::scpexe://vm094.oxylos.org/var/www/html/mirror-maven2/
[INFO] Retrieving previous build number from id
Uploading: scpexe://vm094.oxylos.org/var/www/html/mirror-maven2//org/apache/directory/studio/studio-dsml-parser/0.4.4-SNAPSHOT/studio-dsml-parser-0.4.4-SNAPSHOT.jar
[INFO] Retrieving previous metadata from id
[INFO] Uploading repository metadata for: 'snapshot org.apache.directory.studio:studio-dsml-parser:0.4.4-SNAPSHOT'
[INFO] Uploading project information for studio-dsml-parser 0.4.4-SNAPSHOT
[INFO] Retrieving previous metadata from id
[INFO] Uploading repository metadata for: 'artifact org.apache.directory.studio:studio-dsml-parser'
[INFO] ------------------------------------------------------------------------
[INFO] Building Apache Directory Studio Jars
[INFO]    task-segment: [clean, deploy]
[INFO] ------------------------------------------------------------------------
[INFO] [clean:clean]
[INFO] Deleting directory /home/continuum/continuum-1.1/apps/continuum/webapp/WEB-INF/working-directory/23/jars/target
[INFO] [remote-resources:process {execution: default}]
[INFO] [resources:resources]
[INFO] Using default encoding to copy filtered resources.
[INFO] [studio:prepare-jar-package {execution: default}]
[INFO] Copying /home/continuum/.m2/repository/antlr/antlr/2.7.7/antlr-2.7.7.jar to
               /home/continuum/continuum-1.1/apps/continuum/webapp/WEB-INF/working-directory/23/jars/target/classes/lib/antlr-2.7.7.jar
[INFO] Copying /home/continuum/.m2/repository/commons-codec/commons-codec/1.3/commons-codec-1.3.jar to
               /home/continuum/continuum-1.1/apps/continuum/webapp/WEB-INF/working-directory/23/jars/target/classes/lib/commons-codec-1.3.jar
[INFO] Copying /home/continuum/.m2/repository/commons-collections/commons-collections/3.2/commons-collections-3.2.jar to
               /home/continuum/continuum-1.1/apps/continuum/webapp/WEB-INF/working-directory/23/jars/target/classes/lib/commons-collections-3.2.jar
[INFO] Copying /home/continuum/.m2/repository/commons-io/commons-io/1.3.1/commons-io-1.3.1.jar to
               /home/continuum/continuum-1.1/apps/continuum/webapp/WEB-INF/working-directory/23/jars/target/classes/lib/commons-io-1.3.1.jar
[INFO] Copying /home/continuum/.m2/repository/commons-lang/commons-lang/2.3/commons-lang-2.3.jar to
               /home/continuum/continuum-1.1/apps/continuum/webapp/WEB-INF/working-directory/23/jars/target/classes/lib/commons-lang-2.3.jar
[INFO] Copying /home/continuum/.m2/repository/dom4j/dom4j/1.6.1/dom4j-1.6.1.jar to
               /home/continuum/continuum-1.1/apps/continuum/webapp/WEB-INF/working-directory/23/jars/target/classes/lib/dom4j-1.6.1.jar
[INFO] Copying /home/continuum/.m2/repository/org/slf4j/nlog4j/1.2.25/nlog4j-1.2.25.jar to
               /home/continuum/continuum-1.1/apps/continuum/webapp/WEB-INF/working-directory/23/jars/target/classes/lib/nlog4j-1.2.25.jar
[INFO] Copying /home/continuum/.m2/repository/org/apache/directory/shared/shared-asn1/0.9.14-SNAPSHOT/shared-asn1-0.9.14-SNAPSHOT.jar to
               /home/continuum/continuum-1.1/apps/continuum/webapp/WEB-INF/working-directory/23/jars/target/classes/lib/shared-asn1-0.9.14-SNAPSHOT.jar
[INFO] Copying /home/continuum/.m2/repository/org/apache/directory/shared/shared-ldap/0.9.14-SNAPSHOT/shared-ldap-0.9.14-SNAPSHOT.jar to
               /home/continuum/continuum-1.1/apps/continuum/webapp/WEB-INF/working-directory/23/jars/target/classes/lib/shared-ldap-0.9.14-SNAPSHOT.jar
[INFO] Copying /home/continuum/.m2/repository/org/apache/directory/shared/shared-ldap-constants/0.9.14-SNAPSHOT/shared-ldap-constants-0.9.14-SNAPSHOT.jar to
               /home/continuum/continuum-1.1/apps/continuum/webapp/WEB-INF/working-directory/23/jars/target/classes/lib/shared-ldap-constants-0.9.14-SNAPSHOT.jar
[INFO] Copying /home/continuum/continuum-1.1/apps/continuum/webapp/WEB-INF/working-directory/23/studio-dsml-parser/target/studio-dsml-parser-0.4.4-SNAPSHOT.jar to
               /home/continuum/continuum-1.1/apps/continuum/webapp/WEB-INF/working-directory/23/jars/target/classes/lib/studio-dsml-parser-0.4.4-SNAPSHOT.jar
[INFO] Copying /home/continuum/.m2/repository/xpp3/xpp3/1.1.3.4.O/xpp3-1.1.3.4.O.jar to
               /home/continuum/continuum-1.1/apps/continuum/webapp/WEB-INF/working-directory/23/jars/target/classes/lib/xpp3-1.1.3.4.O.jar
[INFO] [compiler:compile]
[INFO] Nothing to compile - all classes are up to date
[INFO] [bundle:manifest {execution: default}]
[INFO] [resources:testResources]
[INFO] Using default encoding to copy filtered resources.
[INFO] [compiler:testCompile]
[INFO] Nothing to compile - all classes are up to date
[INFO] [surefire:test]
[INFO] Tests are skipped.
[INFO] [jar:jar]
[INFO] Building jar: /home/continuum/continuum-1.1/apps/continuum/webapp/WEB-INF/working-directory/23/jars/target/jars-1.4.0-SNAPSHOT.jar
[INFO] [tools:verify-legal-files {execution: verify-legal-files}]
[INFO] Checking legal files in: jars-1.4.0-SNAPSHOT.jar
[INFO] [install:install]
[INFO] Installing /home/continuum/continuum-1.1/apps/continuum/webapp/WEB-INF/working-directory/23/jars/target/jars-1.4.0-SNAPSHOT.jar to /home/continuum/.m2/repository/org/apache/directory/studio/jars/1.4.0-SNAPSHOT/jars-1.4.0-SNAPSHOT.jar
[INFO] [deploy:deploy]
altDeploymentRepository = id::default::scpexe://vm094.oxylos.org/var/www/html/mirror-maven2/
[INFO] Using alternate deployment repository id::default::scpexe://vm094.oxylos.org/var/www/html/mirror-maven2/
[INFO] Retrieving previous build number from id
Uploading: scpexe://vm094.oxylos.org/var/www/html/mirror-maven2//org/apache/directory/studio/jars/1.4.0-SNAPSHOT/jars-1.4.0-SNAPSHOT.jar
[INFO] Uploading project information for jars 1.4.0-SNAPSHOT
[INFO] Retrieving previous metadata from id
[INFO] Uploading repository metadata for: 'snapshot org.apache.directory.studio:jars:1.4.0-SNAPSHOT'
[INFO] Retrieving previous metadata from id
[INFO] Uploading repository metadata for: 'artifact org.apache.directory.studio:jars'
[INFO] ------------------------------------------------------------------------
[INFO] Building Apache Directory Studio LDIF Parser
[INFO]    task-segment: [clean, deploy]
[INFO] ------------------------------------------------------------------------
[INFO] [clean:clean]
[INFO] Deleting directory /home/continuum/continuum-1.1/apps/continuum/webapp/WEB-INF/working-directory/23/ldif-parser/target
[INFO] [remote-resources:process {execution: default}]
[INFO] [resources:resources]
[INFO] Using default encoding to copy filtered resources.
[INFO] [studio:prepare-jar-package {execution: default}]
[INFO] [compiler:compile]
[INFO] Compiling 41 source files to /home/continuum/continuum-1.1/apps/continuum/webapp/WEB-INF/working-directory/23/ldif-parser/target/classes
[INFO] [bundle:manifest {execution: generate-manifest}]
[WARNING] Warning in manifest for org.apache.directory.studio:ldifparser:jar:1.4.0-SNAPSHOT : Did not find matching referal for !
[INFO] [resources:testResources]
[INFO] Using default encoding to copy filtered resources.
[INFO] [compiler:testCompile]
[INFO] Compiling 3 source files to /home/continuum/continuum-1.1/apps/continuum/webapp/WEB-INF/working-directory/23/ldif-parser/target/test-classes
[INFO] [surefire:test]
[INFO] Surefire report directory: /home/continuum/continuum-1.1/apps/continuum/webapp/WEB-INF/working-directory/23/ldif-parser/target/surefire-reports

-------------------------------------------------------
 T E S T S
-------------------------------------------------------
Running org.apache.directory.studio.ldifparser.model.lines.LdifDnLineTest
Tests run: 5, Failures: 0, Errors: 0, Skipped: 0, Time elapsed: 0.047 sec
Running org.apache.directory.studio.ldifparser.model.lines.LdifAttrValLineTest
Tests run: 5, Failures: 0, Errors: 0, Skipped: 0, Time elapsed: 0.008 sec
Running org.apache.directory.studio.ldifparser.parser.LdifParserTest
Tests run: 1, Failures: 0, Errors: 0, Skipped: 0, Time elapsed: 0.017 sec

Results :

Tests run: 11, Failures: 0, Errors: 0, Skipped: 0

[INFO] [jar:jar]
[INFO] Building jar: /home/continuum/continuum-1.1/apps/continuum/webapp/WEB-INF/working-directory/23/ldif-parser/target/ldifparser-1.4.0-SNAPSHOT.jar
[INFO] [tools:verify-legal-files {execution: verify-legal-files}]
[INFO] Checking legal files in: ldifparser-1.4.0-SNAPSHOT.jar
[INFO] [install:install]
[INFO] Installing /home/continuum/continuum-1.1/apps/continuum/webapp/WEB-INF/working-directory/23/ldif-parser/target/ldifparser-1.4.0-SNAPSHOT.jar to /home/continuum/.m2/repository/org/apache/directory/studio/ldifparser/1.4.0-SNAPSHOT/ldifparser-1.4.0-SNAPSHOT.jar
[INFO] [deploy:deploy]
altDeploymentRepository = id::default::scpexe://vm094.oxylos.org/var/www/html/mirror-maven2/
[INFO] Using alternate deployment repository id::default::scpexe://vm094.oxylos.org/var/www/html/mirror-maven2/
[INFO] Retrieving previous build number from id
Uploading: scpexe://vm094.oxylos.org/var/www/html/mirror-maven2//org/apache/directory/studio/ldifparser/1.4.0-SNAPSHOT/ldifparser-1.4.0-SNAPSHOT.jar
[INFO] Uploading project information for ldifparser 1.4.0-SNAPSHOT
[INFO] Retrieving previous metadata from id
[INFO] Uploading repository metadata for: 'snapshot org.apache.directory.studio:ldifparser:1.4.0-SNAPSHOT'
[INFO] Retrieving previous metadata from id
[INFO] Uploading repository metadata for: 'artifact org.apache.directory.studio:ldifparser'
[INFO] ------------------------------------------------------------------------
[INFO] Building Apache Directory Studio Connection Core
[INFO]    task-segment: [clean, deploy]
[INFO] ------------------------------------------------------------------------
[INFO] [clean:clean]
[INFO] Deleting directory /home/continuum/continuum-1.1/apps/continuum/webapp/WEB-INF/working-directory/23/connection-core/target
[INFO] [remote-resources:process {execution: default}]
[INFO] [resources:resources]
[INFO] Using default encoding to copy filtered resources.
[INFO] [studio:prepare-jar-package {execution: default}]
[INFO] [compiler:compile]
[INFO] Compiling 43 source files to /home/continuum/continuum-1.1/apps/continuum/webapp/WEB-INF/working-directory/23/connection-core/target/classes
[INFO] [bundle:manifest {execution: generate-manifest}]
[WARNING] Warning in manifest for org.apache.directory.studio:connection.core:jar:1.4.0-SNAPSHOT : Did not find matching referal for !
[INFO] [resources:testResources]
[INFO] Using default encoding to copy filtered resources.
[INFO] [compiler:testCompile]
[INFO] Nothing to compile - all classes are up to date
[INFO] [surefire:test]
[INFO] Tests are skipped.
[INFO] [jar:jar]
[INFO] Building jar: /home/continuum/continuum-1.1/apps/continuum/webapp/WEB-INF/working-directory/23/connection-core/target/connection.core-1.4.0-SNAPSHOT.jar
[INFO] [tools:verify-legal-files {execution: verify-legal-files}]
[INFO] Checking legal files in: connection.core-1.4.0-SNAPSHOT.jar
[INFO] [install:install]
[INFO] Installing /home/continuum/continuum-1.1/apps/continuum/webapp/WEB-INF/working-directory/23/connection-core/target/connection.core-1.4.0-SNAPSHOT.jar to /home/continuum/.m2/repository/org/apache/directory/studio/connection.core/1.4.0-SNAPSHOT/connection.core-1.4.0-SNAPSHOT.jar
[INFO] [deploy:deploy]
altDeploymentRepository = id::default::scpexe://vm094.oxylos.org/var/www/html/mirror-maven2/
[INFO] Using alternate deployment repository id::default::scpexe://vm094.oxylos.org/var/www/html/mirror-maven2/
[INFO] Retrieving previous build number from id
Uploading: scpexe://vm094.oxylos.org/var/www/html/mirror-maven2//org/apache/directory/studio/connection.core/1.4.0-SNAPSHOT/connection.core-1.4.0-SNAPSHOT.jar
[INFO] Retrieving previous metadata from id
[INFO] Uploading repository metadata for: 'snapshot org.apache.directory.studio:connection.core:1.4.0-SNAPSHOT'
[INFO] Retrieving previous metadata from id
[INFO] Uploading repository metadata for: 'artifact org.apache.directory.studio:connection.core'
[INFO] Uploading project information for connection.core 1.4.0-SNAPSHOT
[INFO] ------------------------------------------------------------------------
[INFO] Building Apache Directory Studio LDAP Browser Core
[INFO]    task-segment: [clean, deploy]
[INFO] ------------------------------------------------------------------------
[INFO] [clean:clean]
[INFO] Deleting directory /home/continuum/continuum-1.1/apps/continuum/webapp/WEB-INF/working-directory/23/ldapbrowser-core/target
[INFO] [remote-resources:process {execution: default}]
[INFO] [resources:resources]
[INFO] Using default encoding to copy filtered resources.
[INFO] [studio:prepare-jar-package {execution: default}]
[INFO] Copying /home/continuum/.m2/repository/org/apache/poi/poi/3.0.1-FINAL/poi-3.0.1-FINAL.jar to
               /home/continuum/continuum-1.1/apps/continuum/webapp/WEB-INF/working-directory/23/ldapbrowser-core/target/classes/lib/poi-3.0.1-FINAL.jar
[INFO] [compiler:compile]
[INFO] Compiling 133 source files to /home/continuum/continuum-1.1/apps/continuum/webapp/WEB-INF/working-directory/23/ldapbrowser-core/target/classes
[INFO] ------------------------------------------------------------------------
[ERROR] BUILD FAILURE
[INFO] ------------------------------------------------------------------------
[INFO] Compilation failure

/home/continuum/continuum-1.1/apps/continuum/webapp/WEB-INF/working-directory/23/ldapbrowser-core/src/main/java/org/apache/directory/studio/ldapbrowser/core/model/IAttribute.java:[26,53] cannot find symbol
symbol  : class AttributeTypeDescription
location: package org.apache.directory.shared.ldap.schema.syntax

/home/continuum/continuum-1.1/apps/continuum/webapp/WEB-INF/working-directory/23/ldapbrowser-core/src/main/java/org/apache/directory/studio/ldapbrowser/core/model/schema/Subschema.java:[29,53] cannot find symbol
symbol  : class AttributeTypeDescription
location: package org.apache.directory.shared.ldap.schema.syntax

/home/continuum/continuum-1.1/apps/continuum/webapp/WEB-INF/working-directory/23/ldapbrowser-core/src/main/java/org/apache/directory/studio/ldapbrowser/core/model/schema/Subschema.java:[30,53] cannot find symbol
symbol  : class ObjectClassDescription
location: package org.apache.directory.shared.ldap.schema.syntax

/home/continuum/continuum-1.1/apps/continuum/webapp/WEB-INF/working-directory/23/ldapbrowser-core/src/main/java/org/apache/directory/studio/ldapbrowser/core/model/schema/Schema.java:[40,53] cannot find symbol
symbol  : class AttributeTypeDescription
location: package org.apache.directory.shared.ldap.schema.syntax

/home/continuum/continuum-1.1/apps/continuum/webapp/WEB-INF/working-directory/23/ldapbrowser-core/src/main/java/org/apache/directory/studio/ldapbrowser/core/model/schema/Schema.java:[41,53] cannot find symbol
symbol  : class LdapSyntaxDescription
location: package org.apache.directory.shared.ldap.schema.syntax

/home/continuum/continuum-1.1/apps/continuum/webapp/WEB-INF/working-directory/23/ldapbrowser-core/src/main/java/org/apache/directory/studio/ldapbrowser/core/model/schema/Schema.java:[42,53] cannot find symbol
symbol  : class MatchingRuleDescription
location: package org.apache.directory.shared.ldap.schema.syntax

/home/continuum/continuum-1.1/apps/continuum/webapp/WEB-INF/working-directory/23/ldapbrowser-core/src/main/java/org/apache/directory/studio/ldapbrowser/core/model/schema/Schema.java:[43,53] cannot find symbol
symbol  : class MatchingRuleUseDescription
location: package org.apache.directory.shared.ldap.schema.syntax

/home/continuum/continuum-1.1/apps/continuum/webapp/WEB-INF/working-directory/23/ldapbrowser-core/src/main/java/org/apache/directory/studio/ldapbrowser/core/model/schema/Schema.java:[44,53] cannot find symbol
symbol  : class ObjectClassDescription
location: package org.apache.directory.shared.ldap.schema.syntax

/home/continuum/continuum-1.1/apps/continuum/webapp/WEB-INF/working-directory/23/ldapbrowser-core/src/main/java/org/apache/directory/studio/ldapbrowser/core/model/schema/Schema.java:[45,60] package org.apache.directory.shared.ldap.schema.syntax.parser does not exist

/home/continuum/continuum-1.1/apps/continuum/webapp/WEB-INF/working-directory/23/ldapbrowser-core/src/main/java/org/apache/directory/studio/ldapbrowser/core/model/schema/Schema.java:[46,60] package org.apache.directory.shared.ldap.schema.syntax.parser does not exist

/home/continuum/continuum-1.1/apps/continuum/webapp/WEB-INF/working-directory/23/ldapbrowser-core/src/main/java/org/apache/directory/studio/ldapbrowser/core/model/schema/Schema.java:[47,60] package org.apache.directory.shared.ldap.schema.syntax.parser does not exist

/home/continuum/continuum-1.1/apps/continuum/webapp/WEB-INF/working-directory/23/ldapbrowser-core/src/main/java/org/apache/directory/studio/ldapbrowser/core/model/schema/Schema.java:[48,60] package org.apache.directory.shared.ldap.schema.syntax.parser does not exist

/home/continuum/continuum-1.1/apps/continuum/webapp/WEB-INF/working-directory/23/ldapbrowser-core/src/main/java/org/apache/directory/studio/ldapbrowser/core/model/schema/Schema.java:[49,60] package org.apache.directory.shared.ldap.schema.syntax.parser does not exist

/home/continuum/continuum-1.1/apps/continuum/webapp/WEB-INF/working-directory/23/ldapbrowser-core/src/main/java/org/apache/directory/studio/ldapbrowser/core/model/IAttribute.java:[360,20] cannot find symbol
symbol  : class AttributeTypeDescription
location: interface org.apache.directory.studio.ldapbrowser.core.model.IAttribute

/home/continuum/continuum-1.1/apps/continuum/webapp/WEB-INF/working-directory/23/ldapbrowser-core/src/main/java/org/apache/directory/studio/ldapbrowser/core/model/AttributeDescription.java:[31,53] cannot find symbol
symbol  : class AttributeTypeDescription
location: package org.apache.directory.shared.ldap.schema.syntax

/home/continuum/continuum-1.1/apps/continuum/webapp/WEB-INF/working-directory/23/ldapbrowser-core/src/main/java/org/apache/directory/studio/ldapbrowser/core/model/AttributeDescription.java:[32,53] cannot find symbol
symbol  : class ObjectClassDescription
location: package org.apache.directory.shared.ldap.schema.syntax

/home/continuum/continuum-1.1/apps/continuum/webapp/WEB-INF/working-directory/23/ldapbrowser-core/src/main/java/org/apache/directory/studio/ldapbrowser/core/model/schema/Subschema.java:[123,11] cannot find symbol
symbol  : class AttributeTypeDescription
location: class org.apache.directory.studio.ldapbrowser.core.model.schema.Subschema

/home/continuum/continuum-1.1/apps/continuum/webapp/WEB-INF/working-directory/23/ldapbrowser-core/src/main/java/org/apache/directory/studio/ldapbrowser/core/model/schema/Subschema.java:[174,11] cannot find symbol
symbol  : class AttributeTypeDescription
location: class org.apache.directory.studio.ldapbrowser.core.model.schema.Subschema

/home/continuum/continuum-1.1/apps/continuum/webapp/WEB-INF/working-directory/23/ldapbrowser-core/src/main/java/org/apache/directory/studio/ldapbrowser/core/model/schema/Schema.java:[85,24] cannot find symbol
symbol  : class LdapSyntaxDescription
location: class org.apache.directory.studio.ldapbrowser.core.model.schema.Schema

/home/continuum/continuum-1.1/apps/continuum/webapp/WEB-INF/working-directory/23/ldapbrowser-core/src/main/java/org/apache/directory/studio/ldapbrowser/core/model/schema/Schema.java:[141,24] cannot find symbol
symbol  : class ObjectClassDescription
location: class org.apache.directory.studio.ldapbrowser.core.model.schema.Schema

/home/continuum/continuum-1.1/apps/continuum/webapp/WEB-INF/working-directory/23/ldapbrowser-core/src/main/java/org/apache/directory/studio/ldapbrowser/core/model/schema/Schema.java:[143,24] cannot find symbol
symbol  : class AttributeTypeDescription
location: class org.apache.directory.studio.ldapbrowser.core.model.schema.Schema

/home/continuum/continuum-1.1/apps/continuum/webapp/WEB-INF/working-directory/23/ldapbrowser-core/src/main/java/org/apache/directory/studio/ldapbrowser/core/model/schema/Schema.java:[145,24] cannot find symbol
symbol  : class LdapSyntaxDescription
location: class org.apache.directory.studio.ldapbrowser.core.model.schema.Schema

/home/continuum/continuum-1.1/apps/continuum/webapp/WEB-INF/working-directory/23/ldapbrowser-core/src/main/java/org/apache/directory/studio/ldapbrowser/core/model/schema/Schema.java:[147,24] cannot find symbol
symbol  : class MatchingRuleDescription
location: class org.apache.directory.studio.ldapbrowser.core.model.schema.Schema

/home/continuum/continuum-1.1/apps/continuum/webapp/WEB-INF/working-directory/23/ldapbrowser-core/src/main/java/org/apache/directory/studio/ldapbrowser/core/model/schema/Schema.java:[149,24] cannot find symbol
symbol  : class MatchingRuleUseDescription
location: class org.apache.directory.studio.ldapbrowser.core.model.schema.Schema

/home/continuum/continuum-1.1/apps/continuum/webapp/WEB-INF/working-directory/23/ldapbrowser-core/src/main/java/org/apache/directory/studio/ldapbrowser/core/model/schema/Schema.java:[419,44] cannot find symbol
symbol  : class ObjectClassDescription
location: class org.apache.directory.studio.ldapbrowser.core.model.schema.Schema

/home/continuum/continuum-1.1/apps/continuum/webapp/WEB-INF/working-directory/23/ldapbrowser-core/src/main/java/org/apache/directory/studio/ldapbrowser/core/model/schema/Schema.java:[440,22] cannot find symbol
symbol  : class ObjectClassDescription
location: class org.apache.directory.studio.ldapbrowser.core.model.schema.Schema

/home/continuum/continuum-1.1/apps/continuum/webapp/WEB-INF/working-directory/23/ldapbrowser-core/src/main/java/org/apache/directory/studio/ldapbrowser/core/model/schema/Schema.java:[470,11] cannot find symbol
symbol  : class ObjectClassDescription
location: class org.apache.directory.studio.ldapbrowser.core.model.schema.Schema

/home/continuum/continuum-1.1/apps/continuum/webapp/WEB-INF/working-directory/23/ldapbrowser-core/src/main/java/org/apache/directory/studio/ldapbrowser/core/model/schema/Schema.java:[501,46] cannot find symbol
symbol  : class AttributeTypeDescription
location: class org.apache.directory.studio.ldapbrowser.core.model.schema.Schema

/home/continuum/continuum-1.1/apps/continuum/webapp/WEB-INF/working-directory/23/ldapbrowser-core/src/main/java/org/apache/directory/studio/ldapbrowser/core/model/schema/Schema.java:[522,22] cannot find symbol
symbol  : class AttributeTypeDescription
location: class org.apache.directory.studio.ldapbrowser.core.model.schema.Schema

/home/continuum/continuum-1.1/apps/continuum/webapp/WEB-INF/working-directory/23/ldapbrowser-core/src/main/java/org/apache/directory/studio/ldapbrowser/core/model/schema/Schema.java:[552,11] cannot find symbol
symbol  : class AttributeTypeDescription
location: class org.apache.directory.studio.ldapbrowser.core.model.schema.Schema

/home/continuum/continuum-1.1/apps/continuum/webapp/WEB-INF/working-directory/23/ldapbrowser-core/src/main/java/org/apache/directory/studio/ldapbrowser/core/model/schema/Schema.java:[588,43] cannot find symbol
symbol  : class LdapSyntaxDescription
location: class org.apache.directory.studio.ldapbrowser.core.model.schema.Schema

/home/continuum/continuum-1.1/apps/continuum/webapp/WEB-INF/working-directory/23/ldapbrowser-core/src/main/java/org/apache/directory/studio/ldapbrowser/core/model/schema/Schema.java:[602,22] cannot find symbol
symbol  : class LdapSyntaxDescription
location: class org.apache.directory.studio.ldapbrowser.core.model.schema.Schema

/home/continuum/continuum-1.1/apps/continuum/webapp/WEB-INF/working-directory/23/ldapbrowser-core/src/main/java/org/apache/directory/studio/ldapbrowser/core/model/schema/Schema.java:[630,11] cannot find symbol
symbol  : class LdapSyntaxDescription
location: class org.apache.directory.studio.ldapbrowser.core.model.schema.Schema

/home/continuum/continuum-1.1/apps/continuum/webapp/WEB-INF/working-directory/23/ldapbrowser-core/src/main/java/org/apache/directory/studio/ldapbrowser/core/model/schema/Schema.java:[662,45] cannot find symbol
symbol  : class MatchingRuleDescription
location: class org.apache.directory.studio.ldapbrowser.core.model.schema.Schema

/home/continuum/continuum-1.1/apps/continuum/webapp/WEB-INF/working-directory/23/ldapbrowser-core/src/main/java/org/apache/directory/studio/ldapbrowser/core/model/schema/Schema.java:[683,22] cannot find symbol
symbol  : class MatchingRuleDescription
location: class org.apache.directory.studio.ldapbrowser.core.model.schema.Schema

/home/continuum/continuum-1.1/apps/continuum/webapp/WEB-INF/working-directory/23/ldapbrowser-core/src/main/java/org/apache/directory/studio/ldapbrowser/core/model/schema/Schema.java:[713,11] cannot find symbol
symbol  : class MatchingRuleDescription
location: class org.apache.directory.studio.ldapbrowser.core.model.schema.Schema

/home/continuum/continuum-1.1/apps/continuum/webapp/WEB-INF/working-directory/23/ldapbrowser-core/src/main/java/org/apache/directory/studio/ldapbrowser/core/model/schema/Schema.java:[741,48] cannot find symbol
symbol  : class MatchingRuleUseDescription
location: class org.apache.directory.studio.ldapbrowser.core.model.schema.Schema

/home/continuum/continuum-1.1/apps/continuum/webapp/WEB-INF/working-directory/23/ldapbrowser-core/src/main/java/org/apache/directory/studio/ldapbrowser/core/model/schema/Schema.java:[762,22] cannot find symbol
symbol  : class MatchingRuleUseDescription
location: class org.apache.directory.studio.ldapbrowser.core.model.schema.Schema

/home/continuum/continuum-1.1/apps/continuum/webapp/WEB-INF/working-directory/23/ldapbrowser-core/src/main/java/org/apache/directory/studio/ldapbrowser/core/model/schema/Schema.java:[792,11] cannot find symbol
symbol  : class MatchingRuleUseDescription
location: class org.apache.directory.studio.ldapbrowser.core.model.schema.Schema

/home/continuum/continuum-1.1/apps/continuum/webapp/WEB-INF/working-directory/23/ldapbrowser-core/src/main/java/org/apache/directory/studio/ldapbrowser/core/model/impl/AbstractEntry.java:[34,53] cannot find symbol
symbol  : class AttributeTypeDescription
location: package org.apache.directory.shared.ldap.schema.syntax

/home/continuum/continuum-1.1/apps/continuum/webapp/WEB-INF/working-directory/23/ldapbrowser-core/src/main/java/org/apache/directory/studio/ldapbrowser/core/model/impl/AbstractEntry.java:[35,53] cannot find symbol
symbol  : class ObjectClassDescription
location: package org.apache.directory.shared.ldap.schema.syntax

/home/continuum/continuum-1.1/apps/continuum/webapp/WEB-INF/working-directory/23/ldapbrowser-core/src/main/java/org/apache/directory/studio/ldapbrowser/core/model/schema/SchemaUtils.java:[33,53] cannot find symbol
symbol  : class AbstractSchemaDescription
location: package org.apache.directory.shared.ldap.schema.syntax

/home/continuum/continuum-1.1/apps/continuum/webapp/WEB-INF/working-directory/23/ldapbrowser-core/src/main/java/org/apache/directory/studio/ldapbrowser/core/model/schema/SchemaUtils.java:[34,53] cannot find symbol
symbol  : class AttributeTypeDescription
location: package org.apache.directory.shared.ldap.schema.syntax

/home/continuum/continuum-1.1/apps/continuum/webapp/WEB-INF/working-directory/23/ldapbrowser-core/src/main/java/org/apache/directory/studio/ldapbrowser/core/model/schema/SchemaUtils.java:[35,53] cannot find symbol
symbol  : class LdapSyntaxDescription
location: package org.apache.directory.shared.ldap.schema.syntax

/home/continuum/continuum-1.1/apps/continuum/webapp/WEB-INF/working-directory/23/ldapbrowser-core/src/main/java/org/apache/directory/studio/ldapbrowser/core/model/schema/SchemaUtils.java:[36,53] cannot find symbol
symbol  : class MatchingRuleDescription
location: package org.apache.directory.shared.ldap.schema.syntax

/home/continuum/continuum-1.1/apps/continuum/webapp/WEB-INF/working-directory/23/ldapbrowser-core/src/main/java/org/apache/directory/studio/ldapbrowser/core/model/schema/SchemaUtils.java:[37,53] cannot find symbol
symbol  : class MatchingRuleUseDescription
location: package org.apache.directory.shared.ldap.schema.syntax

/home/continuum/continuum-1.1/apps/continuum/webapp/WEB-INF/working-directory/23/ldapbrowser-core/src/main/java/org/apache/directory/studio/ldapbrowser/core/model/schema/SchemaUtils.java:[38,53] cannot find symbol
symbol  : class ObjectClassDescription
location: package org.apache.directory.shared.ldap.schema.syntax

/home/continuum/continuum-1.1/apps/continuum/webapp/WEB-INF/working-directory/23/ldapbrowser-core/src/main/java/org/apache/directory/studio/ldapbrowser/core/model/schema/SchemaUtils.java:[71,36] cannot find symbol
symbol  : class AbstractSchemaDescription
location: class org.apache.directory.studio.ldapbrowser.core.model.schema.SchemaUtils

/home/continuum/continuum-1.1/apps/continuum/webapp/WEB-INF/working-directory/23/ldapbrowser-core/src/main/java/org/apache/directory/studio/ldapbrowser/core/model/schema/SchemaUtils.java:[86,68] cannot find symbol
symbol  : class AbstractSchemaDescription
location: class org.apache.directory.studio.ldapbrowser.core.model.schema.SchemaUtils

/home/continuum/continuum-1.1/apps/continuum/webapp/WEB-INF/working-directory/23/ldapbrowser-core/src/main/java/org/apache/directory/studio/ldapbrowser/core/model/schema/SchemaUtils.java:[104,65] cannot find symbol
symbol  : class AbstractSchemaDescription
location: class org.apache.directory.studio.ldapbrowser.core.model.schema.SchemaUtils

/home/continuum/continuum-1.1/apps/continuum/webapp/WEB-INF/working-directory/23/ldapbrowser-core/src/main/java/org/apache/directory/studio/ldapbrowser/core/model/schema/SchemaUtils.java:[115,67] cannot find symbol
symbol  : class AbstractSchemaDescription
location: class org.apache.directory.studio.ldapbrowser.core.model.schema.SchemaUtils

/home/continuum/continuum-1.1/apps/continuum/webapp/WEB-INF/working-directory/23/ldapbrowser-core/src/main/java/org/apache/directory/studio/ldapbrowser/core/model/schema/SchemaUtils.java:[134,62] cannot find symbol
symbol  : class AbstractSchemaDescription
location: class org.apache.directory.studio.ldapbrowser.core.model.schema.SchemaUtils

/home/continuum/continuum-1.1/apps/continuum/webapp/WEB-INF/working-directory/23/ldapbrowser-core/src/main/java/org/apache/directory/studio/ldapbrowser/core/model/schema/SchemaUtils.java:[162,29] cannot find symbol
symbol  : class AttributeTypeDescription
location: class org.apache.directory.studio.ldapbrowser.core.model.schema.SchemaUtils

/home/continuum/continuum-1.1/apps/continuum/webapp/WEB-INF/working-directory/23/ldapbrowser-core/src/main/java/org/apache/directory/studio/ldapbrowser/core/model/schema/SchemaUtils.java:[183,29] cannot find symbol
symbol  : class AttributeTypeDescription
location: class org.apache.directory.studio.ldapbrowser.core.model.schema.SchemaUtils

/home/continuum/continuum-1.1/apps/continuum/webapp/WEB-INF/working-directory/23/ldapbrowser-core/src/main/java/org/apache/directory/studio/ldapbrowser/core/model/schema/SchemaUtils.java:[206,41] cannot find symbol
symbol  : class AttributeTypeDescription
location: class org.apache.directory.studio.ldapbrowser.core.model.schema.SchemaUtils

/home/continuum/continuum-1.1/apps/continuum/webapp/WEB-INF/working-directory/23/ldapbrowser-core/src/main/java/org/apache/directory/studio/ldapbrowser/core/model/schema/SchemaUtils.java:[212,40] cannot find symbol
symbol  : class AttributeTypeDescription
location: class org.apache.directory.studio.ldapbrowser.core.model.schema.SchemaUtils

/home/continuum/continuum-1.1/apps/continuum/webapp/WEB-INF/working-directory/23/ldapbrowser-core/src/main/java/org/apache/directory/studio/ldapbrowser/core/model/schema/SchemaUtils.java:[269,36] cannot find symbol
symbol  : class LdapSyntaxDescription
location: class org.apache.directory.studio.ldapbrowser.core.model.schema.SchemaUtils

/home/continuum/continuum-1.1/apps/continuum/webapp/WEB-INF/working-directory/23/ldapbrowser-core/src/main/java/org/apache/directory/studio/ldapbrowser/core/model/schema/SchemaUtils.java:[283,36] cannot find symbol
symbol  : class LdapSyntaxDescription
location: class org.apache.directory.studio.ldapbrowser.core.model.schema.SchemaUtils

/home/continuum/continuum-1.1/apps/continuum/webapp/WEB-INF/working-directory/23/ldapbrowser-core/src/main/java/org/apache/directory/studio/ldapbrowser/core/model/schema/SchemaUtils.java:[301,36] cannot find symbol
symbol  : class AttributeTypeDescription
location: class org.apache.directory.studio.ldapbrowser.core.model.schema.SchemaUtils

/home/continuum/continuum-1.1/apps/continuum/webapp/WEB-INF/working-directory/23/ldapbrowser-core/src/main/java/org/apache/directory/studio/ldapbrowser/core/model/schema/SchemaUtils.java:[316,36] cannot find symbol
symbol  : class AttributeTypeDescription
location: class org.apache.directory.studio.ldapbrowser.core.model.schema.SchemaUtils

/home/continuum/continuum-1.1/apps/continuum/webapp/WEB-INF/working-directory/23/ldapbrowser-core/src/main/java/org/apache/directory/studio/ldapbrowser/core/model/schema/SchemaUtils.java:[353,93] cannot find symbol
symbol  : class LdapSyntaxDescription
location: class org.apache.directory.studio.ldapbrowser.core.model.schema.SchemaUtils

/home/continuum/continuum-1.1/apps/continuum/webapp/WEB-INF/working-directory/23/ldapbrowser-core/src/main/java/org/apache/directory/studio/ldapbrowser/core/model/schema/SchemaUtils.java:[353,29] cannot find symbol
symbol  : class AttributeTypeDescription
location: class org.apache.directory.studio.ldapbrowser.core.model.schema.SchemaUtils

/home/continuum/continuum-1.1/apps/continuum/webapp/WEB-INF/working-directory/23/ldapbrowser-core/src/main/java/org/apache/directory/studio/ldapbrowser/core/model/schema/SchemaUtils.java:[379,93] cannot find symbol
symbol  : class MatchingRuleDescription
location: class org.apache.directory.studio.ldapbrowser.core.model.schema.SchemaUtils

/home/continuum/continuum-1.1/apps/continuum/webapp/WEB-INF/working-directory/23/ldapbrowser-core/src/main/java/org/apache/directory/studio/ldapbrowser/core/model/schema/SchemaUtils.java:[379,29] cannot find symbol
symbol  : class AttributeTypeDescription
location: class org.apache.directory.studio.ldapbrowser.core.model.schema.SchemaUtils

/home/continuum/continuum-1.1/apps/continuum/webapp/WEB-INF/working-directory/23/ldapbrowser-core/src/main/java/org/apache/directory/studio/ldapbrowser/core/model/schema/SchemaUtils.java:[416,76] cannot find symbol
symbol  : class AttributeTypeDescription
location: class org.apache.directory.studio.ldapbrowser.core.model.schema.SchemaUtils

/home/continuum/continuum-1.1/apps/continuum/webapp/WEB-INF/working-directory/23/ldapbrowser-core/src/main/java/org/apache/directory/studio/ldapbrowser/core/model/schema/SchemaUtils.java:[443,77] cannot find symbol
symbol  : class AttributeTypeDescription
location: class org.apache.directory.studio.ldapbrowser.core.model.schema.SchemaUtils

/home/continuum/continuum-1.1/apps/continuum/webapp/WEB-INF/working-directory/23/ldapbrowser-core/src/main/java/org/apache/directory/studio/ldapbrowser/core/model/schema/SchemaUtils.java:[470,76] cannot find symbol
symbol  : class AttributeTypeDescription
location: class org.apache.directory.studio.ldapbrowser.core.model.schema.SchemaUtils

/home/continuum/continuum-1.1/apps/continuum/webapp/WEB-INF/working-directory/23/ldapbrowser-core/src/main/java/org/apache/directory/studio/ldapbrowser/core/model/schema/SchemaUtils.java:[497,56] cannot find symbol
symbol  : class AttributeTypeDescription
location: class org.apache.directory.studio.ldapbrowser.core.model.schema.SchemaUtils

/home/continuum/continuum-1.1/apps/continuum/webapp/WEB-INF/working-directory/23/ldapbrowser-core/src/main/java/org/apache/directory/studio/ldapbrowser/core/model/schema/SchemaUtils.java:[524,49] cannot find symbol
symbol  : class AttributeTypeDescription
location: class org.apache.directory.studio.ldapbrowser.core.model.schema.SchemaUtils

/home/continuum/continuum-1.1/apps/continuum/webapp/WEB-INF/working-directory/23/ldapbrowser-core/src/main/java/org/apache/directory/studio/ldapbrowser/core/model/schema/SchemaUtils.java:[553,75] cannot find symbol
symbol  : class AttributeTypeDescription
location: class org.apache.directory.studio.ldapbrowser.core.model.schema.SchemaUtils

/home/continuum/continuum-1.1/apps/continuum/webapp/WEB-INF/working-directory/23/ldapbrowser-core/src/main/java/org/apache/directory/studio/ldapbrowser/core/model/schema/SchemaUtils.java:[578,92] cannot find symbol
symbol  : class AttributeTypeDescription
location: class org.apache.directory.studio.ldapbrowser.core.model.schema.SchemaUtils

/home/continuum/continuum-1.1/apps/continuum/webapp/WEB-INF/working-directory/23/ldapbrowser-core/src/main/java/org/apache/directory/studio/ldapbrowser/core/model/schema/SchemaUtils.java:[578,29] cannot find symbol
symbol  : class AttributeTypeDescription
location: class org.apache.directory.studio.ldapbrowser.core.model.schema.SchemaUtils

/home/continuum/continuum-1.1/apps/continuum/webapp/WEB-INF/working-directory/23/ldapbrowser-core/src/main/java/org/apache/directory/studio/ldapbrowser/core/model/schema/SchemaUtils.java:[602,68] cannot find symbol
symbol  : class AttributeTypeDescription
location: class org.apache.directory.studio.ldapbrowser.core.model.schema.SchemaUtils

/home/continuum/continuum-1.1/apps/continuum/webapp/WEB-INF/working-directory/23/ldapbrowser-core/src/main/java/org/apache/directory/studio/ldapbrowser/core/model/schema/SchemaUtils.java:[602,29] cannot find symbol
symbol  : class ObjectClassDescription
location: class org.apache.directory.studio.ldapbrowser.core.model.schema.SchemaUtils

/home/continuum/continuum-1.1/apps/continuum/webapp/WEB-INF/working-directory/23/ldapbrowser-core/src/main/java/org/apache/directory/studio/ldapbrowser/core/model/schema/SchemaUtils.java:[628,67] cannot find symbol
symbol  : class AttributeTypeDescription
location: class org.apache.directory.studio.ldapbrowser.core.model.schema.SchemaUtils

/home/continuum/continuum-1.1/apps/continuum/webapp/WEB-INF/working-directory/23/ldapbrowser-core/src/main/java/org/apache/directory/studio/ldapbrowser/core/model/schema/SchemaUtils.java:[628,29] cannot find symbol
symbol  : class ObjectClassDescription
location: class org.apache.directory.studio.ldapbrowser.core.model.schema.SchemaUtils

/home/continuum/continuum-1.1/apps/continuum/webapp/WEB-INF/working-directory/23/ldapbrowser-core/src/main/java/org/apache/directory/studio/ldapbrowser/core/model/schema/SchemaUtils.java:[646,97] cannot find symbol
symbol  : class ObjectClassDescription
location: class org.apache.directory.studio.ldapbrowser.core.model.schema.SchemaUtils

/home/continuum/continuum-1.1/apps/continuum/webapp/WEB-INF/working-directory/23/ldapbrowser-core/src/main/java/org/apache/directory/studio/ldapbrowser/core/model/schema/SchemaUtils.java:[646,30] cannot find symbol
symbol  : class ObjectClassDescription
location: class org.apache.directory.studio.ldapbrowser.core.model.schema.SchemaUtils

/home/continuum/continuum-1.1/apps/continuum/webapp/WEB-INF/working-directory/23/ldapbrowser-core/src/main/java/org/apache/directory/studio/ldapbrowser/core/model/schema/SchemaUtils.java:[668,83] cannot find symbol
symbol  : class ObjectClassDescription
location: class org.apache.directory.studio.ldapbrowser.core.model.schema.SchemaUtils

/home/continuum/continuum-1.1/apps/continuum/webapp/WEB-INF/working-directory/23/ldapbrowser-core/src/main/java/org/apache/directory/studio/ldapbrowser/core/model/schema/SchemaUtils.java:[668,23] cannot find symbol
symbol  : class ObjectClassDescription
location: class org.apache.directory.studio.ldapbrowser.core.model.schema.SchemaUtils

/home/continuum/continuum-1.1/apps/continuum/webapp/WEB-INF/working-directory/23/ldapbrowser-core/src/main/java/org/apache/directory/studio/ldapbrowser/core/model/schema/SchemaUtils.java:[687,78] cannot find symbol
symbol  : class ObjectClassDescription
location: class org.apache.directory.studio.ldapbrowser.core.model.schema.SchemaUtils

/home/continuum/continuum-1.1/apps/continuum/webapp/WEB-INF/working-directory/23/ldapbrowser-core/src/main/java/org/apache/directory/studio/ldapbrowser/core/model/schema/SchemaUtils.java:[687,23] cannot find symbol
symbol  : class ObjectClassDescription
location: class org.apache.directory.studio.ldapbrowser.core.model.schema.SchemaUtils

/home/continuum/continuum-1.1/apps/continuum/webapp/WEB-INF/working-directory/23/ldapbrowser-core/src/main/java/org/apache/directory/studio/ldapbrowser/core/model/schema/SchemaUtils.java:[711,85] cannot find symbol
symbol  : class ObjectClassDescription
location: class org.apache.directory.studio.ldapbrowser.core.model.schema.SchemaUtils

/home/continuum/continuum-1.1/apps/continuum/webapp/WEB-INF/working-directory/23/ldapbrowser-core/src/main/java/org/apache/directory/studio/ldapbrowser/core/model/schema/SchemaUtils.java:[734,84] cannot find symbol
symbol  : class ObjectClassDescription
location: class org.apache.directory.studio.ldapbrowser.core.model.schema.SchemaUtils

/home/continuum/continuum-1.1/apps/continuum/webapp/WEB-INF/working-directory/23/ldapbrowser-core/src/main/java/org/apache/directory/studio/ldapbrowser/core/model/schema/SchemaUtils.java:[752,38] cannot find symbol
symbol  : class AbstractSchemaDescription
location: class org.apache.directory.studio.ldapbrowser.core.model.schema.SchemaUtils

/home/continuum/continuum-1.1/apps/continuum/webapp/WEB-INF/working-directory/23/ldapbrowser-core/src/main/java/org/apache/directory/studio/ldapbrowser/core/model/schema/SchemaUtils.java:[780,35] cannot find symbol
symbol  : class AbstractSchemaDescription
location: class org.apache.directory.studio.ldapbrowser.core.model.schema.SchemaUtils

/home/continuum/continuum-1.1/apps/continuum/webapp/WEB-INF/working-directory/23/ldapbrowser-core/src/main/java/org/apache/directory/studio/ldapbrowser/core/model/impl/DummyEntry.java:[34,53] cannot find symbol
symbol  : class ObjectClassDescription
location: package org.apache.directory.shared.ldap.schema.syntax

/home/continuum/continuum-1.1/apps/continuum/webapp/WEB-INF/working-directory/23/ldapbrowser-core/src/main/java/org/apache/directory/studio/ldapbrowser/core/BrowserConnectionListener.java:[28,53] cannot find symbol
symbol  : class AttributeTypeDescription
location: package org.apache.directory.shared.ldap.schema.syntax

/home/continuum/continuum-1.1/apps/continuum/webapp/WEB-INF/working-directory/23/ldapbrowser-core/src/main/java/org/apache/directory/studio/ldapbrowser/core/jobs/InitializeAttributesRunnable.java:[37,53] cannot find symbol
symbol  : class AttributeTypeDescription
location: package org.apache.directory.shared.ldap.schema.syntax

/home/continuum/continuum-1.1/apps/continuum/webapp/WEB-INF/working-directory/23/ldapbrowser-core/src/main/java/org/apache/directory/studio/ldapbrowser/core/model/impl/Attribute.java:[28,53] cannot find symbol
symbol  : class AttributeTypeDescription
location: package org.apache.directory.shared.ldap.schema.syntax

/home/continuum/continuum-1.1/apps/continuum/webapp/WEB-INF/working-directory/23/ldapbrowser-core/src/main/java/org/apache/directory/studio/ldapbrowser/core/model/impl/Attribute.java:[443,11] cannot find symbol
symbol  : class AttributeTypeDescription
location: class org.apache.directory.studio.ldapbrowser.core.model.impl.Attribute

/home/continuum/continuum-1.1/apps/continuum/webapp/WEB-INF/working-directory/23/ldapbrowser-core/src/main/java/org/apache/directory/studio/ldapbrowser/core/model/schema/Subschema.java:[126,8] cannot find symbol
symbol  : class AttributeTypeDescription
location: class org.apache.directory.studio.ldapbrowser.core.model.schema.Subschema

/home/continuum/continuum-1.1/apps/continuum/webapp/WEB-INF/working-directory/23/ldapbrowser-core/src/main/java/org/apache/directory/studio/ldapbrowser/core/model/schema/Subschema.java:[126,46] cannot find symbol
symbol  : class AttributeTypeDescription
location: class org.apache.directory.studio.ldapbrowser.core.model.schema.Subschema

/home/continuum/continuum-1.1/apps/continuum/webapp/WEB-INF/working-directory/23/ldapbrowser-core/src/main/java/org/apache/directory/studio/ldapbrowser/core/model/schema/Subschema.java:[129,12] cannot find symbol
symbol  : class AttributeTypeDescription
location: class org.apache.directory.studio.ldapbrowser.core.model.schema.Subschema

/home/continuum/continuum-1.1/apps/continuum/webapp/WEB-INF/working-directory/23/ldapbrowser-core/src/main/java/org/apache/directory/studio/ldapbrowser/core/model/schema/Subschema.java:[139,8] cannot find symbol
symbol  : class ObjectClassDescription
location: class org.apache.directory.studio.ldapbrowser.core.model.schema.Subschema

/home/continuum/continuum-1.1/apps/continuum/webapp/WEB-INF/working-directory/23/ldapbrowser-core/src/main/java/org/apache/directory/studio/ldapbrowser/core/model/schema/Subschema.java:[177,8] cannot find symbol
symbol  : class AttributeTypeDescription
location: class org.apache.directory.studio.ldapbrowser.core.model.schema.Subschema

/home/continuum/continuum-1.1/apps/continuum/webapp/WEB-INF/working-directory/23/ldapbrowser-core/src/main/java/org/apache/directory/studio/ldapbrowser/core/model/schema/Subschema.java:[177,46] cannot find symbol
symbol  : class AttributeTypeDescription
location: class org.apache.directory.studio.ldapbrowser.core.model.schema.Subschema

/home/continuum/continuum-1.1/apps/continuum/webapp/WEB-INF/working-directory/23/ldapbrowser-core/src/main/java/org/apache/directory/studio/ldapbrowser/core/model/schema/Subschema.java:[180,12] cannot find symbol
symbol  : class AttributeTypeDescription
location: class org.apache.directory.studio.ldapbrowser.core.model.schema.Subschema

/home/continuum/continuum-1.1/apps/continuum/webapp/WEB-INF/working-directory/23/ldapbrowser-core/src/main/java/org/apache/directory/studio/ldapbrowser/core/model/schema/Subschema.java:[190,8] cannot find symbol
symbol  : class ObjectClassDescription
location: class org.apache.directory.studio.ldapbrowser.core.model.schema.Subschema

/home/continuum/continuum-1.1/apps/continuum/webapp/WEB-INF/working-directory/23/ldapbrowser-core/src/main/java/org/apache/directory/studio/ldapbrowser/core/model/schema/Schema.java:[88,32] cannot find symbol
symbol  : class LdapSyntaxDescription
location: class org.apache.directory.studio.ldapbrowser.core.model.schema.Schema


[INFO] ------------------------------------------------------------------------
[INFO] For more information, run Maven with the -e switch
[INFO] ------------------------------------------------------------------------
[INFO] Total time: 2 minutes 1 second
[INFO] Finished at: Wed Jan 21 14:32:15 EST 2009
[INFO] Final Memory: 84M/508M
[INFO] ------------------------------------------------------------------------

****************************************************************************



Mime
View raw message