directory-notifications mailing list archives

Site index · List index
Message view « Date » · « Thread »
Top « Date » · « Thread »
From Continuum VMBuild Server <contin...@vm094.oxylos.org>
Subject [continuum] BUILD FAILURE: Default Project Group - ApacheDS - Build Def: default maven2 buildDefinition
Date Wed, 21 Jan 2009 03:32:43 GMT
Online report : http://vm094.oxylos.org/continuum/buildResult.action?buildId=3021&projectId=10

Build statistics:
  State: Failed
  Previous State: Failed
  Started at: Tue 20 Jan 2009 22:31:41 -0500
  Finished at: Tue 20 Jan 2009 22:32:41 -0500
  Total time: 59s
  Build Trigger: Schedule
  Build Number: 349
  Exit code: 1
  Building machine hostname: vm094.oxylos.org
  Operating system : Linux(unknown)
  Java Home version : 
          java version "1.6.0_06"
          Java(TM) SE Runtime Environment (build 1.6.0_06-b02)
          Java HotSpot(TM) Client VM (build 10.0-b22, mixed mode, sharing)
        
  Builder version :
          Maven version: 2.0.9
          Java version: 1.6.0_06
          OS name: "linux" version: "2.6.18-92.1.10.el5" arch: "i386" Family: "unix"
    
****************************************************************************
SCM Changes:
****************************************************************************
Changed: no author @ no date
Comment: no comment
Files changed:
  core-entry/src/test/java/org/apache/directory/server/core/entry/ServerStringValueTest.java
( no revision )
  core-entry/src/main/java/org/apache/directory/server/core/entry/TestServerEntryUtils.java
( no revision )
  core/src/test/java/org/apache/directory/server/core/authz/support/DummyAttributeTypeRegistry.java
( no revision )
  core/src/main/java/org/apache/directory/server/core/schema/SchemaSubentryModifier.java (
no revision )
  core/src/main/java/org/apache/directory/server/core/schema/SchemaService.java ( no revision
)
  core/src/main/java/org/apache/directory/server/core/schema/SchemaOperationControl.java (
no revision )
  core/src/main/java/org/apache/directory/server/core/schema/SyntaxImpl.java ( no revision
)
  core/src/main/java/org/apache/directory/server/core/schema/MetaComparatorHandler.java (
no revision )
  core/src/main/java/org/apache/directory/server/core/schema/SchemaInterceptor.java ( no revision
)
  core/src/main/java/org/apache/directory/server/core/schema/MetaSyntaxCheckerHandler.java
( no revision )
  core/src/main/java/org/apache/directory/server/core/schema/PartitionSchemaLoader.java (
no revision )
  core/src/main/java/org/apache/directory/server/core/schema/DescriptionParsers.java ( no
revision )
  core/src/main/java/org/apache/directory/server/core/schema/SchemaEntityFactory.java ( no
revision )
  core/src/main/java/org/apache/directory/server/core/schema/MetaNormalizerHandler.java (
no revision )
  core-integ/src/test/java/org/apache/directory/server/core/schema/SchemaPersistenceIT.java
( no revision )
  core-integ/src/test/java/org/apache/directory/server/core/schema/SubschemaSubentryIT.java
( no revision )
  core-integ/src/test/java/org/apache/directory/server/core/schema/MetaSyntaxCheckerHandlerIT.java
( no revision )
  core-integ/src/test/resources/org/apache/directory/server/core/schema/DummySyntaxChecker.bytecode
( no revision )
  xdbm-search/src/test/java/org/apache/directory/server/xdbm/search/impl/GreaterEqTest.java
( no revision )
  xdbm-search/src/test/java/org/apache/directory/server/xdbm/search/impl/BogusSyntax.java
( no revision )
  xdbm-search/src/test/java/org/apache/directory/server/xdbm/search/impl/LessEqTest.java (
no revision )
  schema-extras/src/main/java/org/apache/directory/server/schema/bootstrap/NisSyntaxCheckerProducer.java
( no revision )
  jdbm-store/src/test/java/org/apache/directory/server/core/partition/impl/btree/jdbm/JdbmTableNoDuplicatesTest.java
( no revision )
  jdbm-store/src/test/java/org/apache/directory/server/core/partition/impl/btree/jdbm/NoDupsCursorTest.java
( no revision )
  jdbm-store/src/test/java/org/apache/directory/server/core/partition/impl/btree/jdbm/MockComparatorRegistry.java
( no revision )
  jdbm-store/src/test/java/org/apache/directory/server/core/partition/impl/btree/jdbm/DupsContainerCursorTest.java
( no revision )
  jdbm-store/src/test/java/org/apache/directory/server/core/partition/impl/btree/jdbm/KeyTupleBTreeCursorTest.java
( no revision )
  jdbm-store/src/test/java/org/apache/directory/server/core/partition/impl/btree/jdbm/JdbmTableWithDuplicatesTest.java
( no revision )
  bootstrap-plugin/src/main/java/org/apache/directory/server/core/bootstrap/plugin/BootstrapPlugin.java
( no revision )
  schema-bootstrap/src/main/java/org/apache/directory/server/schema/bootstrap/ApachemetaSyntaxProducer.java
( no revision )
  schema-bootstrap/src/main/java/org/apache/directory/server/schema/bootstrap/AbstractBootstrapProducer.java
( no revision )
  schema-bootstrap/src/main/java/org/apache/directory/server/schema/bootstrap/BootstrapSchemaLoader.java
( no revision )
  schema-bootstrap/src/main/java/org/apache/directory/server/schema/bootstrap/ApachemetaSyntaxCheckerProducer.java
( no revision )
  schema-bootstrap/src/main/java/org/apache/directory/server/schema/bootstrap/ApacheSyntaxProducer.java
( no revision )
  schema-registries/src/main/java/org/apache/directory/server/schema/registries/ComparatorRegistry.java
( no revision )
  schema-registries/src/main/java/org/apache/directory/server/schema/registries/SyntaxCheckerRegistry.java
( no revision )
  schema-registries/src/main/java/org/apache/directory/server/schema/registries/DefaultComparatorRegistry.java
( no revision )
  schema-registries/src/main/java/org/apache/directory/server/schema/registries/DefaultSyntaxCheckerRegistry.java
( no revision )
  schema-registries/src/main/java/org/apache/directory/server/schema/registries/NormalizerRegistry.java
( no revision )
  schema-registries/src/main/java/org/apache/directory/server/schema/registries/DefaultNormalizerRegistry.java
( no revision )
  utils/src/main/java/org/apache/directory/server/utils/AttributesFactory.java ( no revision
)

****************************************************************************
Dependencies Changes:
****************************************************************************
No dependencies changed


****************************************************************************
Build Defintion:
****************************************************************************
POM filename: pom.xml
Goals: clean deploy   
Arguments: --batch-mode
Build Fresh: false
Always Build: false
Default Build Definition: true
Schedule: EVERY_30_MINUTES
Description: default maven2 buildDefinition

****************************************************************************
Test Summary:
****************************************************************************
Tests: 1429
Failures: 0
Total time: 182.68004


****************************************************************************
Output:
****************************************************************************
[INFO] Scanning for projects...
[INFO] Reactor build order: 
[INFO]   ApacheDS
[INFO]   ApacheDS Core Constants
[INFO]   ApacheDS Core Shared
[INFO]   ApacheDS Schema Registries
[INFO]   ApacheDS Core Cursor
[INFO]   ApacheDS JDBM implementation
[INFO]   ApacheDS Core Plugin (Maven 2)
[INFO]   ApacheDS Bootstrap Schemas
[INFO]   ApacheDS Extra Schemas
[INFO]   ApacheDS Core Entry
[INFO]   ApacheDS XDBM Base
[INFO]   ApacheDS Core AVL
[INFO]   ApacheDS Generalized (X) DBM Tools
[INFO]   ApacheDS JDBM Store
[INFO]   ApacheDS Generalized (X) DBM Search Engine
[INFO]   ApacheDS Utils
[INFO]   ApacheDS Bootstrap Partition File Extractor
[INFO]   ApacheDS Bootstrap Plugin
[INFO]   ApacheDS Bootstrap Partition
[INFO]   ApacheDS Core
[INFO]   ApacheDS Core JNDI
[INFO]   ApacheDS Protocol Shared
[INFO]   ApacheDS Protocol Kerberos Shared
[INFO]   ApacheDS Protocol Ldap
[INFO]   ApacheDS Server JNDI
[INFO]   ApacheDS Interceptors for Kerberos
[INFO]   ApacheDS All
[INFO]   ApacheDS Core Unit
[INFO]   ApacheDS Core Integration
[INFO]   ApacheDS Core Splay
[INFO]   ApacheDS Server Unit
[INFO]   ApacheDS Protocol Ntp
[INFO]   ApacheDS Protocol Kerberos
[INFO]   ApacheDS Protocol Dhcp
[INFO]   ApacheDS Protocol Dns
[INFO]   ApacheDS Protocol Change Password
[INFO]   ApacheDS Server Integration
[INFO]   ApacheDS replication
[INFO]   ApacheDS Xbean Spring
[INFO]   ApacheDS Server XML File
[INFO]   ApacheDS Server Tools
[INFO]   ApacheDS Server Replication Service
[INFO] ------------------------------------------------------------------------
[INFO] Building ApacheDS
[INFO]    task-segment: [clean, deploy]
[INFO] ------------------------------------------------------------------------
[INFO] [clean:clean]
[INFO] Deleting directory /home/continuum/continuum-1.1/apps/continuum/webapp/WEB-INF/working-directory/10/target
[INFO] Setting property: classpath.resource.loader.class => 'org.codehaus.plexus.velocity.ContextClassLoaderResourceLoader'.
[INFO] Setting property: velocimacro.messages.on => 'false'.
[INFO] Setting property: resource.loader => 'classpath'.
[INFO] Setting property: resource.manager.logwhenfound => 'false'.
[INFO] [remote-resources:process {execution: default}]
[INFO] [site:attach-descriptor]
[INFO] Unable to load parent project from a relative path: Could not find the model file '/home/continuum/continuum-1.1/apps/continuum/webapp/WEB-INF/working-directory/pom.xml'.
for project unknown
[INFO] Parent project loaded from repository.
[INFO] [tools:verify-legal-files {execution: verify-legal-files}]
[INFO] [install:install]
[INFO] Installing /home/continuum/continuum-1.1/apps/continuum/webapp/WEB-INF/working-directory/10/pom.xml
to /home/continuum/.m2/repository/org/apache/directory/server/apacheds-parent/1.5.5-SNAPSHOT/apacheds-parent-1.5.5-SNAPSHOT.pom
[INFO] [deploy:deploy]
altDeploymentRepository = null
[INFO] Retrieving previous build number from apache.directory.snapshot.repo
Uploading: scpexe://vm094.oxylos.org/var/www/html/mirror-maven2/org/apache/directory/server/apacheds-parent/1.5.5-SNAPSHOT/apacheds-parent-1.5.5-SNAPSHOT.pom
[INFO] Retrieving previous metadata from apache.directory.snapshot.repo
[INFO] Uploading repository metadata for: 'artifact org.apache.directory.server:apacheds-parent'
[INFO] Uploading site descriptor for apacheds-parent 1.5.5-SNAPSHOT site.xml
[INFO] Retrieving previous metadata from apache.directory.snapshot.repo
[INFO] Uploading repository metadata for: 'snapshot org.apache.directory.server:apacheds-parent:1.5.5-SNAPSHOT'
[INFO] ------------------------------------------------------------------------
[INFO] Building ApacheDS Core Constants
[INFO]    task-segment: [clean, deploy]
[INFO] ------------------------------------------------------------------------
[INFO] [clean:clean]
[INFO] Deleting directory /home/continuum/continuum-1.1/apps/continuum/webapp/WEB-INF/working-directory/10/core-constants/target
[INFO] [remote-resources:process {execution: default}]
[INFO] [resources:resources]
[INFO] Using default encoding to copy filtered resources.
[INFO] [compiler:compile]
[INFO] Compiling 5 source files to /home/continuum/continuum-1.1/apps/continuum/webapp/WEB-INF/working-directory/10/core-constants/target/classes
[INFO] [resources:testResources]
[INFO] Using default encoding to copy filtered resources.
[INFO] [compiler:testCompile]
[INFO] No sources to compile
[INFO] [surefire:test]
[INFO] Surefire report directory: /home/continuum/continuum-1.1/apps/continuum/webapp/WEB-INF/working-directory/10/core-constants/target/surefire-reports

-------------------------------------------------------
 T E S T S
-------------------------------------------------------
There are no tests to run.

Results :

Tests run: 0, Failures: 0, Errors: 0, Skipped: 0

[INFO] [jar:jar]
[INFO] Building jar: /home/continuum/continuum-1.1/apps/continuum/webapp/WEB-INF/working-directory/10/core-constants/target/apacheds-core-constants-1.5.5-SNAPSHOT.jar
[INFO] [tools:verify-legal-files {execution: verify-legal-files}]
[INFO] Checking legal files in: apacheds-core-constants-1.5.5-SNAPSHOT.jar
[INFO] [install:install]
[INFO] Installing /home/continuum/continuum-1.1/apps/continuum/webapp/WEB-INF/working-directory/10/core-constants/target/apacheds-core-constants-1.5.5-SNAPSHOT.jar
to /home/continuum/.m2/repository/org/apache/directory/server/apacheds-core-constants/1.5.5-SNAPSHOT/apacheds-core-constants-1.5.5-SNAPSHOT.jar
[INFO] [deploy:deploy]
altDeploymentRepository = null
[INFO] Retrieving previous build number from apache.directory.snapshot.repo
Uploading: scpexe://vm094.oxylos.org/var/www/html/mirror-maven2/org/apache/directory/server/apacheds-core-constants/1.5.5-SNAPSHOT/apacheds-core-constants-1.5.5-SNAPSHOT.jar
[INFO] Uploading project information for apacheds-core-constants 1.5.5-SNAPSHOT
[INFO] Retrieving previous metadata from apache.directory.snapshot.repo
[INFO] Uploading repository metadata for: 'artifact org.apache.directory.server:apacheds-core-constants'
[INFO] Retrieving previous metadata from apache.directory.snapshot.repo
[INFO] Uploading repository metadata for: 'snapshot org.apache.directory.server:apacheds-core-constants:1.5.5-SNAPSHOT'
[INFO] ------------------------------------------------------------------------
[INFO] Building ApacheDS Core Shared
[INFO]    task-segment: [clean, deploy]
[INFO] ------------------------------------------------------------------------
[INFO] [clean:clean]
[INFO] Deleting directory /home/continuum/continuum-1.1/apps/continuum/webapp/WEB-INF/working-directory/10/core-shared/target
[INFO] [remote-resources:process {execution: default}]
[INFO] [resources:resources]
[INFO] Using default encoding to copy filtered resources.
[INFO] [compiler:compile]
[INFO] Compiling 4 source files to /home/continuum/continuum-1.1/apps/continuum/webapp/WEB-INF/working-directory/10/core-shared/target/classes
[INFO] [resources:testResources]
[INFO] Using default encoding to copy filtered resources.
[INFO] [compiler:testCompile]
[INFO] Nothing to compile - all classes are up to date
[INFO] [surefire:test]
[INFO] Surefire report directory: /home/continuum/continuum-1.1/apps/continuum/webapp/WEB-INF/working-directory/10/core-shared/target/surefire-reports

-------------------------------------------------------
 T E S T S
-------------------------------------------------------
There are no tests to run.

Results :

Tests run: 0, Failures: 0, Errors: 0, Skipped: 0

[INFO] [jar:jar]
[INFO] Building jar: /home/continuum/continuum-1.1/apps/continuum/webapp/WEB-INF/working-directory/10/core-shared/target/apacheds-core-shared-1.5.5-SNAPSHOT.jar
[INFO] [tools:verify-legal-files {execution: verify-legal-files}]
[INFO] Checking legal files in: apacheds-core-shared-1.5.5-SNAPSHOT.jar
[INFO] [install:install]
[INFO] Installing /home/continuum/continuum-1.1/apps/continuum/webapp/WEB-INF/working-directory/10/core-shared/target/apacheds-core-shared-1.5.5-SNAPSHOT.jar
to /home/continuum/.m2/repository/org/apache/directory/server/apacheds-core-shared/1.5.5-SNAPSHOT/apacheds-core-shared-1.5.5-SNAPSHOT.jar
[INFO] [deploy:deploy]
altDeploymentRepository = null
[INFO] Retrieving previous build number from apache.directory.snapshot.repo
Uploading: scpexe://vm094.oxylos.org/var/www/html/mirror-maven2/org/apache/directory/server/apacheds-core-shared/1.5.5-SNAPSHOT/apacheds-core-shared-1.5.5-SNAPSHOT.jar
[INFO] Retrieving previous metadata from apache.directory.snapshot.repo
[INFO] Uploading repository metadata for: 'artifact org.apache.directory.server:apacheds-core-shared'
[INFO] Uploading project information for apacheds-core-shared 1.5.5-SNAPSHOT
[INFO] Retrieving previous metadata from apache.directory.snapshot.repo
[INFO] Uploading repository metadata for: 'snapshot org.apache.directory.server:apacheds-core-shared:1.5.5-SNAPSHOT'
[INFO] ------------------------------------------------------------------------
[INFO] Building ApacheDS Schema Registries
[INFO]    task-segment: [clean, deploy]
[INFO] ------------------------------------------------------------------------
[INFO] [clean:clean]
[INFO] Deleting directory /home/continuum/continuum-1.1/apps/continuum/webapp/WEB-INF/working-directory/10/schema-registries/target
[INFO] [remote-resources:process {execution: default}]
[INFO] [resources:resources]
[INFO] Using default encoding to copy filtered resources.
[INFO] [compiler:compile]
[INFO] Compiling 36 source files to /home/continuum/continuum-1.1/apps/continuum/webapp/WEB-INF/working-directory/10/schema-registries/target/classes
[INFO] ------------------------------------------------------------------------
[ERROR] BUILD FAILURE
[INFO] ------------------------------------------------------------------------
[INFO] Compilation failure

/home/continuum/continuum-1.1/apps/continuum/webapp/WEB-INF/working-directory/10/schema-registries/src/main/java/org/apache/directory/server/schema/registries/DefaultComparatorRegistry.java:[32,54]
package org.apache.directory.shared.ldap.schema.parsers does not exist

/home/continuum/continuum-1.1/apps/continuum/webapp/WEB-INF/working-directory/10/schema-registries/src/main/java/org/apache/directory/server/schema/registries/ComparatorRegistry.java:[28,54]
package org.apache.directory.shared.ldap.schema.parsers does not exist

/home/continuum/continuum-1.1/apps/continuum/webapp/WEB-INF/working-directory/10/schema-registries/src/main/java/org/apache/directory/server/schema/registries/DefaultComparatorRegistry.java:[52,29]
cannot find symbol
symbol  : class ComparatorDescription
location: class org.apache.directory.server.schema.registries.DefaultComparatorRegistry

/home/continuum/continuum-1.1/apps/continuum/webapp/WEB-INF/working-directory/10/schema-registries/src/main/java/org/apache/directory/server/schema/registries/DefaultComparatorRegistry.java:[78,26]
cannot find symbol
symbol  : class ComparatorDescription
location: class org.apache.directory.server.schema.registries.DefaultComparatorRegistry

/home/continuum/continuum-1.1/apps/continuum/webapp/WEB-INF/working-directory/10/schema-registries/src/main/java/org/apache/directory/server/schema/registries/DefaultComparatorRegistry.java:[96,37]
cannot find symbol
symbol  : class ComparatorDescription
location: class org.apache.directory.server.schema.registries.DefaultComparatorRegistry

/home/continuum/continuum-1.1/apps/continuum/webapp/WEB-INF/working-directory/10/schema-registries/src/main/java/org/apache/directory/server/schema/registries/DefaultComparatorRegistry.java:[200,20]
cannot find symbol
symbol  : class ComparatorDescription
location: class org.apache.directory.server.schema.registries.DefaultComparatorRegistry

/home/continuum/continuum-1.1/apps/continuum/webapp/WEB-INF/working-directory/10/schema-registries/src/main/java/org/apache/directory/server/schema/registries/ComparatorRegistry.java:[57,19]
cannot find symbol
symbol  : class ComparatorDescription
location: interface org.apache.directory.server.schema.registries.ComparatorRegistry

/home/continuum/continuum-1.1/apps/continuum/webapp/WEB-INF/working-directory/10/schema-registries/src/main/java/org/apache/directory/server/schema/registries/ComparatorRegistry.java:[95,13]
cannot find symbol
symbol  : class ComparatorDescription
location: interface org.apache.directory.server.schema.registries.ComparatorRegistry

/home/continuum/continuum-1.1/apps/continuum/webapp/WEB-INF/working-directory/10/schema-registries/src/main/java/org/apache/directory/server/schema/registries/DefaultAttributeTypeRegistry.java:[36,58]
package org.apache.directory.shared.ldap.schema.normalizers does not exist

/home/continuum/continuum-1.1/apps/continuum/webapp/WEB-INF/working-directory/10/schema-registries/src/main/java/org/apache/directory/server/schema/registries/DefaultAttributeTypeRegistry.java:[37,58]
package org.apache.directory.shared.ldap.schema.normalizers does not exist

/home/continuum/continuum-1.1/apps/continuum/webapp/WEB-INF/working-directory/10/schema-registries/src/main/java/org/apache/directory/server/schema/registries/AttributeTypeRegistry.java:[24,58]
package org.apache.directory.shared.ldap.schema.normalizers does not exist

/home/continuum/continuum-1.1/apps/continuum/webapp/WEB-INF/working-directory/10/schema-registries/src/main/java/org/apache/directory/server/schema/registries/DefaultAttributeTypeRegistry.java:[65,34]
cannot find symbol
symbol  : class OidNormalizer
location: class org.apache.directory.server.schema.registries.DefaultAttributeTypeRegistry

/home/continuum/continuum-1.1/apps/continuum/webapp/WEB-INF/working-directory/10/schema-registries/src/main/java/org/apache/directory/server/schema/registries/DefaultAttributeTypeRegistry.java:[293,22]
cannot find symbol
symbol  : class OidNormalizer
location: class org.apache.directory.server.schema.registries.DefaultAttributeTypeRegistry

/home/continuum/continuum-1.1/apps/continuum/webapp/WEB-INF/working-directory/10/schema-registries/src/main/java/org/apache/directory/server/schema/registries/AttributeTypeRegistry.java:[97,16]
cannot find symbol
symbol  : class OidNormalizer
location: interface org.apache.directory.server.schema.registries.AttributeTypeRegistry

/home/continuum/continuum-1.1/apps/continuum/webapp/WEB-INF/working-directory/10/schema-registries/src/main/java/org/apache/directory/server/schema/registries/NormalizerRegistry.java:[28,54]
package org.apache.directory.shared.ldap.schema.parsers does not exist

/home/continuum/continuum-1.1/apps/continuum/webapp/WEB-INF/working-directory/10/schema-registries/src/main/java/org/apache/directory/server/schema/registries/SyntaxCheckerRegistry.java:[27,46]
cannot find symbol
symbol  : class SyntaxChecker
location: package org.apache.directory.shared.ldap.schema

/home/continuum/continuum-1.1/apps/continuum/webapp/WEB-INF/working-directory/10/schema-registries/src/main/java/org/apache/directory/server/schema/registries/SyntaxCheckerRegistry.java:[28,54]
package org.apache.directory.shared.ldap.schema.parsers does not exist

/home/continuum/continuum-1.1/apps/continuum/webapp/WEB-INF/working-directory/10/schema-registries/src/main/java/org/apache/directory/server/schema/registries/NormalizerRegistry.java:[46,19]
cannot find symbol
symbol  : class NormalizerDescription
location: interface org.apache.directory.server.schema.registries.NormalizerRegistry

/home/continuum/continuum-1.1/apps/continuum/webapp/WEB-INF/working-directory/10/schema-registries/src/main/java/org/apache/directory/server/schema/registries/NormalizerRegistry.java:[96,13]
cannot find symbol
symbol  : class NormalizerDescription
location: interface org.apache.directory.server.schema.registries.NormalizerRegistry

/home/continuum/continuum-1.1/apps/continuum/webapp/WEB-INF/working-directory/10/schema-registries/src/main/java/org/apache/directory/server/schema/registries/SyntaxCheckerRegistry.java:[47,19]
cannot find symbol
symbol  : class SyntaxCheckerDescription
location: interface org.apache.directory.server.schema.registries.SyntaxCheckerRegistry

/home/continuum/continuum-1.1/apps/continuum/webapp/WEB-INF/working-directory/10/schema-registries/src/main/java/org/apache/directory/server/schema/registries/SyntaxCheckerRegistry.java:[47,57]
cannot find symbol
symbol  : class SyntaxChecker
location: interface org.apache.directory.server.schema.registries.SyntaxCheckerRegistry

/home/continuum/continuum-1.1/apps/continuum/webapp/WEB-INF/working-directory/10/schema-registries/src/main/java/org/apache/directory/server/schema/registries/SyntaxCheckerRegistry.java:[58,4]
cannot find symbol
symbol  : class SyntaxChecker
location: interface org.apache.directory.server.schema.registries.SyntaxCheckerRegistry

/home/continuum/continuum-1.1/apps/continuum/webapp/WEB-INF/working-directory/10/schema-registries/src/main/java/org/apache/directory/server/schema/registries/SyntaxCheckerRegistry.java:[87,13]
cannot find symbol
symbol  : class SyntaxChecker
location: interface org.apache.directory.server.schema.registries.SyntaxCheckerRegistry

/home/continuum/continuum-1.1/apps/continuum/webapp/WEB-INF/working-directory/10/schema-registries/src/main/java/org/apache/directory/server/schema/registries/SyntaxCheckerRegistry.java:[95,13]
cannot find symbol
symbol  : class SyntaxCheckerDescription
location: interface org.apache.directory.server.schema.registries.SyntaxCheckerRegistry

/home/continuum/continuum-1.1/apps/continuum/webapp/WEB-INF/working-directory/10/schema-registries/src/main/java/org/apache/directory/server/schema/ConcreteNameComponentNormalizer.java:[33,58]
package org.apache.directory.shared.ldap.schema.normalizers does not exist

/home/continuum/continuum-1.1/apps/continuum/webapp/WEB-INF/working-directory/10/schema-registries/src/main/java/org/apache/directory/server/schema/registries/DefaultSyntaxCheckerRegistry.java:[31,46]
cannot find symbol
symbol  : class SyntaxChecker
location: package org.apache.directory.shared.ldap.schema

/home/continuum/continuum-1.1/apps/continuum/webapp/WEB-INF/working-directory/10/schema-registries/src/main/java/org/apache/directory/server/schema/registries/DefaultSyntaxCheckerRegistry.java:[32,54]
package org.apache.directory.shared.ldap.schema.parsers does not exist

/home/continuum/continuum-1.1/apps/continuum/webapp/WEB-INF/working-directory/10/schema-registries/src/main/java/org/apache/directory/server/schema/registries/DefaultSyntaxCheckerRegistry.java:[48,30]
cannot find symbol
symbol  : class SyntaxChecker
location: class org.apache.directory.server.schema.registries.DefaultSyntaxCheckerRegistry

/home/continuum/continuum-1.1/apps/continuum/webapp/WEB-INF/working-directory/10/schema-registries/src/main/java/org/apache/directory/server/schema/registries/DefaultSyntaxCheckerRegistry.java:[50,30]
cannot find symbol
symbol  : class SyntaxCheckerDescription
location: class org.apache.directory.server.schema.registries.DefaultSyntaxCheckerRegistry

/home/continuum/continuum-1.1/apps/continuum/webapp/WEB-INF/working-directory/10/schema-registries/src/main/java/org/apache/directory/server/schema/registries/DefaultSyntaxCheckerRegistry.java:[73,26]
cannot find symbol
symbol  : class SyntaxCheckerDescription
location: class org.apache.directory.server.schema.registries.DefaultSyntaxCheckerRegistry

/home/continuum/continuum-1.1/apps/continuum/webapp/WEB-INF/working-directory/10/schema-registries/src/main/java/org/apache/directory/server/schema/registries/DefaultSyntaxCheckerRegistry.java:[73,77]
cannot find symbol
symbol  : class SyntaxChecker
location: class org.apache.directory.server.schema.registries.DefaultSyntaxCheckerRegistry

/home/continuum/continuum-1.1/apps/continuum/webapp/WEB-INF/working-directory/10/schema-registries/src/main/java/org/apache/directory/server/schema/registries/DefaultSyntaxCheckerRegistry.java:[90,11]
cannot find symbol
symbol  : class SyntaxChecker
location: class org.apache.directory.server.schema.registries.DefaultSyntaxCheckerRegistry

/home/continuum/continuum-1.1/apps/continuum/webapp/WEB-INF/working-directory/10/schema-registries/src/main/java/org/apache/directory/server/schema/registries/DefaultSyntaxCheckerRegistry.java:[128,37]
cannot find symbol
symbol  : class SyntaxCheckerDescription
location: class org.apache.directory.server.schema.registries.DefaultSyntaxCheckerRegistry

/home/continuum/continuum-1.1/apps/continuum/webapp/WEB-INF/working-directory/10/schema-registries/src/main/java/org/apache/directory/server/schema/registries/DefaultSyntaxCheckerRegistry.java:[141,20]
cannot find symbol
symbol  : class SyntaxChecker
location: class org.apache.directory.server.schema.registries.DefaultSyntaxCheckerRegistry

/home/continuum/continuum-1.1/apps/continuum/webapp/WEB-INF/working-directory/10/schema-registries/src/main/java/org/apache/directory/server/schema/registries/DefaultSyntaxCheckerRegistry.java:[192,20]
cannot find symbol
symbol  : class SyntaxCheckerDescription
location: class org.apache.directory.server.schema.registries.DefaultSyntaxCheckerRegistry

/home/continuum/continuum-1.1/apps/continuum/webapp/WEB-INF/working-directory/10/schema-registries/src/main/java/org/apache/directory/server/schema/registries/DefaultNormalizerRegistry.java:[32,54]
package org.apache.directory.shared.ldap.schema.parsers does not exist

/home/continuum/continuum-1.1/apps/continuum/webapp/WEB-INF/working-directory/10/schema-registries/src/main/java/org/apache/directory/server/schema/registries/DefaultNormalizerRegistry.java:[56,29]
cannot find symbol
symbol  : class NormalizerDescription
location: class org.apache.directory.server.schema.registries.DefaultNormalizerRegistry

/home/continuum/continuum-1.1/apps/continuum/webapp/WEB-INF/working-directory/10/schema-registries/src/main/java/org/apache/directory/server/schema/registries/DefaultNormalizerRegistry.java:[79,26]
cannot find symbol
symbol  : class NormalizerDescription
location: class org.apache.directory.server.schema.registries.DefaultNormalizerRegistry

/home/continuum/continuum-1.1/apps/continuum/webapp/WEB-INF/working-directory/10/schema-registries/src/main/java/org/apache/directory/server/schema/registries/DefaultNormalizerRegistry.java:[137,37]
cannot find symbol
symbol  : class NormalizerDescription
location: class org.apache.directory.server.schema.registries.DefaultNormalizerRegistry

/home/continuum/continuum-1.1/apps/continuum/webapp/WEB-INF/working-directory/10/schema-registries/src/main/java/org/apache/directory/server/schema/registries/DefaultNormalizerRegistry.java:[201,20]
cannot find symbol
symbol  : class NormalizerDescription
location: class org.apache.directory.server.schema.registries.DefaultNormalizerRegistry

/home/continuum/continuum-1.1/apps/continuum/webapp/WEB-INF/working-directory/10/schema-registries/src/main/java/org/apache/directory/server/schema/registries/DefaultComparatorRegistry.java:[69,51]
cannot find symbol
symbol  : class ComparatorDescription
location: class org.apache.directory.server.schema.registries.DefaultComparatorRegistry

/home/continuum/continuum-1.1/apps/continuum/webapp/WEB-INF/working-directory/10/schema-registries/src/main/java/org/apache/directory/server/schema/registries/DefaultComparatorRegistry.java:[172,12]
cannot find symbol
symbol  : class ComparatorDescription
location: class org.apache.directory.server.schema.registries.DefaultComparatorRegistry

/home/continuum/continuum-1.1/apps/continuum/webapp/WEB-INF/working-directory/10/schema-registries/src/main/java/org/apache/directory/server/schema/registries/DefaultComparatorRegistry.java:[188,12]
cannot find symbol
symbol  : class ComparatorDescription
location: class org.apache.directory.server.schema.registries.DefaultComparatorRegistry

/home/continuum/continuum-1.1/apps/continuum/webapp/WEB-INF/working-directory/10/schema-registries/src/main/java/org/apache/directory/server/schema/registries/DefaultAttributeTypeRegistry.java:[271,8]
cannot find symbol
symbol  : class OidNormalizer
location: class org.apache.directory.server.schema.registries.DefaultAttributeTypeRegistry

/home/continuum/continuum-1.1/apps/continuum/webapp/WEB-INF/working-directory/10/schema-registries/src/main/java/org/apache/directory/server/schema/registries/DefaultAttributeTypeRegistry.java:[276,32]
cannot find symbol
symbol  : class OidNormalizer
location: class org.apache.directory.server.schema.registries.DefaultAttributeTypeRegistry

/home/continuum/continuum-1.1/apps/continuum/webapp/WEB-INF/working-directory/10/schema-registries/src/main/java/org/apache/directory/server/schema/registries/DefaultAttributeTypeRegistry.java:[276,66]
cannot find symbol
symbol  : class NoOpNormalizer
location: class org.apache.directory.server.schema.registries.DefaultAttributeTypeRegistry

/home/continuum/continuum-1.1/apps/continuum/webapp/WEB-INF/working-directory/10/schema-registries/src/main/java/org/apache/directory/server/schema/registries/DefaultAttributeTypeRegistry.java:[280,32]
cannot find symbol
symbol  : class OidNormalizer
location: class org.apache.directory.server.schema.registries.DefaultAttributeTypeRegistry

/home/continuum/continuum-1.1/apps/continuum/webapp/WEB-INF/working-directory/10/schema-registries/src/main/java/org/apache/directory/server/schema/registries/DefaultAttributeTypeRegistry.java:[297,41]
cannot find symbol
symbol  : class OidNormalizer
location: class org.apache.directory.server.schema.registries.DefaultAttributeTypeRegistry

/home/continuum/continuum-1.1/apps/continuum/webapp/WEB-INF/working-directory/10/schema-registries/src/main/java/org/apache/directory/server/schema/ConcreteNameComponentNormalizer.java:[208,19]
cannot find symbol
symbol  : variable NoOpNormalizer
location: class org.apache.directory.server.schema.ConcreteNameComponentNormalizer

/home/continuum/continuum-1.1/apps/continuum/webapp/WEB-INF/working-directory/10/schema-registries/src/main/java/org/apache/directory/server/schema/registries/DefaultSyntaxCheckerRegistry.java:[63,41]
cannot find symbol
symbol  : class SyntaxChecker
location: class org.apache.directory.server.schema.registries.DefaultSyntaxCheckerRegistry

/home/continuum/continuum-1.1/apps/continuum/webapp/WEB-INF/working-directory/10/schema-registries/src/main/java/org/apache/directory/server/schema/registries/DefaultSyntaxCheckerRegistry.java:[64,52]
cannot find symbol
symbol  : class SyntaxCheckerDescription
location: class org.apache.directory.server.schema.registries.DefaultSyntaxCheckerRegistry

/home/continuum/continuum-1.1/apps/continuum/webapp/WEB-INF/working-directory/10/schema-registries/src/main/java/org/apache/directory/server/schema/registries/DefaultSyntaxCheckerRegistry.java:[97,8]
cannot find symbol
symbol  : class SyntaxChecker
location: class org.apache.directory.server.schema.registries.DefaultSyntaxCheckerRegistry

/home/continuum/continuum-1.1/apps/continuum/webapp/WEB-INF/working-directory/10/schema-registries/src/main/java/org/apache/directory/server/schema/registries/DefaultSyntaxCheckerRegistry.java:[164,12]
cannot find symbol
symbol  : class SyntaxCheckerDescription
location: class org.apache.directory.server.schema.registries.DefaultSyntaxCheckerRegistry

/home/continuum/continuum-1.1/apps/continuum/webapp/WEB-INF/working-directory/10/schema-registries/src/main/java/org/apache/directory/server/schema/registries/DefaultSyntaxCheckerRegistry.java:[180,12]
cannot find symbol
symbol  : class SyntaxCheckerDescription
location: class org.apache.directory.server.schema.registries.DefaultSyntaxCheckerRegistry

/home/continuum/continuum-1.1/apps/continuum/webapp/WEB-INF/working-directory/10/schema-registries/src/main/java/org/apache/directory/server/schema/registries/DefaultNormalizerRegistry.java:[70,52]
cannot find symbol
symbol  : class NormalizerDescription
location: class org.apache.directory.server.schema.registries.DefaultNormalizerRegistry

/home/continuum/continuum-1.1/apps/continuum/webapp/WEB-INF/working-directory/10/schema-registries/src/main/java/org/apache/directory/server/schema/registries/DefaultNormalizerRegistry.java:[173,12]
cannot find symbol
symbol  : class NormalizerDescription
location: class org.apache.directory.server.schema.registries.DefaultNormalizerRegistry

/home/continuum/continuum-1.1/apps/continuum/webapp/WEB-INF/working-directory/10/schema-registries/src/main/java/org/apache/directory/server/schema/registries/DefaultNormalizerRegistry.java:[189,12]
cannot find symbol
symbol  : class NormalizerDescription
location: class org.apache.directory.server.schema.registries.DefaultNormalizerRegistry


[INFO] ------------------------------------------------------------------------
[INFO] For more information, run Maven with the -e switch
[INFO] ------------------------------------------------------------------------
[INFO] Total time: 58 seconds
[INFO] Finished at: Tue Jan 20 22:32:41 EST 2009
[INFO] Final Memory: 35M/508M
[INFO] ------------------------------------------------------------------------

****************************************************************************



Mime
View raw message