directory-notifications mailing list archives

Site index · List index
Message view « Date » · « Thread »
Top « Date » · « Thread »
From Continuum VMBuild Server <contin...@vm094.oxylos.org>
Subject [continuum] BUILD SUCCESSFUL: Default Project Group - Apache Directory Daemon - Build Def: Build and deploy the site for daemon
Date Mon, 08 Dec 2008 01:01:30 GMT
Online report : http://vm094.oxylos.org/continuum/buildResult.action?buildId=2856&projectId=9

Build statistics:
  State: Ok
  Previous State: Error
  Started at: Sun 7 Dec 2008 20:00:03 -0500
  Finished at: Sun 7 Dec 2008 20:01:29 -0500
  Total time: 1m 26s
  Build Trigger: Schedule
  Build Number: 149
  Exit code: 0
  Building machine hostname: vm094.oxylos.org
  Operating system : Linux(unknown)
  Java Home version : 
          java version "1.6.0_06"
          Java(TM) SE Runtime Environment (build 1.6.0_06-b02)
          Java HotSpot(TM) Client VM (build 10.0-b22, mixed mode, sharing)
        
  Builder version :
          Maven version: 2.0.9
          Java version: 1.6.0_06
          OS name: "linux" version: "2.6.18-53.1.14.el5" arch: "i386" Family: "unix"
    
****************************************************************************
SCM Changes:
****************************************************************************
No files changed

****************************************************************************
Dependencies Changes:
****************************************************************************
No dependencies changed


****************************************************************************
Build Defintion:
****************************************************************************
POM filename: pom.xml
Goals: clean site-deploy   
Arguments: --batch-mode
Build Fresh: false
Always Build: false
Default Build Definition: false
Schedule: DAILY_AFTERNOON
Description: Build and deploy the site for daemon

****************************************************************************
Test Summary:
****************************************************************************
Tests: 0
Failures: 0
Total time: 0.0


****************************************************************************
Output:
****************************************************************************
[INFO] Scanning for projects...
[INFO] Reactor build order: 
[INFO]   Apache Directory Daemon
[INFO]   Apache Directory Daemon Bootstrappers
[INFO]   Apache Directory Daemon Plugin (Maven 2)
[INFO] ------------------------------------------------------------------------
[INFO] Building Apache Directory Daemon
[INFO]    task-segment: [clean, site-deploy]
[INFO] ------------------------------------------------------------------------
[INFO] [clean:clean]
[INFO] Deleting directory /home/continuum/continuum-1.1/apps/continuum/webapp/WEB-INF/working-directory/9/target
[INFO] Setting property: classpath.resource.loader.class => 'org.codehaus.plexus.velocity.ContextClassLoaderResourceLoader'.
[INFO] Setting property: velocimacro.messages.on => 'false'.
[INFO] Setting property: resource.loader => 'classpath'.
[INFO] Setting property: resource.manager.logwhenfound => 'false'.
[INFO] ************************************************************** 
[INFO] Starting Jakarta Velocity v1.4
[INFO] RuntimeInstance initializing.
[INFO] Default Properties File: org/apache/velocity/runtime/defaults/velocity.properties
[INFO] Default ResourceManager initializing. (class org.apache.velocity.runtime.resource.ResourceManagerImpl)
[INFO] Resource Loader Instantiated: org.codehaus.plexus.velocity.ContextClassLoaderResourceLoader
[INFO] ClasspathResourceLoader : initialization starting.
[INFO] ClasspathResourceLoader : initialization complete.
[INFO] ResourceCache : initialized. (class org.apache.velocity.runtime.resource.ResourceCacheImpl)
[INFO] Default ResourceManager initialization complete.
[INFO] Loaded System Directive: org.apache.velocity.runtime.directive.Literal
[INFO] Loaded System Directive: org.apache.velocity.runtime.directive.Macro
[INFO] Loaded System Directive: org.apache.velocity.runtime.directive.Parse
[INFO] Loaded System Directive: org.apache.velocity.runtime.directive.Include
[INFO] Loaded System Directive: org.apache.velocity.runtime.directive.Foreach
[INFO] Created: 20 parsers.
[INFO] Velocimacro : initialization starting.
[INFO] Velocimacro : adding VMs from VM library template : VM_global_library.vm
[ERROR] ResourceManager : unable to find resource 'VM_global_library.vm' in any resource loader.
[INFO] Velocimacro : error using  VM library template VM_global_library.vm : org.apache.velocity.exception.ResourceNotFoundException: Unable to find resource 'VM_global_library.vm'
[INFO] Velocimacro :  VM library template macro registration complete.
[INFO] Velocimacro : allowInline = true : VMs can be defined inline in templates
[INFO] Velocimacro : allowInlineToOverride = false : VMs defined inline may NOT replace previous VM definitions
[INFO] Velocimacro : allowInlineLocal = false : VMs defined inline will be  global in scope if allowed.
[INFO] Velocimacro : initialization complete.
[INFO] Velocity successfully started.
[INFO] Setting property: classpath.resource.loader.class => 'org.codehaus.plexus.velocity.ContextClassLoaderResourceLoader'.
[INFO] Setting property: velocimacro.messages.on => 'false'.
[INFO] Setting property: resource.loader => 'classpath'.
[INFO] Setting property: resource.manager.logwhenfound => 'false'.
[INFO] ************************************************************** 
[INFO] Starting Jakarta Velocity v1.4
[INFO] RuntimeInstance initializing.
[INFO] Default Properties File: org/apache/velocity/runtime/defaults/velocity.properties
[INFO] Default ResourceManager initializing. (class org.apache.velocity.runtime.resource.ResourceManagerImpl)
[INFO] Resource Loader Instantiated: org.codehaus.plexus.velocity.ContextClassLoaderResourceLoader
[INFO] ClasspathResourceLoader : initialization starting.
[INFO] ClasspathResourceLoader : initialization complete.
[INFO] ResourceCache : initialized. (class org.apache.velocity.runtime.resource.ResourceCacheImpl)
[INFO] Default ResourceManager initialization complete.
[INFO] Loaded System Directive: org.apache.velocity.runtime.directive.Literal
[INFO] Loaded System Directive: org.apache.velocity.runtime.directive.Macro
[INFO] Loaded System Directive: org.apache.velocity.runtime.directive.Parse
[INFO] Loaded System Directive: org.apache.velocity.runtime.directive.Include
[INFO] Loaded System Directive: org.apache.velocity.runtime.directive.Foreach
[INFO] Created: 20 parsers.
[INFO] Velocimacro : initialization starting.
[INFO] Velocimacro : adding VMs from VM library template : VM_global_library.vm
[ERROR] ResourceManager : unable to find resource 'VM_global_library.vm' in any resource loader.
[INFO] Velocimacro : error using  VM library template VM_global_library.vm : org.apache.velocity.exception.ResourceNotFoundException: Unable to find resource 'VM_global_library.vm'
[INFO] Velocimacro :  VM library template macro registration complete.
[INFO] Velocimacro : allowInline = true : VMs can be defined inline in templates
[INFO] Velocimacro : allowInlineToOverride = false : VMs defined inline may NOT replace previous VM definitions
[INFO] Velocimacro : allowInlineLocal = false : VMs defined inline will be  global in scope if allowed.
[INFO] Velocimacro : initialization complete.
[INFO] Velocity successfully started.
[INFO] artifact org.apache.maven.plugins:maven-jxr-plugin: checking for updates from apache.directory.plugins
[INFO] Setting property: classpath.resource.loader.class => 'org.codehaus.plexus.velocity.ContextClassLoaderResourceLoader'.
[INFO] Setting property: velocimacro.messages.on => 'false'.
[INFO] Setting property: resource.loader => 'classpath'.
[INFO] Setting property: resource.manager.logwhenfound => 'false'.
[INFO] ************************************************************** 
[INFO] Starting Jakarta Velocity v1.4
[INFO] RuntimeInstance initializing.
[INFO] Default Properties File: org/apache/velocity/runtime/defaults/velocity.properties
[INFO] Default ResourceManager initializing. (class org.apache.velocity.runtime.resource.ResourceManagerImpl)
[INFO] Resource Loader Instantiated: org.codehaus.plexus.velocity.ContextClassLoaderResourceLoader
[INFO] ClasspathResourceLoader : initialization starting.
[INFO] ClasspathResourceLoader : initialization complete.
[INFO] ResourceCache : initialized. (class org.apache.velocity.runtime.resource.ResourceCacheImpl)
[INFO] Default ResourceManager initialization complete.
[INFO] Loaded System Directive: org.apache.velocity.runtime.directive.Literal
[INFO] Loaded System Directive: org.apache.velocity.runtime.directive.Macro
[INFO] Loaded System Directive: org.apache.velocity.runtime.directive.Parse
[INFO] Loaded System Directive: org.apache.velocity.runtime.directive.Include
[INFO] Loaded System Directive: org.apache.velocity.runtime.directive.Foreach
[INFO] Created: 20 parsers.
[INFO] Velocimacro : initialization starting.
[INFO] Velocimacro : adding VMs from VM library template : VM_global_library.vm
[ERROR] ResourceManager : unable to find resource 'VM_global_library.vm' in any resource loader.
[INFO] Velocimacro : error using  VM library template VM_global_library.vm : org.apache.velocity.exception.ResourceNotFoundException: Unable to find resource 'VM_global_library.vm'
[INFO] Velocimacro :  VM library template macro registration complete.
[INFO] Velocimacro : allowInline = true : VMs can be defined inline in templates
[INFO] Velocimacro : allowInlineToOverride = false : VMs defined inline may NOT replace previous VM definitions
[INFO] Velocimacro : allowInlineLocal = false : VMs defined inline will be  global in scope if allowed.
[INFO] Velocimacro : initialization complete.
[INFO] Velocity successfully started.
[INFO] artifact org.apache.maven.plugins:maven-pmd-plugin: checking for updates from apache.directory.plugins
[INFO] artifact org.apache.maven.plugins:maven-project-info-reports-plugin: checking for updates from apache.directory.plugins
[INFO] artifact org.apache.maven.plugins:maven-surefire-report-plugin: checking for updates from apache.directory.plugins
[INFO] artifact org.codehaus.mojo:cobertura-maven-plugin: checking for updates from apache.directory.plugins
[INFO] Setting property: classpath.resource.loader.class => 'org.codehaus.plexus.velocity.ContextClassLoaderResourceLoader'.
[INFO] Setting property: velocimacro.messages.on => 'false'.
[INFO] Setting property: resource.loader => 'classpath'.
[INFO] Setting property: resource.manager.logwhenfound => 'false'.
[INFO] ************************************************************** 
[INFO] Starting Jakarta Velocity v1.4
[INFO] RuntimeInstance initializing.
[INFO] Default Properties File: org/apache/velocity/runtime/defaults/velocity.properties
[INFO] Default ResourceManager initializing. (class org.apache.velocity.runtime.resource.ResourceManagerImpl)
[INFO] Resource Loader Instantiated: org.codehaus.plexus.velocity.ContextClassLoaderResourceLoader
[INFO] ClasspathResourceLoader : initialization starting.
[INFO] ClasspathResourceLoader : initialization complete.
[INFO] ResourceCache : initialized. (class org.apache.velocity.runtime.resource.ResourceCacheImpl)
[INFO] Default ResourceManager initialization complete.
[INFO] Loaded System Directive: org.apache.velocity.runtime.directive.Literal
[INFO] Loaded System Directive: org.apache.velocity.runtime.directive.Macro
[INFO] Loaded System Directive: org.apache.velocity.runtime.directive.Parse
[INFO] Loaded System Directive: org.apache.velocity.runtime.directive.Include
[INFO] Loaded System Directive: org.apache.velocity.runtime.directive.Foreach
[INFO] Created: 20 parsers.
[INFO] Velocimacro : initialization starting.
[INFO] Velocimacro : adding VMs from VM library template : VM_global_library.vm
[ERROR] ResourceManager : unable to find resource 'VM_global_library.vm' in any resource loader.
[INFO] Velocimacro : error using  VM library template VM_global_library.vm : org.apache.velocity.exception.ResourceNotFoundException: Unable to find resource 'VM_global_library.vm'
[INFO] Velocimacro :  VM library template macro registration complete.
[INFO] Velocimacro : allowInline = true : VMs can be defined inline in templates
[INFO] Velocimacro : allowInlineToOverride = false : VMs defined inline may NOT replace previous VM definitions
[INFO] Velocimacro : allowInlineLocal = false : VMs defined inline will be  global in scope if allowed.
[INFO] Velocimacro : initialization complete.
[INFO] Velocity successfully started.
[INFO] artifact org.codehaus.mojo:rat-maven-plugin: checking for updates from apache.directory.plugins
[INFO] Setting property: classpath.resource.loader.class => 'org.codehaus.plexus.velocity.ContextClassLoaderResourceLoader'.
[INFO] Setting property: velocimacro.messages.on => 'false'.
[INFO] Setting property: resource.loader => 'classpath'.
[INFO] Setting property: resource.manager.logwhenfound => 'false'.
[INFO] artifact org.codehaus.mojo:taglist-maven-plugin: checking for updates from apache.directory.plugins
[INFO] Preparing surefire-report:report
[INFO] Setting property: classpath.resource.loader.class => 'org.codehaus.plexus.velocity.ContextClassLoaderResourceLoader'.
[INFO] Setting property: velocimacro.messages.on => 'false'.
[INFO] Setting property: resource.loader => 'classpath'.
[INFO] Setting property: resource.manager.logwhenfound => 'false'.
[INFO] [remote-resources:process {execution: default}]
[INFO] Preparing surefire-report:report-only
[INFO] No goals needed for project - skipping
[INFO] Preparing cobertura:cobertura
[INFO] [remote-resources:process {execution: default}]
[INFO] [cobertura:instrument]
[INFO] Not executing cobertura:instrument as the project is not a Java classpath-capable package
[INFO] Preparing findbugs:findbugs
[INFO] [remote-resources:process {execution: default}]
[INFO] [site:site]
[INFO] Not executing cobertura:report as the cobertura data file (/home/continuum/continuum-1.1/apps/continuum/webapp/WEB-INF/working-directory/9/target/cobertura/cobertura.ser) could not be found
[INFO] Unable to load parent project from a relative path: Could not find the model file '/home/continuum/continuum-1.1/apps/continuum/webapp/WEB-INF/working-directory/pom.xml'. for project unknown
[INFO] Parent project loaded from repository.
[INFO] Parent project loaded from repository.
[INFO] artifact org.apache.maven.skins:maven-default-skin: checking for updates from central
[INFO] Skipped "Surefire Report" report, file "surefire-report.html" already exists for the English version.
[INFO] Generating "Project Team" report.
[INFO] Generating "Issue Tracking" report.
[INFO] Generating "Surefire Report" report.
[INFO] Generating "PMD Report" report.
[INFO] Generating "Dependencies" report.
[INFO] Generating "Mailing Lists" report.
[INFO] Generating "Source Repository" report.
[INFO] Generating "About" report.
[INFO] Generating "JavaDocs" report.
[WARNING] POM for 'izpack:standalone-compiler:pom:3.8.0:compile' is invalid. It will be ignored for artifact resolution. Reason: Failed to validate POM for project izpack:standalone-compiler at Artifact [izpack:standalone-compiler:pom:3.8.0:compile]
[INFO] snapshot org.apache.directory.daemon:daemon-bootstrappers:1.1.6-SNAPSHOT: checking for updates from apache.directory.snapshot.repo
[INFO] snapshot org.apache.directory.daemon:daemon-bootstrappers:1.1.6-SNAPSHOT: checking for updates from apache.snapshots
Loading source files for package org.apache.directory.daemon...
Loading source files for package org.apache.directory.daemon.installers...
Loading source files for package org.apache.directory.daemon.installers.solarispkg...
Loading source files for package org.apache.directory.daemon.installers.nsis...
Loading source files for package org.apache.directory.daemon.installers.archive...
Loading source files for package org.apache.directory.daemon.installers.inno...
Loading source files for package org.apache.directory.daemon.installers.macosxpkg...
Loading source files for package org.apache.directory.daemon.installers.izpack...
Loading source files for package org.apache.directory.daemon.installers.bin...
Loading source files for package org.apache.directory.daemon.installers.rpm...
Loading source files for package org.apache.directory.daemon.installers.deb...
Constructing Javadoc information...
Standard Doclet version 1.6.0_06
Building tree for all the packages and classes...
Generating /home/continuum/continuum-1.1/apps/continuum/webapp/WEB-INF/working-directory/9/target/site/apidocs/org/apache/directory/daemon//AvailablePortFinder.html...
Generating /home/continuum/continuum-1.1/apps/continuum/webapp/WEB-INF/working-directory/9/target/site/apidocs/org/apache/directory/daemon//Bootstrapper.html...
Generating /home/continuum/continuum-1.1/apps/continuum/webapp/WEB-INF/working-directory/9/target/site/apidocs/org/apache/directory/daemon//DaemonApplication.html...
Generating /home/continuum/continuum-1.1/apps/continuum/webapp/WEB-INF/working-directory/9/target/site/apidocs/org/apache/directory/daemon//ExitCodes.html...
Generating /home/continuum/continuum-1.1/apps/continuum/webapp/WEB-INF/working-directory/9/target/site/apidocs/org/apache/directory/daemon//InstallationLayout.html...
Generating /home/continuum/continuum-1.1/apps/continuum/webapp/WEB-INF/working-directory/9/target/site/apidocs/org/apache/directory/daemon//JsvcBootstrapper.html...
Generating /home/continuum/continuum-1.1/apps/continuum/webapp/WEB-INF/working-directory/9/target/site/apidocs/org/apache/directory/daemon//MainBootstrapper.html...
Generating /home/continuum/continuum-1.1/apps/continuum/webapp/WEB-INF/working-directory/9/target/site/apidocs/org/apache/directory/daemon//ProcrunBootstrapper.html...
Generating /home/continuum/continuum-1.1/apps/continuum/webapp/WEB-INF/working-directory/9/target/site/apidocs/org/apache/directory/daemon//TanukiBootstrapper.html...
Generating /home/continuum/continuum-1.1/apps/continuum/webapp/WEB-INF/working-directory/9/target/site/apidocs/org/apache/directory/daemon/installers//Application.html...
Generating /home/continuum/continuum-1.1/apps/continuum/webapp/WEB-INF/working-directory/9/target/site/apidocs/org/apache/directory/daemon/installers//CreateImageCommand.html...
Generating /home/continuum/continuum-1.1/apps/continuum/webapp/WEB-INF/working-directory/9/target/site/apidocs/org/apache/directory/daemon/installers//MojoCommand.html...
Generating /home/continuum/continuum-1.1/apps/continuum/webapp/WEB-INF/working-directory/9/target/site/apidocs/org/apache/directory/daemon/installers//MojoHelperUtils.html...
Generating /home/continuum/continuum-1.1/apps/continuum/webapp/WEB-INF/working-directory/9/target/site/apidocs/org/apache/directory/daemon/installers//PackagedFile.html...
Generating /home/continuum/continuum-1.1/apps/continuum/webapp/WEB-INF/working-directory/9/target/site/apidocs/org/apache/directory/daemon/installers//ReflectionProperties.html...
Generating /home/continuum/continuum-1.1/apps/continuum/webapp/WEB-INF/working-directory/9/target/site/apidocs/org/apache/directory/daemon/installers//ServiceInstallersMojo.html...
Generating /home/continuum/continuum-1.1/apps/continuum/webapp/WEB-INF/working-directory/9/target/site/apidocs/org/apache/directory/daemon/installers//Target.html...
Generating /home/continuum/continuum-1.1/apps/continuum/webapp/WEB-INF/working-directory/9/target/site/apidocs/org/apache/directory/daemon/installers/solarispkg//SolarisPkgInstallerCommand.html...
Generating /home/continuum/continuum-1.1/apps/continuum/webapp/WEB-INF/working-directory/9/target/site/apidocs/org/apache/directory/daemon/installers/solarispkg//SolarisPkgTarget.html...
Generating /home/continuum/continuum-1.1/apps/continuum/webapp/WEB-INF/working-directory/9/target/site/apidocs/org/apache/directory/daemon/installers/nsis//NsisInstallerCommand.html...
Generating /home/continuum/continuum-1.1/apps/continuum/webapp/WEB-INF/working-directory/9/target/site/apidocs/org/apache/directory/daemon/installers/nsis//NsisTarget.html...
Generating /home/continuum/continuum-1.1/apps/continuum/webapp/WEB-INF/working-directory/9/target/site/apidocs/org/apache/directory/daemon/installers/archive//ArchiveInstallerCommand.html...
Generating /home/continuum/continuum-1.1/apps/continuum/webapp/WEB-INF/working-directory/9/target/site/apidocs/org/apache/directory/daemon/installers/archive//ArchiveTarget.html...
Generating /home/continuum/continuum-1.1/apps/continuum/webapp/WEB-INF/working-directory/9/target/site/apidocs/org/apache/directory/daemon/installers/inno//InnoInstallerCommand.html...
Generating /home/continuum/continuum-1.1/apps/continuum/webapp/WEB-INF/working-directory/9/target/site/apidocs/org/apache/directory/daemon/installers/inno//InnoTarget.html...
Generating /home/continuum/continuum-1.1/apps/continuum/webapp/WEB-INF/working-directory/9/target/site/apidocs/org/apache/directory/daemon/installers/macosxpkg//MacOsXPkgInstallerCommand.html...
Generating /home/continuum/continuum-1.1/apps/continuum/webapp/WEB-INF/working-directory/9/target/site/apidocs/org/apache/directory/daemon/installers/macosxpkg//MacOsXPkgTarget.html...
Generating /home/continuum/continuum-1.1/apps/continuum/webapp/WEB-INF/working-directory/9/target/site/apidocs/org/apache/directory/daemon/installers/izpack//IzPackInstallerCommand.html...
Generating /home/continuum/continuum-1.1/apps/continuum/webapp/WEB-INF/working-directory/9/target/site/apidocs/org/apache/directory/daemon/installers/izpack//IzPackTarget.html...
Generating /home/continuum/continuum-1.1/apps/continuum/webapp/WEB-INF/working-directory/9/target/site/apidocs/org/apache/directory/daemon/installers/bin//BinInstallerCommand.html...
Generating /home/continuum/continuum-1.1/apps/continuum/webapp/WEB-INF/working-directory/9/target/site/apidocs/org/apache/directory/daemon/installers/bin//BinTarget.html...
Generating /home/continuum/continuum-1.1/apps/continuum/webapp/WEB-INF/working-directory/9/target/site/apidocs/org/apache/directory/daemon/installers/rpm//RpmInstallerCommand.html...
Generating /home/continuum/continuum-1.1/apps/continuum/webapp/WEB-INF/working-directory/9/target/site/apidocs/org/apache/directory/daemon/installers/rpm//RpmTarget.html...
Generating /home/continuum/continuum-1.1/apps/continuum/webapp/WEB-INF/working-directory/9/target/site/apidocs/org/apache/directory/daemon/installers/deb//DebInstallerCommand.html...
Generating /home/continuum/continuum-1.1/apps/continuum/webapp/WEB-INF/working-directory/9/target/site/apidocs/org/apache/directory/daemon/installers/deb//DebTarget.html...
Generating /home/continuum/continuum-1.1/apps/continuum/webapp/WEB-INF/working-directory/9/target/site/apidocs/overview-frame.html...
Generating /home/continuum/continuum-1.1/apps/continuum/webapp/WEB-INF/working-directory/9/target/site/apidocs/org/apache/directory/daemon//package-frame.html...
Generating /home/continuum/continuum-1.1/apps/continuum/webapp/WEB-INF/working-directory/9/target/site/apidocs/org/apache/directory/daemon//package-summary.html...
Generating /home/continuum/continuum-1.1/apps/continuum/webapp/WEB-INF/working-directory/9/target/site/apidocs/org/apache/directory/daemon//package-tree.html...
Generating /home/continuum/continuum-1.1/apps/continuum/webapp/WEB-INF/working-directory/9/target/site/apidocs/org/apache/directory/daemon/installers//package-frame.html...
Generating /home/continuum/continuum-1.1/apps/continuum/webapp/WEB-INF/working-directory/9/target/site/apidocs/org/apache/directory/daemon/installers//package-summary.html...
Generating /home/continuum/continuum-1.1/apps/continuum/webapp/WEB-INF/working-directory/9/target/site/apidocs/org/apache/directory/daemon/installers//package-tree.html...
Generating /home/continuum/continuum-1.1/apps/continuum/webapp/WEB-INF/working-directory/9/target/site/apidocs/org/apache/directory/daemon/installers/archive//package-frame.html...
Generating /home/continuum/continuum-1.1/apps/continuum/webapp/WEB-INF/working-directory/9/target/site/apidocs/org/apache/directory/daemon/installers/archive//package-summary.html...
Generating /home/continuum/continuum-1.1/apps/continuum/webapp/WEB-INF/working-directory/9/target/site/apidocs/org/apache/directory/daemon/installers/archive//package-tree.html...
Generating /home/continuum/continuum-1.1/apps/continuum/webapp/WEB-INF/working-directory/9/target/site/apidocs/org/apache/directory/daemon/installers/bin//package-frame.html...
Generating /home/continuum/continuum-1.1/apps/continuum/webapp/WEB-INF/working-directory/9/target/site/apidocs/org/apache/directory/daemon/installers/bin//package-summary.html...
Generating /home/continuum/continuum-1.1/apps/continuum/webapp/WEB-INF/working-directory/9/target/site/apidocs/org/apache/directory/daemon/installers/bin//package-tree.html...
Generating /home/continuum/continuum-1.1/apps/continuum/webapp/WEB-INF/working-directory/9/target/site/apidocs/org/apache/directory/daemon/installers/deb//package-frame.html...
Generating /home/continuum/continuum-1.1/apps/continuum/webapp/WEB-INF/working-directory/9/target/site/apidocs/org/apache/directory/daemon/installers/deb//package-summary.html...
Generating /home/continuum/continuum-1.1/apps/continuum/webapp/WEB-INF/working-directory/9/target/site/apidocs/org/apache/directory/daemon/installers/deb//package-tree.html...
Generating /home/continuum/continuum-1.1/apps/continuum/webapp/WEB-INF/working-directory/9/target/site/apidocs/org/apache/directory/daemon/installers/inno//package-frame.html...
Generating /home/continuum/continuum-1.1/apps/continuum/webapp/WEB-INF/working-directory/9/target/site/apidocs/org/apache/directory/daemon/installers/inno//package-summary.html...
Generating /home/continuum/continuum-1.1/apps/continuum/webapp/WEB-INF/working-directory/9/target/site/apidocs/org/apache/directory/daemon/installers/inno//package-tree.html...
Generating /home/continuum/continuum-1.1/apps/continuum/webapp/WEB-INF/working-directory/9/target/site/apidocs/org/apache/directory/daemon/installers/izpack//package-frame.html...
Generating /home/continuum/continuum-1.1/apps/continuum/webapp/WEB-INF/working-directory/9/target/site/apidocs/org/apache/directory/daemon/installers/izpack//package-summary.html...
Generating /home/continuum/continuum-1.1/apps/continuum/webapp/WEB-INF/working-directory/9/target/site/apidocs/org/apache/directory/daemon/installers/izpack//package-tree.html...
Generating /home/continuum/continuum-1.1/apps/continuum/webapp/WEB-INF/working-directory/9/target/site/apidocs/org/apache/directory/daemon/installers/macosxpkg//package-frame.html...
Generating /home/continuum/continuum-1.1/apps/continuum/webapp/WEB-INF/working-directory/9/target/site/apidocs/org/apache/directory/daemon/installers/macosxpkg//package-summary.html...
Generating /home/continuum/continuum-1.1/apps/continuum/webapp/WEB-INF/working-directory/9/target/site/apidocs/org/apache/directory/daemon/installers/macosxpkg//package-tree.html...
Generating /home/continuum/continuum-1.1/apps/continuum/webapp/WEB-INF/working-directory/9/target/site/apidocs/org/apache/directory/daemon/installers/nsis//package-frame.html...
Generating /home/continuum/continuum-1.1/apps/continuum/webapp/WEB-INF/working-directory/9/target/site/apidocs/org/apache/directory/daemon/installers/nsis//package-summary.html...
Generating /home/continuum/continuum-1.1/apps/continuum/webapp/WEB-INF/working-directory/9/target/site/apidocs/org/apache/directory/daemon/installers/nsis//package-tree.html...
Generating /home/continuum/continuum-1.1/apps/continuum/webapp/WEB-INF/working-directory/9/target/site/apidocs/org/apache/directory/daemon/installers/rpm//package-frame.html...
Generating /home/continuum/continuum-1.1/apps/continuum/webapp/WEB-INF/working-directory/9/target/site/apidocs/org/apache/directory/daemon/installers/rpm//package-summary.html...
Generating /home/continuum/continuum-1.1/apps/continuum/webapp/WEB-INF/working-directory/9/target/site/apidocs/org/apache/directory/daemon/installers/rpm//package-tree.html...
Generating /home/continuum/continuum-1.1/apps/continuum/webapp/WEB-INF/working-directory/9/target/site/apidocs/org/apache/directory/daemon/installers/solarispkg//package-frame.html...
Generating /home/continuum/continuum-1.1/apps/continuum/webapp/WEB-INF/working-directory/9/target/site/apidocs/org/apache/directory/daemon/installers/solarispkg//package-summary.html...
Generating /home/continuum/continuum-1.1/apps/continuum/webapp/WEB-INF/working-directory/9/target/site/apidocs/org/apache/directory/daemon/installers/solarispkg//package-tree.html...
Generating /home/continuum/continuum-1.1/apps/continuum/webapp/WEB-INF/working-directory/9/target/site/apidocs/constant-values.html...
Generating /home/continuum/continuum-1.1/apps/continuum/webapp/WEB-INF/working-directory/9/target/site/apidocs/serialized-form.html...
Generating /home/continuum/continuum-1.1/apps/continuum/webapp/WEB-INF/working-directory/9/target/site/apidocs/org/apache/directory/daemon//class-use/MainBootstrapper.html...
Generating /home/continuum/continuum-1.1/apps/continuum/webapp/WEB-INF/working-directory/9/target/site/apidocs/org/apache/directory/daemon//class-use/DaemonApplication.html...
Generating /home/continuum/continuum-1.1/apps/continuum/webapp/WEB-INF/working-directory/9/target/site/apidocs/org/apache/directory/daemon//class-use/JsvcBootstrapper.html...
Generating /home/continuum/continuum-1.1/apps/continuum/webapp/WEB-INF/working-directory/9/target/site/apidocs/org/apache/directory/daemon//class-use/InstallationLayout.html...
Generating /home/continuum/continuum-1.1/apps/continuum/webapp/WEB-INF/working-directory/9/target/site/apidocs/org/apache/directory/daemon//class-use/TanukiBootstrapper.html...
Generating /home/continuum/continuum-1.1/apps/continuum/webapp/WEB-INF/working-directory/9/target/site/apidocs/org/apache/directory/daemon//class-use/Bootstrapper.html...
Generating /home/continuum/continuum-1.1/apps/continuum/webapp/WEB-INF/working-directory/9/target/site/apidocs/org/apache/directory/daemon//class-use/AvailablePortFinder.html...
Generating /home/continuum/continuum-1.1/apps/continuum/webapp/WEB-INF/working-directory/9/target/site/apidocs/org/apache/directory/daemon//class-use/ExitCodes.html...
Generating /home/continuum/continuum-1.1/apps/continuum/webapp/WEB-INF/working-directory/9/target/site/apidocs/org/apache/directory/daemon//class-use/ProcrunBootstrapper.html...
Generating /home/continuum/continuum-1.1/apps/continuum/webapp/WEB-INF/working-directory/9/target/site/apidocs/org/apache/directory/daemon/installers//class-use/CreateImageCommand.html...
Generating /home/continuum/continuum-1.1/apps/continuum/webapp/WEB-INF/working-directory/9/target/site/apidocs/org/apache/directory/daemon/installers//class-use/Target.html...
Generating /home/continuum/continuum-1.1/apps/continuum/webapp/WEB-INF/working-directory/9/target/site/apidocs/org/apache/directory/daemon/installers//class-use/MojoCommand.html...
Generating /home/continuum/continuum-1.1/apps/continuum/webapp/WEB-INF/working-directory/9/target/site/apidocs/org/apache/directory/daemon/installers//class-use/ServiceInstallersMojo.html...
Generating /home/continuum/continuum-1.1/apps/continuum/webapp/WEB-INF/working-directory/9/target/site/apidocs/org/apache/directory/daemon/installers//class-use/ReflectionProperties.html...
Generating /home/continuum/continuum-1.1/apps/continuum/webapp/WEB-INF/working-directory/9/target/site/apidocs/org/apache/directory/daemon/installers//class-use/MojoHelperUtils.html...
Generating /home/continuum/continuum-1.1/apps/continuum/webapp/WEB-INF/working-directory/9/target/site/apidocs/org/apache/directory/daemon/installers//class-use/PackagedFile.html...
Generating /home/continuum/continuum-1.1/apps/continuum/webapp/WEB-INF/working-directory/9/target/site/apidocs/org/apache/directory/daemon/installers//class-use/Application.html...
Generating /home/continuum/continuum-1.1/apps/continuum/webapp/WEB-INF/working-directory/9/target/site/apidocs/org/apache/directory/daemon/installers/solarispkg//class-use/SolarisPkgInstallerCommand.html...
Generating /home/continuum/continuum-1.1/apps/continuum/webapp/WEB-INF/working-directory/9/target/site/apidocs/org/apache/directory/daemon/installers/solarispkg//class-use/SolarisPkgTarget.html...
Generating /home/continuum/continuum-1.1/apps/continuum/webapp/WEB-INF/working-directory/9/target/site/apidocs/org/apache/directory/daemon/installers/nsis//class-use/NsisTarget.html...
Generating /home/continuum/continuum-1.1/apps/continuum/webapp/WEB-INF/working-directory/9/target/site/apidocs/org/apache/directory/daemon/installers/nsis//class-use/NsisInstallerCommand.html...
Generating /home/continuum/continuum-1.1/apps/continuum/webapp/WEB-INF/working-directory/9/target/site/apidocs/org/apache/directory/daemon/installers/archive//class-use/ArchiveTarget.html...
Generating /home/continuum/continuum-1.1/apps/continuum/webapp/WEB-INF/working-directory/9/target/site/apidocs/org/apache/directory/daemon/installers/archive//class-use/ArchiveInstallerCommand.html...
Generating /home/continuum/continuum-1.1/apps/continuum/webapp/WEB-INF/working-directory/9/target/site/apidocs/org/apache/directory/daemon/installers/inno//class-use/InnoTarget.html...
Generating /home/continuum/continuum-1.1/apps/continuum/webapp/WEB-INF/working-directory/9/target/site/apidocs/org/apache/directory/daemon/installers/inno//class-use/InnoInstallerCommand.html...
Generating /home/continuum/continuum-1.1/apps/continuum/webapp/WEB-INF/working-directory/9/target/site/apidocs/org/apache/directory/daemon/installers/macosxpkg//class-use/MacOsXPkgInstallerCommand.html...
Generating /home/continuum/continuum-1.1/apps/continuum/webapp/WEB-INF/working-directory/9/target/site/apidocs/org/apache/directory/daemon/installers/macosxpkg//class-use/MacOsXPkgTarget.html...
Generating /home/continuum/continuum-1.1/apps/continuum/webapp/WEB-INF/working-directory/9/target/site/apidocs/org/apache/directory/daemon/installers/izpack//class-use/IzPackInstallerCommand.html...
Generating /home/continuum/continuum-1.1/apps/continuum/webapp/WEB-INF/working-directory/9/target/site/apidocs/org/apache/directory/daemon/installers/izpack//class-use/IzPackTarget.html...
Generating /home/continuum/continuum-1.1/apps/continuum/webapp/WEB-INF/working-directory/9/target/site/apidocs/org/apache/directory/daemon/installers/bin//class-use/BinInstallerCommand.html...
Generating /home/continuum/continuum-1.1/apps/continuum/webapp/WEB-INF/working-directory/9/target/site/apidocs/org/apache/directory/daemon/installers/bin//class-use/BinTarget.html...
Generating /home/continuum/continuum-1.1/apps/continuum/webapp/WEB-INF/working-directory/9/target/site/apidocs/org/apache/directory/daemon/installers/rpm//class-use/RpmInstallerCommand.html...
Generating /home/continuum/continuum-1.1/apps/continuum/webapp/WEB-INF/working-directory/9/target/site/apidocs/org/apache/directory/daemon/installers/rpm//class-use/RpmTarget.html...
Generating /home/continuum/continuum-1.1/apps/continuum/webapp/WEB-INF/working-directory/9/target/site/apidocs/org/apache/directory/daemon/installers/deb//class-use/DebTarget.html...
Generating /home/continuum/continuum-1.1/apps/continuum/webapp/WEB-INF/working-directory/9/target/site/apidocs/org/apache/directory/daemon/installers/deb//class-use/DebInstallerCommand.html...
Generating /home/continuum/continuum-1.1/apps/continuum/webapp/WEB-INF/working-directory/9/target/site/apidocs/org/apache/directory/daemon//package-use.html...
Generating /home/continuum/continuum-1.1/apps/continuum/webapp/WEB-INF/working-directory/9/target/site/apidocs/org/apache/directory/daemon/installers//package-use.html...
Generating /home/continuum/continuum-1.1/apps/continuum/webapp/WEB-INF/working-directory/9/target/site/apidocs/org/apache/directory/daemon/installers/archive//package-use.html...
Generating /home/continuum/continuum-1.1/apps/continuum/webapp/WEB-INF/working-directory/9/target/site/apidocs/org/apache/directory/daemon/installers/bin//package-use.html...
Generating /home/continuum/continuum-1.1/apps/continuum/webapp/WEB-INF/working-directory/9/target/site/apidocs/org/apache/directory/daemon/installers/deb//package-use.html...
Generating /home/continuum/continuum-1.1/apps/continuum/webapp/WEB-INF/working-directory/9/target/site/apidocs/org/apache/directory/daemon/installers/inno//package-use.html...
Generating /home/continuum/continuum-1.1/apps/continuum/webapp/WEB-INF/working-directory/9/target/site/apidocs/org/apache/directory/daemon/installers/izpack//package-use.html...
Generating /home/continuum/continuum-1.1/apps/continuum/webapp/WEB-INF/working-directory/9/target/site/apidocs/org/apache/directory/daemon/installers/macosxpkg//package-use.html...
Generating /home/continuum/continuum-1.1/apps/continuum/webapp/WEB-INF/working-directory/9/target/site/apidocs/org/apache/directory/daemon/installers/nsis//package-use.html...
Generating /home/continuum/continuum-1.1/apps/continuum/webapp/WEB-INF/working-directory/9/target/site/apidocs/org/apache/directory/daemon/installers/rpm//package-use.html...
Generating /home/continuum/continuum-1.1/apps/continuum/webapp/WEB-INF/working-directory/9/target/site/apidocs/org/apache/directory/daemon/installers/solarispkg//package-use.html...
Building index for all the packages and classes...
Generating /home/continuum/continuum-1.1/apps/continuum/webapp/WEB-INF/working-directory/9/target/site/apidocs/overview-tree.html...
Generating /home/continuum/continuum-1.1/apps/continuum/webapp/WEB-INF/working-directory/9/target/site/apidocs/index-all.html...
Generating /home/continuum/continuum-1.1/apps/continuum/webapp/WEB-INF/working-directory/9/target/site/apidocs/deprecated-list.html...
Building index for all classes...
Generating /home/continuum/continuum-1.1/apps/continuum/webapp/WEB-INF/working-directory/9/target/site/apidocs/allclasses-frame.html...
Generating /home/continuum/continuum-1.1/apps/continuum/webapp/WEB-INF/working-directory/9/target/site/apidocs/allclasses-noframe.html...
Generating /home/continuum/continuum-1.1/apps/continuum/webapp/WEB-INF/working-directory/9/target/site/apidocs/index.html...
Generating /home/continuum/continuum-1.1/apps/continuum/webapp/WEB-INF/working-directory/9/target/site/apidocs/overview-summary.html...
Generating /home/continuum/continuum-1.1/apps/continuum/webapp/WEB-INF/working-directory/9/target/site/apidocs/help-doc.html...
Generating /home/continuum/continuum-1.1/apps/continuum/webapp/WEB-INF/working-directory/9/target/site/apidocs/stylesheet.css...
5 warnings
[WARNING] Javadoc Warnings
[WARNING] /home/continuum/continuum-1.1/apps/continuum/webapp/WEB-INF/working-directory/9/bootstrappers/src/main/java/org/apache/directory/daemon/ProcrunBootstrapper.java:35: warning - @todo is an unknown tag.
[WARNING] /home/continuum/continuum-1.1/apps/continuum/webapp/WEB-INF/working-directory/9/plugin/src/main/java/org/apache/directory/daemon/installers/ServiceInstallersMojo.java:71: warning - @goal is an unknown tag.
[WARNING] /home/continuum/continuum-1.1/apps/continuum/webapp/WEB-INF/working-directory/9/plugin/src/main/java/org/apache/directory/daemon/installers/ServiceInstallersMojo.java:71: warning - @description is an unknown tag.
[WARNING] /home/continuum/continuum-1.1/apps/continuum/webapp/WEB-INF/working-directory/9/plugin/src/main/java/org/apache/directory/daemon/installers/ServiceInstallersMojo.java:71: warning - @phase is an unknown tag.
[WARNING] /home/continuum/continuum-1.1/apps/continuum/webapp/WEB-INF/working-directory/9/plugin/src/main/java/org/apache/directory/daemon/installers/ServiceInstallersMojo.java:71: warning - @requiresDependencyResolution is an unknown tag.
[INFO] Generating "Project License" report.
[INFO] Generating "Source Xref" report.
[INFO] Generating "CPD Report" report.
[INFO] Generating "RAT Report" report.
[INFO] [site:deploy]
scpexe://vm094.oxylos.org/var/www/html/projects/daemon/ - Session: Opened  
Using private key: /home/continuum/.ssh/id_dsa
Executing command: /bin/sh -c ssh -i /home/continuum/.ssh/id_dsa -o 'BatchMode yes' continuum@vm094.oxylos.org 'mkdir -p /var/www/html/projects/daemon/.'


Using private key: /home/continuum/.ssh/id_dsa
Executing command: /bin/sh -c ssh -i /home/continuum/.ssh/id_dsa -o 'BatchMode yes' continuum@vm094.oxylos.org 'mkdir -p /var/www/html/projects/daemon//.
'


Uploading: ./wagon37174.zip to scpexe://vm094.oxylos.org/var/www/html/projects/daemon/

Using private key: /home/continuum/.ssh/id_dsa
Executing command: /bin/sh -c cd /tmp && scp -i /home/continuum/.ssh/id_dsa -o 'BatchMode yes' wagon37174.zip continuum@vm094.oxylos.org:/var/www/html/projects/daemon//./wagon37174.zip
#######################################################################################################################################Using private key: /home/continuum/.ssh/id_dsa
Executing command: /bin/sh -c ssh -i /home/continuum/.ssh/id_dsa -o 'BatchMode yes' continuum@vm094.oxylos.org 'chmod -f 644 /var/www/html/projects/daemon//./wagon37174.zip
'



Transfer finished. 550578 bytes copied in 0.636 seconds
Using private key: /home/continuum/.ssh/id_dsa
Executing command: /bin/sh -c ssh -i /home/continuum/.ssh/id_dsa -o 'BatchMode yes' continuum@vm094.oxylos.org 'cd /var/www/html/projects/daemon/.; unzip -o wagon37174.zip; rm -f wagon37174.zip'
Archive:  wagon37174.zip
  inflating: css/maven-base.css      
  inflating: css/print.css           
  inflating: css/site.css            
  inflating: css/maven-theme.css     
  inflating: index.html              
  inflating: pmd.xml                 
  inflating: surefire-report.html    
  inflating: project-reports.html    
  inflating: apidocs/options         
  inflating: apidocs/package-list    
  inflating: apidocs/overview-tree.html  
  inflating: apidocs/index.html      
  inflating: apidocs/constant-values.html  
  inflating: apidocs/allclasses-frame.html  
  inflating: apidocs/org/apache/directory/daemon/package-use.html  
  inflating: apidocs/org/apache/directory/daemon/installers/package-use.html  
  inflating: apidocs/org/apache/directory/daemon/installers/solarispkg/SolarisPkgInstallerCommand.html  
  inflating: apidocs/org/apache/directory/daemon/installers/solarispkg/package-use.html  
  inflating: apidocs/org/apache/directory/daemon/installers/solarispkg/package-frame.html  
  inflating: apidocs/org/apache/directory/daemon/installers/solarispkg/package-summary.html  
  inflating: apidocs/org/apache/directory/daemon/installers/solarispkg/class-use/SolarisPkgInstallerCommand.html  
  inflating: apidocs/org/apache/directory/daemon/installers/solarispkg/class-use/SolarisPkgTarget.html  
  inflating: apidocs/org/apache/directory/daemon/installers/solarispkg/SolarisPkgTarget.html  
  inflating: apidocs/org/apache/directory/daemon/installers/solarispkg/package-tree.html  
  inflating: apidocs/org/apache/directory/daemon/installers/nsis/NsisInstallerCommand.html  
  inflating: apidocs/org/apache/directory/daemon/installers/nsis/package-use.html  
  inflating: apidocs/org/apache/directory/daemon/installers/nsis/package-frame.html  
  inflating: apidocs/org/apache/directory/daemon/installers/nsis/package-summary.html  
  inflating: apidocs/org/apache/directory/daemon/installers/nsis/NsisTarget.html  
  inflating: apidocs/org/apache/directory/daemon/installers/nsis/class-use/NsisInstallerCommand.html  
  inflating: apidocs/org/apache/directory/daemon/installers/nsis/class-use/NsisTarget.html  
  inflating: apidocs/org/apache/directory/daemon/installers/nsis/package-tree.html  
  inflating: apidocs/org/apache/directory/daemon/installers/archive/ArchiveTarget.html  
  inflating: apidocs/org/apache/directory/daemon/installers/archive/package-use.html  
  inflating: apidocs/org/apache/directory/daemon/installers/archive/package-frame.html  
  inflating: apidocs/org/apache/directory/daemon/installers/archive/package-summary.html  
  inflating: apidocs/org/apache/directory/daemon/installers/archive/class-use/ArchiveTarget.html  
  inflating: apidocs/org/apache/directory/daemon/installers/archive/class-use/ArchiveInstallerCommand.html  
  inflating: apidocs/org/apache/directory/daemon/installers/archive/package-tree.html  
  inflating: apidocs/org/apache/directory/daemon/installers/archive/ArchiveInstallerCommand.html  
  inflating: apidocs/org/apache/directory/daemon/installers/ReflectionProperties.html  
  inflating: apidocs/org/apache/directory/daemon/installers/package-frame.html  
  inflating: apidocs/org/apache/directory/daemon/installers/ServiceInstallersMojo.html  
  inflating: apidocs/org/apache/directory/daemon/installers/CreateImageCommand.html  
  inflating: apidocs/org/apache/directory/daemon/installers/package-summary.html  
  inflating: apidocs/org/apache/directory/daemon/installers/inno/package-use.html  
  inflating: apidocs/org/apache/directory/daemon/installers/inno/package-frame.html  
  inflating: apidocs/org/apache/directory/daemon/installers/inno/package-summary.html  
  inflating: apidocs/org/apache/directory/daemon/installers/inno/class-use/InnoInstallerCommand.html  
  inflating: apidocs/org/apache/directory/daemon/installers/inno/class-use/InnoTarget.html  
  inflating: apidocs/org/apache/directory/daemon/installers/inno/InnoInstallerCommand.html  
  inflating: apidocs/org/apache/directory/daemon/installers/inno/InnoTarget.html  
  inflating: apidocs/org/apache/directory/daemon/installers/inno/package-tree.html  
  inflating: apidocs/org/apache/directory/daemon/installers/Application.html  
  inflating: apidocs/org/apache/directory/daemon/installers/class-use/ReflectionProperties.html  
  inflating: apidocs/org/apache/directory/daemon/installers/class-use/ServiceInstallersMojo.html  
  inflating: apidocs/org/apache/directory/daemon/installers/class-use/CreateImageCommand.html  
  inflating: apidocs/org/apache/directory/daemon/installers/class-use/Application.html  
  inflating: apidocs/org/apache/directory/daemon/installers/class-use/MojoHelperUtils.html  
  inflating: apidocs/org/apache/directory/daemon/installers/class-use/PackagedFile.html  
  inflating: apidocs/org/apache/directory/daemon/installers/class-use/MojoCommand.html  
  inflating: apidocs/org/apache/directory/daemon/installers/class-use/Target.html  
  inflating: apidocs/org/apache/directory/daemon/installers/macosxpkg/package-use.html  
  inflating: apidocs/org/apache/directory/daemon/installers/macosxpkg/MacOsXPkgInstallerCommand.html  
  inflating: apidocs/org/apache/directory/daemon/installers/macosxpkg/package-frame.html  
  inflating: apidocs/org/apache/directory/daemon/installers/macosxpkg/package-summary.html  
  inflating: apidocs/org/apache/directory/daemon/installers/macosxpkg/class-use/MacOsXPkgInstallerCommand.html  
  inflating: apidocs/org/apache/directory/daemon/installers/macosxpkg/class-use/MacOsXPkgTarget.html  
  inflating: apidocs/org/apache/directory/daemon/installers/macosxpkg/package-tree.html  
  inflating: apidocs/org/apache/directory/daemon/installers/macosxpkg/MacOsXPkgTarget.html  
  inflating: apidocs/org/apache/directory/daemon/installers/izpack/package-use.html  
  inflating: apidocs/org/apache/directory/daemon/installers/izpack/IzPackInstallerCommand.html  
  inflating: apidocs/org/apache/directory/daemon/installers/izpack/package-frame.html  
  inflating: apidocs/org/apache/directory/daemon/installers/izpack/package-summary.html  
  inflating: apidocs/org/apache/directory/daemon/installers/izpack/class-use/IzPackInstallerCommand.html  
  inflating: apidocs/org/apache/directory/daemon/installers/izpack/class-use/IzPackTarget.html  
  inflating: apidocs/org/apache/directory/daemon/installers/izpack/IzPackTarget.html  
  inflating: apidocs/org/apache/directory/daemon/installers/izpack/package-tree.html  
  inflating: apidocs/org/apache/directory/daemon/installers/MojoHelperUtils.html  
  inflating: apidocs/org/apache/directory/daemon/installers/package-tree.html  
  inflating: apidocs/org/apache/directory/daemon/installers/bin/package-use.html  
  inflating: apidocs/org/apache/directory/daemon/installers/bin/package-frame.html  
  inflating: apidocs/org/apache/directory/daemon/installers/bin/package-summary.html  
  inflating: apidocs/org/apache/directory/daemon/installers/bin/class-use/BinTarget.html  
  inflating: apidocs/org/apache/directory/daemon/installers/bin/class-use/BinInstallerCommand.html  
  inflating: apidocs/org/apache/directory/daemon/installers/bin/package-tree.html  
  inflating: apidocs/org/apache/directory/daemon/installers/bin/BinTarget.html  
  inflating: apidocs/org/apache/directory/daemon/installers/bin/BinInstallerCommand.html  
  inflating: apidocs/org/apache/directory/daemon/installers/rpm/package-use.html  
  inflating: apidocs/org/apache/directory/daemon/installers/rpm/package-frame.html  
  inflating: apidocs/org/apache/directory/daemon/installers/rpm/package-summary.html  
  inflating: apidocs/org/apache/directory/daemon/installers/rpm/RpmTarget.html  
  inflating: apidocs/org/apache/directory/daemon/installers/rpm/class-use/RpmTarget.html  
  inflating: apidocs/org/apache/directory/daemon/installers/rpm/class-use/RpmInstallerCommand.html  
  inflating: apidocs/org/apache/directory/daemon/installers/rpm/RpmInstallerCommand.html  
  inflating: apidocs/org/apache/directory/daemon/installers/rpm/package-tree.html  
  inflating: apidocs/org/apache/directory/daemon/installers/PackagedFile.html  
  inflating: apidocs/org/apache/directory/daemon/installers/MojoCommand.html  
  inflating: apidocs/org/apache/directory/daemon/installers/Target.html  
  inflating: apidocs/org/apache/directory/daemon/installers/deb/package-use.html  
  inflating: apidocs/org/apache/directory/daemon/installers/deb/package-frame.html  
  inflating: apidocs/org/apache/directory/daemon/installers/deb/package-summary.html  
  inflating: apidocs/org/apache/directory/daemon/installers/deb/DebInstallerCommand.html  
  inflating: apidocs/org/apache/directory/daemon/installers/deb/DebTarget.html  
  inflating: apidocs/org/apache/directory/daemon/installers/deb/class-use/DebInstallerCommand.html  
  inflating: apidocs/org/apache/directory/daemon/installers/deb/class-use/DebTarget.html  
  inflating: apidocs/org/apache/directory/daemon/installers/deb/package-tree.html  
  inflating: apidocs/org/apache/directory/daemon/TanukiBootstrapper.html  
  inflating: apidocs/org/apache/directory/daemon/package-frame.html  
  inflating: apidocs/org/apache/directory/daemon/ProcrunBootstrapper.html  
  inflating: apidocs/org/apache/directory/daemon/package-summary.html  
  inflating: apidocs/org/apache/directory/daemon/class-use/TanukiBootstrapper.html  
  inflating: apidocs/org/apache/directory/daemon/class-use/ProcrunBootstrapper.html  
  inflating: apidocs/org/apache/directory/daemon/class-use/AvailablePortFinder.html  
  inflating: apidocs/org/apache/directory/daemon/class-use/JsvcBootstrapper.html  
  inflating: apidocs/org/apache/directory/daemon/class-use/DaemonApplication.html  
  inflating: apidocs/org/apache/directory/daemon/class-use/Bootstrapper.html  
  inflating: apidocs/org/apache/directory/daemon/class-use/ExitCodes.html  
  inflating: apidocs/org/apache/directory/daemon/class-use/InstallationLayout.html  
  inflating: apidocs/org/apache/directory/daemon/class-use/MainBootstrapper.html  
  inflating: apidocs/org/apache/directory/daemon/AvailablePortFinder.html  
  inflating: apidocs/org/apache/directory/daemon/JsvcBootstrapper.html  
  inflating: apidocs/org/apache/directory/daemon/DaemonApplication.html  
  inflating: apidocs/org/apache/directory/daemon/package-tree.html  
  inflating: apidocs/org/apache/directory/daemon/Bootstrapper.html  
  inflating: apidocs/org/apache/directory/daemon/ExitCodes.html  
  inflating: apidocs/org/apache/directory/daemon/InstallationLayout.html  
  inflating: apidocs/org/apache/directory/daemon/MainBootstrapper.html  
  inflating: apidocs/index-all.html  
  inflating: apidocs/allclasses-noframe.html  
  inflating: apidocs/overview-summary.html  
  inflating: apidocs/overview-frame.html  
  inflating: apidocs/stylesheet.css  
  inflating: apidocs/deprecated-list.html  
  inflating: apidocs/packages        
  inflating: apidocs/resources/inherit.gif  
  inflating: apidocs/help-doc.html   
  inflating: apidocs/serialized-form.html  
  inflating: mail-lists.html         
  inflating: cpd.html                
  inflating: rat-report.html         
  inflating: team-list.html          
  inflating: xref/index.html         
  inflating: xref/allclasses-frame.html  
  inflating: xref/org/apache/directory/daemon/installers/solarispkg/SolarisPkgInstallerCommand.html  
  inflating: xref/org/apache/directory/daemon/installers/solarispkg/package-frame.html  
  inflating: xref/org/apache/directory/daemon/installers/solarispkg/package-summary.html  
  inflating: xref/org/apache/directory/daemon/installers/solarispkg/SolarisPkgTarget.html  
  inflating: xref/org/apache/directory/daemon/installers/nsis/NsisInstallerCommand.html  
  inflating: xref/org/apache/directory/daemon/installers/nsis/package-frame.html  
  inflating: xref/org/apache/directory/daemon/installers/nsis/package-summary.html  
  inflating: xref/org/apache/directory/daemon/installers/nsis/NsisTarget.html  
  inflating: xref/org/apache/directory/daemon/installers/archive/ArchiveTarget.html  
  inflating: xref/org/apache/directory/daemon/installers/archive/package-frame.html  
  inflating: xref/org/apache/directory/daemon/installers/archive/package-summary.html  
  inflating: xref/org/apache/directory/daemon/installers/archive/ArchiveInstallerCommand.html  
  inflating: xref/org/apache/directory/daemon/installers/ReflectionProperties.html  
  inflating: xref/org/apache/directory/daemon/installers/package-frame.html  
  inflating: xref/org/apache/directory/daemon/installers/ServiceInstallersMojo.html  
  inflating: xref/org/apache/directory/daemon/installers/CreateImageCommand.html  
  inflating: xref/org/apache/directory/daemon/installers/package-summary.html  
  inflating: xref/org/apache/directory/daemon/installers/inno/package-frame.html  
  inflating: xref/org/apache/directory/daemon/installers/inno/package-summary.html  
  inflating: xref/org/apache/directory/daemon/installers/inno/InnoInstallerCommand.html  
  inflating: xref/org/apache/directory/daemon/installers/inno/InnoTarget.html  
  inflating: xref/org/apache/directory/daemon/installers/Application.html  
  inflating: xref/org/apache/directory/daemon/installers/macosxpkg/MacOsXPkgInstallerCommand.html  
  inflating: xref/org/apache/directory/daemon/installers/macosxpkg/package-frame.html  
  inflating: xref/org/apache/directory/daemon/installers/macosxpkg/package-summary.html  
  inflating: xref/org/apache/directory/daemon/installers/macosxpkg/MacOsXPkgTarget.html  
  inflating: xref/org/apache/directory/daemon/installers/izpack/IzPackInstallerCommand.html  
  inflating: xref/org/apache/directory/daemon/installers/izpack/package-frame.html  
  inflating: xref/org/apache/directory/daemon/installers/izpack/package-summary.html  
  inflating: xref/org/apache/directory/daemon/installers/izpack/IzPackTarget.html  
  inflating: xref/org/apache/directory/daemon/installers/MojoHelperUtils.html  
  inflating: xref/org/apache/directory/daemon/installers/bin/package-frame.html  
  inflating: xref/org/apache/directory/daemon/installers/bin/package-summary.html  
  inflating: xref/org/apache/directory/daemon/installers/bin/BinTarget.html  
  inflating: xref/org/apache/directory/daemon/installers/bin/BinInstallerCommand.html  
  inflating: xref/org/apache/directory/daemon/installers/rpm/package-frame.html  
  inflating: xref/org/apache/directory/daemon/installers/rpm/package-summary.html  
  inflating: xref/org/apache/directory/daemon/installers/rpm/RpmTarget.html  
  inflating: xref/org/apache/directory/daemon/installers/rpm/RpmInstallerCommand.html  
  inflating: xref/org/apache/directory/daemon/installers/PackagedFile.html  
  inflating: xref/org/apache/directory/daemon/installers/MojoCommand.html  
  inflating: xref/org/apache/directory/daemon/installers/Target.html  
  inflating: xref/org/apache/directory/daemon/installers/deb/package-frame.html  
  inflating: xref/org/apache/directory/daemon/installers/deb/package-summary.html  
  inflating: xref/org/apache/directory/daemon/installers/deb/DebInstallerCommand.html  
  inflating: xref/org/apache/directory/daemon/installers/deb/DebTarget.html  
  inflating: xref/org/apache/directory/daemon/TanukiBootstrapper.html  
  inflating: xref/org/apache/directory/daemon/package-frame.html  
  inflating: xref/org/apache/directory/daemon/ProcrunBootstrapper.html  
  inflating: xref/org/apache/directory/daemon/package-summary.html  
  inflating: xref/org/apache/directory/daemon/AvailablePortFinder.html  
  inflating: xref/org/apache/directory/daemon/JsvcBootstrapper.html  
  inflating: xref/org/apache/directory/daemon/DaemonApplication.html  
  inflating: xref/org/apache/directory/daemon/Bootstrapper.html  
  inflating: xref/org/apache/directory/daemon/ExitCodes.html  
  inflating: xref/org/apache/directory/daemon/InstallationLayout.html  
  inflating: xref/org/apache/directory/daemon/MainBootstrapper.html  
  inflating: xref/overview-summary.html  
  inflating: xref/overview-frame.html  
  inflating: xref/stylesheet.css     
  inflating: issue-tracking.html     
  inflating: license.html            
  inflating: cpd.xml                 
  inflating: dependencies.html       
  inflating: source-repository.html  
  inflating: pmd.html                
  inflating: project-info.html       
  inflating: images/icon_info_sml.gif  
  inflating: images/server-icon_128x128.png  
  inflating: images/icon_error_sml.gif  
  inflating: images/icon_warning_sml.gif  
  inflating: images/expanded.gif     
  inflating: images/collapsed.gif    
  inflating: images/logos/build-by-maven-white.png  
  inflating: images/logos/build-by-maven-black.png  
  inflating: images/logos/maven-feather.png  
  inflating: images/icon_success_sml.gif  
  inflating: images/close.gif        
  inflating: images/external.png     
  inflating: images/newwindow.png    


Using private key: /home/continuum/.ssh/id_dsa
Executing command: /bin/sh -c ssh -i /home/continuum/.ssh/id_dsa -o 'BatchMode yes' continuum@vm094.oxylos.org 'chmod -Rf g+w,a+rX /var/www/html/projects/daemon/'


scpexe://vm094.oxylos.org/var/www/html/projects/daemon/ - Session: Disconnecting  
scpexe://vm094.oxylos.org/var/www/html/projects/daemon/ - Session: Disconnected
[INFO] ------------------------------------------------------------------------
[INFO] Building Apache Directory Daemon Bootstrappers
[INFO]    task-segment: [clean, site-deploy]
[INFO] ------------------------------------------------------------------------
[INFO] [clean:clean]
[INFO] Deleting directory /home/continuum/continuum-1.1/apps/continuum/webapp/WEB-INF/working-directory/9/bootstrappers/target
[INFO] Preparing surefire-report:report
[INFO] [remote-resources:process {execution: default}]
[INFO] [resources:resources]
[INFO] Using default encoding to copy filtered resources.
[INFO] [compiler:compile]
[INFO] Compiling 9 source files to /home/continuum/continuum-1.1/apps/continuum/webapp/WEB-INF/working-directory/9/bootstrappers/target/classes
[INFO] [resources:testResources]
[INFO] Using default encoding to copy filtered resources.
[INFO] [compiler:testCompile]
[INFO] No sources to compile
[INFO] [surefire:test]
[INFO] Surefire report directory: /home/continuum/continuum-1.1/apps/continuum/webapp/WEB-INF/working-directory/9/bootstrappers/target/surefire-reports

-------------------------------------------------------
 T E S T S
-------------------------------------------------------
There are no tests to run.

Results :

Tests run: 0, Failures: 0, Errors: 0, Skipped: 0

[INFO] Preparing surefire-report:report-only
[INFO] No goals needed for project - skipping
[INFO] Preparing cobertura:cobertura
[INFO] [remote-resources:process {execution: default}]
[INFO] [resources:resources]
[INFO] Using default encoding to copy filtered resources.
[INFO] [compiler:compile]
[INFO] Nothing to compile - all classes are up to date
[INFO] [cobertura:instrument]
[INFO] Cobertura 1.9 - GNU GPL License (NO WARRANTY) - See COPYRIGHT file
Instrumenting 13 files to /home/continuum/continuum-1.1/apps/continuum/webapp/WEB-INF/working-directory/9/bootstrappers/target/generated-classes/cobertura
Cobertura: Saved information on 13 classes.
Instrument time: 274ms

[INFO] Instrumentation was successful.
[INFO] [resources:testResources]
[INFO] Using default encoding to copy filtered resources.
[INFO] [compiler:testCompile]
[INFO] No sources to compile
[INFO] [surefire:test]
[INFO] Surefire report directory: /home/continuum/continuum-1.1/apps/continuum/webapp/WEB-INF/working-directory/9/bootstrappers/target/surefire-reports

-------------------------------------------------------
 T E S T S
-------------------------------------------------------
There are no tests to run.

Results :

Tests run: 0, Failures: 0, Errors: 0, Skipped: 0

[INFO] Preparing findbugs:findbugs
[INFO] [remote-resources:process {execution: default}]
[INFO] [resources:resources]
[INFO] Using default encoding to copy filtered resources.
[INFO] [compiler:compile]
[INFO] Nothing to compile - all classes are up to date
[INFO] [site:site]
[INFO] Unable to load parent project from a relative path: Could not find the model file '/home/continuum/continuum-1.1/apps/continuum/webapp/WEB-INF/working-directory/pom.xml'. for project unknown
[INFO] Parent project loaded from repository.
[INFO] Parent project loaded from repository.
[INFO] Skipped "Surefire Report" report, file "surefire-report.html" already exists for the English version.
[INFO] Generating "Project Team" report.
[INFO] Generating "Issue Tracking" report.
[INFO] Generating "Surefire Report" report.
[INFO] Generating "Checkstyle" report.
[WARNING] File encoding has not been set, using platform encoding UTF-8, i.e. build is platform dependent!
[INFO] There are 1226 checkstyle errors.
[INFO] Generating "Dependencies" report.
[INFO] Generating "Mailing Lists" report.
[INFO] Generating "Source Repository" report.
[INFO] Generating "Tag List" report.
[INFO] Generating "About" report.
[INFO] Generating "FindBugs Report" report.
[INFO]   No effort provided, using default effort.
[INFO]   Using FindBugs Version: 1.2.0
[INFO]   No threshold provided, using default threshold.
[INFO]   Debugging is Off
[INFO]   No bug include filter.
[INFO] Generating "Cobertura Test Coverage" report.
[INFO] Cobertura 1.9 - GNU GPL License (NO WARRANTY) - See COPYRIGHT file
Cobertura: Loaded information on 13 classes.
Report time: 448ms

[INFO] Cobertura Report generation was successful.
[INFO] Generating "Project License" report.
[INFO] Generating "RAT Report" report.
[INFO] [site:deploy]
scpexe://vm094.oxylos.org/var/www/html/projects/daemon/daemon-bootstrappers - Session: Opened  
Using private key: /home/continuum/.ssh/id_dsa
Executing command: /bin/sh -c ssh -i /home/continuum/.ssh/id_dsa -o 'BatchMode yes' continuum@vm094.oxylos.org 'mkdir -p /var/www/html/projects/daemon/daemon-bootstrappers/.'


Using private key: /home/continuum/.ssh/id_dsa
Executing command: /bin/sh -c ssh -i /home/continuum/.ssh/id_dsa -o 'BatchMode yes' continuum@vm094.oxylos.org 'mkdir -p /var/www/html/projects/daemon/daemon-bootstrappers/.
'


Uploading: ./wagon37184.zip to scpexe://vm094.oxylos.org/var/www/html/projects/daemon/daemon-bootstrappers

Using private key: /home/continuum/.ssh/id_dsa
Executing command: /bin/sh -c cd /tmp && scp -i /home/continuum/.ssh/id_dsa -o 'BatchMode yes' wagon37184.zip continuum@vm094.oxylos.org:/var/www/html/projects/daemon/daemon-bootstrappers/./wagon37184.zip
###########################Using private key: /home/continuum/.ssh/id_dsa
Executing command: /bin/sh -c ssh -i /home/continuum/.ssh/id_dsa -o 'BatchMode yes' continuum@vm094.oxylos.org 'chmod -f 644 /var/www/html/projects/daemon/daemon-bootstrappers/./wagon37184.zip
'



Transfer finished. 108529 bytes copied in 0.86 seconds
Using private key: /home/continuum/.ssh/id_dsa
Executing command: /bin/sh -c ssh -i /home/continuum/.ssh/id_dsa -o 'BatchMode yes' continuum@vm094.oxylos.org 'cd /var/www/html/projects/daemon/daemon-bootstrappers/.; unzip -o wagon37184.zip; rm -f wagon37184.zip'
Archive:  wagon37184.zip
  inflating: css/maven-base.css      
  inflating: css/print.css           
  inflating: css/site.css            
  inflating: css/maven-theme.css     
  inflating: index.html              
  inflating: surefire-report.html    
  inflating: project-reports.html    
  inflating: checkstyle.html         
  inflating: mail-lists.html         
  inflating: rat-report.html         
  inflating: cobertura/org.apache.directory.daemon.TanukiBootstrapper.html  
  inflating: cobertura/org.apache.directory.daemon.JsvcBootstrapper.html  
  inflating: cobertura/css/tooltip.css  
  inflating: cobertura/css/sortabletable.css  
  inflating: cobertura/css/source-viewer.css  
  inflating: cobertura/css/help.css  
  inflating: cobertura/css/main.css  
  inflating: cobertura/index.html    
  inflating: cobertura/frame-sourcefiles-org.apache.directory.daemon.html  
  inflating: cobertura/help.html     
  inflating: cobertura/org.apache.directory.daemon.DaemonApplication.html  
  inflating: cobertura/frame-summary-org.apache.directory.daemon.html  
  inflating: cobertura/frame-sourcefiles.html  
  inflating: cobertura/org.apache.directory.daemon.ProcrunBootstrapper.html  
  inflating: cobertura/org.apache.directory.daemon.InstallationLayout.html  
  inflating: cobertura/org.apache.directory.daemon.ExitCodes.html  
  inflating: cobertura/org.apache.directory.daemon.AvailablePortFinder.html  
  inflating: cobertura/js/popup.js   
  inflating: cobertura/js/customsorttypes.js  
  inflating: cobertura/js/sortabletable.js  
  inflating: cobertura/js/stringbuilder.js  
  inflating: cobertura/org.apache.directory.daemon.Bootstrapper.html  
  inflating: cobertura/frame-packages.html  
  inflating: cobertura/images/blank.png  
  inflating: cobertura/images/upsimple.png  
  inflating: cobertura/images/downsimple.png  
  inflating: cobertura/frame-summary.html  
  inflating: cobertura/org.apache.directory.daemon.MainBootstrapper.html  
  inflating: team-list.html          
  inflating: checkstyle.rss          
  inflating: issue-tracking.html     
  inflating: license.html            
  inflating: findbugs.html           
  inflating: dependencies.html       
  inflating: source-repository.html  
  inflating: taglist.html            
  inflating: project-info.html       
  inflating: images/icon_info_sml.gif  
  inflating: images/icon_error_sml.gif  
  inflating: images/icon_warning_sml.gif  
  inflating: images/expanded.gif     
  inflating: images/collapsed.gif    
  inflating: images/logos/build-by-maven-white.png  
  inflating: images/logos/build-by-maven-black.png  
  inflating: images/logos/maven-feather.png  
  inflating: images/icon_success_sml.gif  
  inflating: images/close.gif        
  inflating: images/external.png     
  inflating: images/rss.png          
  inflating: images/newwindow.png    


Using private key: /home/continuum/.ssh/id_dsa
Executing command: /bin/sh -c ssh -i /home/continuum/.ssh/id_dsa -o 'BatchMode yes' continuum@vm094.oxylos.org 'chmod -Rf g+w,a+rX /var/www/html/projects/daemon/daemon-bootstrappers'


scpexe://vm094.oxylos.org/var/www/html/projects/daemon/daemon-bootstrappers - Session: Disconnecting  
scpexe://vm094.oxylos.org/var/www/html/projects/daemon/daemon-bootstrappers - Session: Disconnected
[INFO] ------------------------------------------------------------------------
[INFO] Building Apache Directory Daemon Plugin (Maven 2)
[INFO]    task-segment: [clean, site-deploy]
[INFO] ------------------------------------------------------------------------
[INFO] [clean:clean]
[INFO] Deleting directory /home/continuum/continuum-1.1/apps/continuum/webapp/WEB-INF/working-directory/9/plugin/target
[INFO] Preparing plugin:report
[WARNING] POM for 'izpack:standalone-compiler:pom:3.8.0:compile' is invalid. It will be ignored for artifact resolution. Reason: Failed to validate POM for project izpack:standalone-compiler at Artifact [izpack:standalone-compiler:pom:3.8.0:compile]
[INFO] [plugin:descriptor]
[INFO] Using 2 extractors.
[INFO] Applying extractor for language: java
[INFO] Extractor for language: java found 1 mojo descriptors.
[INFO] Applying extractor for language: bsh
[INFO] Extractor for language: bsh found 0 mojo descriptors.
[WARNING] POM for 'izpack:standalone-compiler:pom:3.8.0:compile' is invalid. It will be ignored for artifact resolution. Reason: Failed to validate POM for project izpack:standalone-compiler at Artifact [izpack:standalone-compiler:pom:3.8.0:compile]
[INFO] [remote-resources:process {execution: default}]
[WARNING] Attempting to build MavenProject instance for Artifact (izpack:standalone-compiler:3.8.0) of type: jar; constructing POM artifact instead.
[WARNING] Invalid project model for artifact [standalone-compiler:izpack:3.8.0]. It will be ignored by the remote resources Mojo.
[INFO] [resources:resources]
[INFO] Using default encoding to copy filtered resources.
[WARNING] POM for 'izpack:standalone-compiler:pom:3.8.0:compile' is invalid. It will be ignored for artifact resolution. Reason: Failed to validate POM for project izpack:standalone-compiler at Artifact [izpack:standalone-compiler:pom:3.8.0:compile]
[INFO] [compiler:compile]
[INFO] Compiling 26 source files to /home/continuum/continuum-1.1/apps/continuum/webapp/WEB-INF/working-directory/9/plugin/target/classes
[INFO] Preparing surefire-report:report
[WARNING] POM for 'izpack:standalone-compiler:pom:3.8.0:compile' is invalid. It will be ignored for artifact resolution. Reason: Failed to validate POM for project izpack:standalone-compiler at Artifact [izpack:standalone-compiler:pom:3.8.0:compile]
[INFO] [plugin:descriptor]
[INFO] Using 2 extractors.
[INFO] Applying extractor for language: java
[INFO] Extractor for language: java found 1 mojo descriptors.
[INFO] Applying extractor for language: bsh
[INFO] Extractor for language: bsh found 0 mojo descriptors.
[WARNING] POM for 'izpack:standalone-compiler:pom:3.8.0:compile' is invalid. It will be ignored for artifact resolution. Reason: Failed to validate POM for project izpack:standalone-compiler at Artifact [izpack:standalone-compiler:pom:3.8.0:compile]
[INFO] [remote-resources:process {execution: default}]
[WARNING] Attempting to build MavenProject instance for Artifact (izpack:standalone-compiler:3.8.0) of type: jar; constructing POM artifact instead.
[WARNING] Invalid project model for artifact [standalone-compiler:izpack:3.8.0]. It will be ignored by the remote resources Mojo.
[INFO] [resources:resources]
[INFO] Using default encoding to copy filtered resources.
[WARNING] POM for 'izpack:standalone-compiler:pom:3.8.0:compile' is invalid. It will be ignored for artifact resolution. Reason: Failed to validate POM for project izpack:standalone-compiler at Artifact [izpack:standalone-compiler:pom:3.8.0:compile]
[INFO] [compiler:compile]
[INFO] Nothing to compile - all classes are up to date
[INFO] [resources:testResources]
[INFO] Using default encoding to copy filtered resources.
[WARNING] POM for 'izpack:standalone-compiler:pom:3.8.0:compile' is invalid. It will be ignored for artifact resolution. Reason: Failed to validate POM for project izpack:standalone-compiler at Artifact [izpack:standalone-compiler:pom:3.8.0:compile]
[INFO] [compiler:testCompile]
[INFO] Nothing to compile - all classes are up to date
[WARNING] POM for 'izpack:standalone-compiler:pom:3.8.0:compile' is invalid. It will be ignored for artifact resolution. Reason: Failed to validate POM for project izpack:standalone-compiler at Artifact [izpack:standalone-compiler:pom:3.8.0:compile]
[INFO] [surefire:test]
[INFO] Surefire report directory: /home/continuum/continuum-1.1/apps/continuum/webapp/WEB-INF/working-directory/9/plugin/target/surefire-reports

-------------------------------------------------------
 T E S T S
-------------------------------------------------------
There are no tests to run.

Results :

Tests run: 0, Failures: 0, Errors: 0, Skipped: 0

[INFO] Preparing surefire-report:report-only
[INFO] No goals needed for project - skipping
[INFO] Preparing cobertura:cobertura
[WARNING] POM for 'izpack:standalone-compiler:pom:3.8.0:compile' is invalid. It will be ignored for artifact resolution. Reason: Failed to validate POM for project izpack:standalone-compiler at Artifact [izpack:standalone-compiler:pom:3.8.0:compile]
[INFO] [plugin:descriptor]
[INFO] Using 2 extractors.
[INFO] Applying extractor for language: java
[INFO] Extractor for language: java found 1 mojo descriptors.
[INFO] Applying extractor for language: bsh
[INFO] Extractor for language: bsh found 0 mojo descriptors.
[WARNING] POM for 'izpack:standalone-compiler:pom:3.8.0:compile' is invalid. It will be ignored for artifact resolution. Reason: Failed to validate POM for project izpack:standalone-compiler at Artifact [izpack:standalone-compiler:pom:3.8.0:compile]
[INFO] [remote-resources:process {execution: default}]
[WARNING] Attempting to build MavenProject instance for Artifact (izpack:standalone-compiler:3.8.0) of type: jar; constructing POM artifact instead.
[WARNING] Invalid project model for artifact [standalone-compiler:izpack:3.8.0]. It will be ignored by the remote resources Mojo.
[INFO] [resources:resources]
[INFO] Using default encoding to copy filtered resources.
[WARNING] POM for 'izpack:standalone-compiler:pom:3.8.0:compile' is invalid. It will be ignored for artifact resolution. Reason: Failed to validate POM for project izpack:standalone-compiler at Artifact [izpack:standalone-compiler:pom:3.8.0:compile]
[INFO] [compiler:compile]
[INFO] Nothing to compile - all classes are up to date
[INFO] [cobertura:instrument]
[INFO] Cobertura 1.9 - GNU GPL License (NO WARRANTY) - See COPYRIGHT file
Instrumenting 26 files to /home/continuum/continuum-1.1/apps/continuum/webapp/WEB-INF/working-directory/9/plugin/target/generated-classes/cobertura
Cobertura: Saved information on 26 classes.
Instrument time: 535ms

[INFO] Instrumentation was successful.
[INFO] [resources:testResources]
[INFO] Using default encoding to copy filtered resources.
[WARNING] POM for 'izpack:standalone-compiler:pom:3.8.0:compile' is invalid. It will be ignored for artifact resolution. Reason: Failed to validate POM for project izpack:standalone-compiler at Artifact [izpack:standalone-compiler:pom:3.8.0:compile]
[INFO] [compiler:testCompile]
[INFO] Nothing to compile - all classes are up to date
[WARNING] POM for 'izpack:standalone-compiler:pom:3.8.0:compile' is invalid. It will be ignored for artifact resolution. Reason: Failed to validate POM for project izpack:standalone-compiler at Artifact [izpack:standalone-compiler:pom:3.8.0:compile]
[INFO] [surefire:test]
[INFO] Surefire report directory: /home/continuum/continuum-1.1/apps/continuum/webapp/WEB-INF/working-directory/9/plugin/target/surefire-reports

-------------------------------------------------------
 T E S T S
-------------------------------------------------------
There are no tests to run.

Results :

Tests run: 0, Failures: 0, Errors: 0, Skipped: 0

[INFO] Preparing findbugs:findbugs
[WARNING] POM for 'izpack:standalone-compiler:pom:3.8.0:compile' is invalid. It will be ignored for artifact resolution. Reason: Failed to validate POM for project izpack:standalone-compiler at Artifact [izpack:standalone-compiler:pom:3.8.0:compile]
[INFO] [plugin:descriptor]
[INFO] Using 2 extractors.
[INFO] Applying extractor for language: java
[INFO] Extractor for language: java found 1 mojo descriptors.
[INFO] Applying extractor for language: bsh
[INFO] Extractor for language: bsh found 0 mojo descriptors.
[WARNING] POM for 'izpack:standalone-compiler:pom:3.8.0:compile' is invalid. It will be ignored for artifact resolution. Reason: Failed to validate POM for project izpack:standalone-compiler at Artifact [izpack:standalone-compiler:pom:3.8.0:compile]
[INFO] [remote-resources:process {execution: default}]
[WARNING] Attempting to build MavenProject instance for Artifact (izpack:standalone-compiler:3.8.0) of type: jar; constructing POM artifact instead.
[WARNING] Invalid project model for artifact [standalone-compiler:izpack:3.8.0]. It will be ignored by the remote resources Mojo.
[INFO] [resources:resources]
[INFO] Using default encoding to copy filtered resources.
[WARNING] POM for 'izpack:standalone-compiler:pom:3.8.0:compile' is invalid. It will be ignored for artifact resolution. Reason: Failed to validate POM for project izpack:standalone-compiler at Artifact [izpack:standalone-compiler:pom:3.8.0:compile]
[INFO] [compiler:compile]
[INFO] Nothing to compile - all classes are up to date
[WARNING] POM for 'izpack:standalone-compiler:pom:3.8.0:compile' is invalid. It will be ignored for artifact resolution. Reason: Failed to validate POM for project izpack:standalone-compiler at Artifact [izpack:standalone-compiler:pom:3.8.0:compile]
[INFO] [site:site]
[INFO] Unable to load parent project from a relative path: Could not find the model file '/home/continuum/continuum-1.1/apps/continuum/webapp/WEB-INF/working-directory/pom.xml'. for project unknown
[INFO] Parent project loaded from repository.
[INFO] Parent project loaded from repository.
[INFO] Skipped "Surefire Report" report, file "surefire-report.html" already exists for the English version.
[INFO] Generating "Project Team" report.
[INFO] Generating "Issue Tracking" report.
[INFO] Generating "Surefire Report" report.
[INFO] Generating "Checkstyle" report.
[WARNING] File encoding has not been set, using platform encoding UTF-8, i.e. build is platform dependent!
[INFO] There are 5807 checkstyle errors.
[INFO] Generating "Dependencies" report.
[WARNING] POM for 'izpack:standalone-compiler:pom:3.8.0:compile' is invalid. It will be ignored for artifact resolution. Reason: Failed to validate POM for project izpack:standalone-compiler at Artifact [izpack:standalone-compiler:pom:3.8.0:compile]
[ERROR] ProjectBuildingException error : 
org.apache.maven.project.InvalidProjectModelException: Failed to validate POM for project izpack:standalone-compiler at Artifact [izpack:standalone-compiler:pom:3.8.0:compile]
	at org.apache.maven.project.DefaultMavenProjectBuilder.processProjectLogic(DefaultMavenProjectBuilder.java:1108)
	at org.apache.maven.project.DefaultMavenProjectBuilder.buildInternal(DefaultMavenProjectBuilder.java:878)
	at org.apache.maven.project.DefaultMavenProjectBuilder.buildFromRepository(DefaultMavenProjectBuilder.java:253)
	at org.apache.maven.report.projectinfo.dependencies.RepositoryUtils.getMavenProjectFromRepository(RepositoryUtils.java:316)
	at org.apache.maven.report.projectinfo.dependencies.renderer.DependenciesRenderer.printDescriptionsAndURLs(DependenciesRenderer.java:807)
	at org.apache.maven.report.projectinfo.dependencies.renderer.DependenciesRenderer.printDependencyListing(DependenciesRenderer.java:758)
	at org.apache.maven.report.projectinfo.dependencies.renderer.DependenciesRenderer.printDependencyListing(DependenciesRenderer.java:784)
	at org.apache.maven.report.projectinfo.dependencies.renderer.DependenciesRenderer.renderSectionDependencyTree(DependenciesRenderer.java:383)
	at org.apache.maven.report.projectinfo.dependencies.renderer.DependenciesRenderer.renderSectionProjectDependencyGraph(DependenciesRenderer.java:370)
	at org.apache.maven.report.projectinfo.dependencies.renderer.DependenciesRenderer.renderBody(DependenciesRenderer.java:260)
	at org.apache.maven.reporting.AbstractMavenReportRenderer.render(AbstractMavenReportRenderer.java:65)
	at org.apache.maven.report.projectinfo.DependenciesReport.executeReport(DependenciesReport.java:239)
	at org.apache.maven.reporting.AbstractMavenReport.generate(AbstractMavenReport.java:90)
	at org.apache.maven.plugins.site.ReportDocumentRenderer.renderDocument(ReportDocumentRenderer.java:139)
	at org.apache.maven.doxia.siterenderer.DefaultSiteRenderer.renderModule(DefaultSiteRenderer.java:269)
	at org.apache.maven.doxia.siterenderer.DefaultSiteRenderer.render(DefaultSiteRenderer.java:101)
	at org.apache.maven.plugins.site.SiteMojo.renderLocale(SiteMojo.java:133)
	at org.apache.maven.plugins.site.SiteMojo.execute(SiteMojo.java:100)
	at org.apache.maven.plugin.DefaultPluginManager.executeMojo(DefaultPluginManager.java:451)
	at org.apache.maven.lifecycle.DefaultLifecycleExecutor.executeGoals(DefaultLifecycleExecutor.java:558)
	at org.apache.maven.lifecycle.DefaultLifecycleExecutor.executeGoalWithLifecycle(DefaultLifecycleExecutor.java:499)
	at org.apache.maven.lifecycle.DefaultLifecycleExecutor.executeGoal(DefaultLifecycleExecutor.java:478)
	at org.apache.maven.lifecycle.DefaultLifecycleExecutor.executeGoalAndHandleFailures(DefaultLifecycleExecutor.java:330)
	at org.apache.maven.lifecycle.DefaultLifecycleExecutor.executeTaskSegments(DefaultLifecycleExecutor.java:291)
	at org.apache.maven.lifecycle.DefaultLifecycleExecutor.execute(DefaultLifecycleExecutor.java:142)
	at org.apache.maven.DefaultMaven.doExecute(DefaultMaven.java:336)
	at org.apache.maven.DefaultMaven.execute(DefaultMaven.java:129)
	at org.apache.maven.cli.MavenCli.main(MavenCli.java:287)
	at sun.reflect.NativeMethodAccessorImpl.invoke0(Native Method)
	at sun.reflect.NativeMethodAccessorImpl.invoke(NativeMethodAccessorImpl.java:39)
	at sun.reflect.DelegatingMethodAccessorImpl.invoke(DelegatingMethodAccessorImpl.java:25)
	at java.lang.reflect.Method.invoke(Method.java:597)
	at org.codehaus.classworlds.Launcher.launchEnhanced(Launcher.java:315)
	at org.codehaus.classworlds.Launcher.launch(Launcher.java:255)
	at org.codehaus.classworlds.Launcher.mainWithExitCode(Launcher.java:430)
	at org.codehaus.classworlds.Launcher.main(Launcher.java:375)
[WARNING] Unable to create Maven project from repository.
org.apache.maven.project.InvalidProjectModelException: Failed to validate POM for project izpack:standalone-compiler at Artifact [izpack:standalone-compiler:pom:3.8.0:compile]
	at org.apache.maven.project.DefaultMavenProjectBuilder.processProjectLogic(DefaultMavenProjectBuilder.java:1108)
	at org.apache.maven.project.DefaultMavenProjectBuilder.buildInternal(DefaultMavenProjectBuilder.java:878)
	at org.apache.maven.project.DefaultMavenProjectBuilder.buildFromRepository(DefaultMavenProjectBuilder.java:253)
	at org.apache.maven.report.projectinfo.dependencies.RepositoryUtils.getMavenProjectFromRepository(RepositoryUtils.java:316)
	at org.apache.maven.report.projectinfo.dependencies.renderer.DependenciesRenderer.renderSectionDependencyRepositoryLocations(DependenciesRenderer.java:623)
	at org.apache.maven.report.projectinfo.dependencies.renderer.DependenciesRenderer.renderBody(DependenciesRenderer.java:274)
	at org.apache.maven.reporting.AbstractMavenReportRenderer.render(AbstractMavenReportRenderer.java:65)
	at org.apache.maven.report.projectinfo.DependenciesReport.executeReport(DependenciesReport.java:239)
	at org.apache.maven.reporting.AbstractMavenReport.generate(AbstractMavenReport.java:90)
	at org.apache.maven.plugins.site.ReportDocumentRenderer.renderDocument(ReportDocumentRenderer.java:139)
	at org.apache.maven.doxia.siterenderer.DefaultSiteRenderer.renderModule(DefaultSiteRenderer.java:269)
	at org.apache.maven.doxia.siterenderer.DefaultSiteRenderer.render(DefaultSiteRenderer.java:101)
	at org.apache.maven.plugins.site.SiteMojo.renderLocale(SiteMojo.java:133)
	at org.apache.maven.plugins.site.SiteMojo.execute(SiteMojo.java:100)
	at org.apache.maven.plugin.DefaultPluginManager.executeMojo(DefaultPluginManager.java:451)
	at org.apache.maven.lifecycle.DefaultLifecycleExecutor.executeGoals(DefaultLifecycleExecutor.java:558)
	at org.apache.maven.lifecycle.DefaultLifecycleExecutor.executeGoalWithLifecycle(DefaultLifecycleExecutor.java:499)
	at org.apache.maven.lifecycle.DefaultLifecycleExecutor.executeGoal(DefaultLifecycleExecutor.java:478)
	at org.apache.maven.lifecycle.DefaultLifecycleExecutor.executeGoalAndHandleFailures(DefaultLifecycleExecutor.java:330)
	at org.apache.maven.lifecycle.DefaultLifecycleExecutor.executeTaskSegments(DefaultLifecycleExecutor.java:291)
	at org.apache.maven.lifecycle.DefaultLifecycleExecutor.execute(DefaultLifecycleExecutor.java:142)
	at org.apache.maven.DefaultMaven.doExecute(DefaultMaven.java:336)
	at org.apache.maven.DefaultMaven.execute(DefaultMaven.java:129)
	at org.apache.maven.cli.MavenCli.main(MavenCli.java:287)
	at sun.reflect.NativeMethodAccessorImpl.invoke0(Native Method)
	at sun.reflect.NativeMethodAccessorImpl.invoke(NativeMethodAccessorImpl.java:39)
	at sun.reflect.DelegatingMethodAccessorImpl.invoke(DelegatingMethodAccessorImpl.java:25)
	at java.lang.reflect.Method.invoke(Method.java:597)
	at org.codehaus.classworlds.Launcher.launchEnhanced(Launcher.java:315)
	at org.codehaus.classworlds.Launcher.launch(Launcher.java:255)
	at org.codehaus.classworlds.Launcher.mainWithExitCode(Launcher.java:430)
	at org.codehaus.classworlds.Launcher.main(Launcher.java:375)
[WARNING] The repository url 'http://snapshots.maven.codehaus.org/maven2' is invalid - Repository 'snapshots' will be blacklisted.
[INFO] Generating "Mailing Lists" report.
[INFO] Generating "Source Repository" report.
[INFO] Generating "Tag List" report.
[INFO] Generating "About" report.
[INFO] Generating "FindBugs Report" report.
[INFO]   No effort provided, using default effort.
[INFO]   Using FindBugs Version: 1.2.0
[INFO]   No threshold provided, using default threshold.
[INFO]   Debugging is Off
[INFO]   No bug include filter.
[INFO] Generating "Cobertura Test Coverage" report.
[INFO] Cobertura 1.9 - GNU GPL License (NO WARRANTY) - See COPYRIGHT file
Cobertura: Loaded information on 26 classes.
Report time: 1025ms

[INFO] Cobertura Report generation was successful.
[INFO] Generating "Project License" report.
[INFO] Generating "Plugin Documentation" report.
[INFO] Using 2 extractors.
[INFO] Applying extractor for language: java
[INFO] Extractor for language: java found 1 mojo descriptors.
[INFO] Applying extractor for language: bsh
[INFO] Extractor for language: bsh found 0 mojo descriptors.
[INFO] Generating "RAT Report" report.
[INFO] [site:deploy]
scpexe://vm094.oxylos.org/var/www/html/projects/daemon/daemon-plugin - Session: Opened  
Using private key: /home/continuum/.ssh/id_dsa
Executing command: /bin/sh -c ssh -i /home/continuum/.ssh/id_dsa -o 'BatchMode yes' continuum@vm094.oxylos.org 'mkdir -p /var/www/html/projects/daemon/daemon-plugin/.'


Using private key: /home/continuum/.ssh/id_dsa
Executing command: /bin/sh -c ssh -i /home/continuum/.ssh/id_dsa -o 'BatchMode yes' continuum@vm094.oxylos.org 'mkdir -p /var/www/html/projects/daemon/daemon-plugin/.
'


Uploading: ./wagon37194.zip to scpexe://vm094.oxylos.org/var/www/html/projects/daemon/daemon-plugin

Using private key: /home/continuum/.ssh/id_dsa
Executing command: /bin/sh -c cd /tmp && scp -i /home/continuum/.ssh/id_dsa -o 'BatchMode yes' wagon37194.zip continuum@vm094.oxylos.org:/var/www/html/projects/daemon/daemon-plugin/./wagon37194.zip
##################################################################Using private key: /home/continuum/.ssh/id_dsa
Executing command: /bin/sh -c ssh -i /home/continuum/.ssh/id_dsa -o 'BatchMode yes' continuum@vm094.oxylos.org 'chmod -f 644 /var/www/html/projects/daemon/daemon-plugin/./wagon37194.zip
'



Transfer finished. 268072 bytes copied in 0.972 seconds
Using private key: /home/continuum/.ssh/id_dsa
Executing command: /bin/sh -c ssh -i /home/continuum/.ssh/id_dsa -o 'BatchMode yes' continuum@vm094.oxylos.org 'cd /var/www/html/projects/daemon/daemon-plugin/.; unzip -o wagon37194.zip; rm -f wagon37194.zip'
Archive:  wagon37194.zip
  inflating: css/maven-base.css      
  inflating: css/print.css           
  inflating: css/site.css            
  inflating: css/maven-theme.css     
  inflating: index.html              
  inflating: generate-mojo.html      
  inflating: surefire-report.html    
  inflating: project-reports.html    
  inflating: checkstyle.html         
  inflating: mail-lists.html         
  inflating: plugin-info.html        
  inflating: rat-report.html         
  inflating: cobertura/frame-summary-org.apache.directory.daemon.installers.izpack.html  
  inflating: cobertura/org.apache.directory.daemon.installers.rpm.RpmInstallerCommand.html  
  inflating: cobertura/css/tooltip.css  
  inflating: cobertura/css/sortabletable.css  
  inflating: cobertura/css/source-viewer.css  
  inflating: cobertura/css/help.css  
  inflating: cobertura/css/main.css  
  inflating: cobertura/index.html    
  inflating: cobertura/org.apache.directory.daemon.installers.PackagedFile.html  
  inflating: cobertura/frame-sourcefiles-org.apache.directory.daemon.installers.deb.html  
  inflating: cobertura/frame-summary-org.apache.directory.daemon.installers.nsis.html  
  inflating: cobertura/org.apache.directory.daemon.installers.solarispkg.SolarisPkgInstallerCommand.html  
  inflating: cobertura/org.apache.directory.daemon.installers.inno.InnoTarget.html  
  inflating: cobertura/frame-summary-org.apache.directory.daemon.installers.solarispkg.html  
  inflating: cobertura/org.apache.directory.daemon.installers.ReflectionProperties.html  
  inflating: cobertura/frame-summary-org.apache.directory.daemon.installers.deb.html  
  inflating: cobertura/frame-sourcefiles-org.apache.directory.daemon.installers.inno.html  
  inflating: cobertura/help.html     
  inflating: cobertura/org.apache.directory.daemon.installers.nsis.NsisTarget.html  
  inflating: cobertura/frame-summary-org.apache.directory.daemon.installers.bin.html  
  inflating: cobertura/org.apache.directory.daemon.installers.CreateImageCommand.html  
  inflating: cobertura/org.apache.directory.daemon.installers.solarispkg.SolarisPkgTarget.html  
  inflating: cobertura/org.apache.directory.daemon.installers.ServiceInstallersMojo.html  
  inflating: cobertura/org.apache.directory.daemon.installers.archive.ArchiveTarget.html  
  inflating: cobertura/frame-sourcefiles-org.apache.directory.daemon.installers.rpm.html  
  inflating: cobertura/frame-sourcefiles-org.apache.directory.daemon.installers.nsis.html  
  inflating: cobertura/frame-sourcefiles.html  
  inflating: cobertura/org.apache.directory.daemon.installers.deb.DebInstallerCommand.html  
  inflating: cobertura/frame-sourcefiles-org.apache.directory.daemon.installers.solarispkg.html  
  inflating: cobertura/org.apache.directory.daemon.installers.deb.DebTarget.html  
  inflating: cobertura/frame-sourcefiles-org.apache.directory.daemon.installers.html  
  inflating: cobertura/org.apache.directory.daemon.installers.nsis.NsisInstallerCommand.html  
  inflating: cobertura/frame-sourcefiles-org.apache.directory.daemon.installers.macosxpkg.html  
  inflating: cobertura/org.apache.directory.daemon.installers.izpack.IzPackTarget.html  
  inflating: cobertura/frame-sourcefiles-org.apache.directory.daemon.installers.bin.html  
  inflating: cobertura/org.apache.directory.daemon.installers.bin.BinInstallerCommand.html  
  inflating: cobertura/frame-sourcefiles-org.apache.directory.daemon.installers.izpack.html  
  inflating: cobertura/frame-sourcefiles-org.apache.directory.daemon.installers.archive.html  
  inflating: cobertura/frame-summary-org.apache.directory.daemon.installers.macosxpkg.html  
  inflating: cobertura/org.apache.directory.daemon.installers.macosxpkg.MacOsXPkgTarget.html  
  inflating: cobertura/org.apache.directory.daemon.installers.bin.BinTarget.html  
  inflating: cobertura/org.apache.directory.daemon.installers.izpack.IzPackInstallerCommand.html  
  inflating: cobertura/frame-summary-org.apache.directory.daemon.installers.archive.html  
  inflating: cobertura/org.apache.directory.daemon.installers.Target.html  
  inflating: cobertura/frame-summary-org.apache.directory.daemon.installers.html  
  inflating: cobertura/js/popup.js   
  inflating: cobertura/js/customsorttypes.js  
  inflating: cobertura/js/sortabletable.js  
  inflating: cobertura/js/stringbuilder.js  
  inflating: cobertura/org.apache.directory.daemon.installers.macosxpkg.MacOsXPkgInstallerCommand.html  
  inflating: cobertura/frame-summary-org.apache.directory.daemon.installers.inno.html  
  inflating: cobertura/org.apache.directory.daemon.installers.Application.html  
  inflating: cobertura/org.apache.directory.daemon.installers.archive.ArchiveInstallerCommand.html  
  inflating: cobertura/frame-summary-org.apache.directory.daemon.installers.rpm.html  
  inflating: cobertura/frame-packages.html  
  inflating: cobertura/org.apache.directory.daemon.installers.MojoHelperUtils.html  
  inflating: cobertura/org.apache.directory.daemon.installers.rpm.RpmTarget.html  
  inflating: cobertura/images/blank.png  
  inflating: cobertura/images/upsimple.png  
  inflating: cobertura/images/downsimple.png  
  inflating: cobertura/org.apache.directory.daemon.installers.MojoCommand.html  
  inflating: cobertura/frame-summary.html  
  inflating: cobertura/org.apache.directory.daemon.installers.inno.InnoInstallerCommand.html  
  inflating: team-list.html          
  inflating: checkstyle.rss          
  inflating: issue-tracking.html     
  inflating: license.html            
  inflating: findbugs.html           
  inflating: dependencies.html       
  inflating: source-repository.html  
  inflating: taglist.html            
  inflating: project-info.html       
  inflating: images/icon_info_sml.gif  
  inflating: images/icon_error_sml.gif  
  inflating: images/icon_warning_sml.gif  
  inflating: images/expanded.gif     
  inflating: images/collapsed.gif    
  inflating: images/logos/build-by-maven-white.png  
  inflating: images/logos/build-by-maven-black.png  
  inflating: images/logos/maven-feather.png  
  inflating: images/icon_success_sml.gif  
  inflating: images/close.gif        
  inflating: images/external.png     
  inflating: images/rss.png          
  inflating: images/newwindow.png    


Using private key: /home/continuum/.ssh/id_dsa
Executing command: /bin/sh -c ssh -i /home/continuum/.ssh/id_dsa -o 'BatchMode yes' continuum@vm094.oxylos.org 'chmod -Rf g+w,a+rX /var/www/html/projects/daemon/daemon-plugin'


scpexe://vm094.oxylos.org/var/www/html/projects/daemon/daemon-plugin - Session: Disconnecting  
scpexe://vm094.oxylos.org/var/www/html/projects/daemon/daemon-plugin - Session: Disconnected
[INFO] 
[INFO] 
[INFO] ------------------------------------------------------------------------
[INFO] Reactor Summary:
[INFO] ------------------------------------------------------------------------
[INFO] Apache Directory Daemon ............................... SUCCESS [33.129s]
[INFO] Apache Directory Daemon Bootstrappers ................. SUCCESS [18.680s]
[INFO] Apache Directory Daemon Plugin (Maven 2) .............. SUCCESS [32.445s]
[INFO] ------------------------------------------------------------------------
[INFO] ------------------------------------------------------------------------
[INFO] BUILD SUCCESSFUL
[INFO] ------------------------------------------------------------------------
[INFO] Total time: 1 minute 24 seconds
[INFO] Finished at: Sun Dec 07 20:01:29 EST 2008
[INFO] Final Memory: 108M/508M
[INFO] ------------------------------------------------------------------------

****************************************************************************



Mime
View raw message