directory-notifications mailing list archives

Site index · List index
Message view « Date » · « Thread »
Top « Date » · « Thread »
From Continuum VMBuild Server <contin...@vm094.oxylos.org>
Subject [continuum] BUILD FAILURE: Apache Directory Studio - Apache Directory Studio - Build Def: Build and deployment of studio snapshot distributions
Date Mon, 08 Sep 2008 09:40:00 GMT
Online report : http://vm094.oxylos.org/continuum/buildResult.action?buildId=2071&projectId=23

Build statistics:
  State: Failed
  Previous State: Failed
  Started at: Mon 8 Sep 2008 05:30:16 -0400
  Finished at: Mon 8 Sep 2008 05:39:46 -0400
  Total time: 9m 29s
  Build Trigger: Schedule
  Build Number: 158
  Exit code: 1
  Building machine hostname: vm094.oxylos.org
  Operating system : Linux(unknown)
  Java Home version : 
          java version "1.6.0_06"
          Java(TM) SE Runtime Environment (build 1.6.0_06-b02)
          Java HotSpot(TM) Client VM (build 10.0-b22, mixed mode, sharing)
        
  Builder version :
          Maven version: 2.0.9
          Java version: 1.6.0_06
          OS name: "linux" version: "2.6.18-53.1.14.el5" arch: "i386" Family: "unix"
    
****************************************************************************
SCM Changes:
****************************************************************************
Changed: felixk @ Mon 8 Sep 2008 05:07:03 -0400
Comment: Refactor dependencyManagement section to project root pom.xml
Files changed:
  /directory/studio/trunk/apacheds-launcher/pom.xml ( 693032 )
  /directory/studio/trunk/pom.xml ( 693032 )

Changed: felixk @ Mon 8 Sep 2008 05:14:38 -0400
Comment: Reformat
Files changed:
  /directory/studio/trunk/apacheds-launcher/pom.xml ( 693033 )
  /directory/studio/trunk/pom.xml ( 693033 )

****************************************************************************
Dependencies Changes:
****************************************************************************
No dependencies changed


****************************************************************************
Build Defintion:
****************************************************************************
POM filename: pom.xml
Goals: clean deploy   
Arguments: -Plinux-x86,linux-x86_64,linux-ppc,macosx,win32 --batch-mode -DaltDeploymentRepository=id::default::scpexe://vm094.oxylos.org/var/www/html/mirror-maven2/
Build Fresh: false
Always Build: false
Default Build Definition: true
Schedule: EVERY_30_MINUTES
Description: Build and deployment of studio snapshot distributions

****************************************************************************
Test Summary:
****************************************************************************
Tests: 560
Failures: 0
Total time: 1.147


****************************************************************************
Output:
****************************************************************************
[INFO] Scanning for projects...
[INFO] Reactor build order: 
[INFO]   Apache Directory Studio
[INFO]   Apache Directory Studio Repository
[INFO]   Apache Directory Studio DSML Parser
[INFO]   Apache Directory Studio Jars
[INFO]   Apache Directory Studio LDIF Parser
[INFO]   Apache Directory Studio Connection Core
[INFO]   Apache Directory Studio LDAP Browser Core
[INFO]   Apache Directory Studio Connection UI
[INFO]   Apache Directory Studio LDAP Browser Common
[INFO]   Apache Directory Studio Value Editors
[INFO]   Apache Directory Studio ACI Item Editor
[INFO]   Apache Directory Studio Schema Editor
[INFO]   Apache Directory Studio Schema Editor Feature
[INFO]   Apache Directory Studio Schema Editor Help
[INFO]   Apache Directory Studio RCP
[INFO]   Apache Directory Studio RCP Feature
[INFO]   Apache Directory Studio RCP Help
[INFO]   Apache Directory Studio LDIF Editor
[INFO]   Apache Directory Studio LDIF Editor Feature
[INFO]   Apache Directory Studio LDIF Editor Help
[INFO]   Apache Directory Studio LDAP Browser UI
[INFO]   Apache Directory Studio LDAP Browser Feature
[INFO]   Apache Directory Studio LDAP Browser Help
[INFO]   Apache Directory Studio Apache DS Configuration
[INFO]   Apache Directory Studio Apache DS Configuration Feature
[INFO]   Apache Directory Studio Apache DS Configuration Help
[INFO]   Apache Directory Studio Apache DS Launcher
[INFO]   Apache Directory Studio Apache DS
[INFO]   Apache Directory Studio Apache DS Help
[INFO]   Apache Directory Studio Apache DS Feature
[INFO]   Apache Directory Studio Core Integration Tests
[INFO]   Apache Directory Studio UI Integration Tests
[INFO]   Apache Directory Studio Update Site
[INFO]   Apache Directory Studio Build
[INFO] ------------------------------------------------------------------------
[INFO] Building Apache Directory Studio
[INFO]    task-segment: [clean, deploy]
[INFO] ------------------------------------------------------------------------
[INFO] [clean:clean]
[INFO] Deleting directory /home/continuum/continuum-1.1/apps/continuum/webapp/WEB-INF/working-directory/23/target
[INFO] Setting property: classpath.resource.loader.class => 'org.codehaus.plexus.velocity.ContextClassLoaderResourceLoader'.
[INFO] Setting property: velocimacro.messages.on => 'false'.
[INFO] Setting property: resource.loader => 'classpath'.
[INFO] Setting property: resource.manager.logwhenfound => 'false'.
[INFO] [remote-resources:process {execution: default}]
[INFO] [site:attach-descriptor]
[INFO] [tools:verify-legal-files {execution: verify-legal-files}]
[INFO] [install:install]
[INFO] Installing /home/continuum/continuum-1.1/apps/continuum/webapp/WEB-INF/working-directory/23/pom.xml to /home/continuum/.m2/repository/org/apache/directory/studio/parent/1.3.0.SNAPSHOT/parent-1.3.0.SNAPSHOT.pom
[INFO] [deploy:deploy]
altDeploymentRepository = id::default::scpexe://vm094.oxylos.org/var/www/html/mirror-maven2/
[INFO] Using alternate deployment repository id::default::scpexe://vm094.oxylos.org/var/www/html/mirror-maven2/
[INFO] Retrieving previous build number from id
Uploading: scpexe://vm094.oxylos.org/var/www/html/mirror-maven2//org/apache/directory/studio/parent/1.3.0.SNAPSHOT/parent-1.3.0.SNAPSHOT.pom
[INFO] Retrieving previous metadata from id
[INFO] Uploading repository metadata for: 'artifact org.apache.directory.studio:parent'
[INFO] Retrieving previous metadata from id
[INFO] Uploading repository metadata for: 'snapshot org.apache.directory.studio:parent:1.3.0.SNAPSHOT'
[INFO] ------------------------------------------------------------------------
[INFO] Building Apache Directory Studio Repository
[INFO]    task-segment: [clean, deploy]
[INFO] ------------------------------------------------------------------------
[INFO] [clean:clean]
[INFO] Deleting directory /home/continuum/continuum-1.1/apps/continuum/webapp/WEB-INF/working-directory/23/repository/target
[INFO] [remote-resources:process {execution: default}]
[INFO] [site:attach-descriptor]
[INFO] [tools:verify-legal-files {execution: verify-legal-files}]
[INFO] [install:install]
[INFO] Installing /home/continuum/continuum-1.1/apps/continuum/webapp/WEB-INF/working-directory/23/repository/pom.xml to /home/continuum/.m2/repository/org/apache/directory/studio/repository/1.3.0.SNAPSHOT/repository-1.3.0.SNAPSHOT.pom
[INFO] [deploy:deploy]
altDeploymentRepository = id::default::scpexe://vm094.oxylos.org/var/www/html/mirror-maven2/
[INFO] Using alternate deployment repository id::default::scpexe://vm094.oxylos.org/var/www/html/mirror-maven2/
[INFO] Retrieving previous build number from id
Uploading: scpexe://vm094.oxylos.org/var/www/html/mirror-maven2//org/apache/directory/studio/repository/1.3.0.SNAPSHOT/repository-1.3.0.SNAPSHOT.pom
[INFO] Retrieving previous metadata from id
[INFO] Uploading repository metadata for: 'artifact org.apache.directory.studio:repository'
[INFO] Retrieving previous metadata from id
[INFO] Uploading repository metadata for: 'snapshot org.apache.directory.studio:repository:1.3.0.SNAPSHOT'
[INFO] ------------------------------------------------------------------------
[INFO] Building Apache Directory Studio DSML Parser
[INFO]    task-segment: [clean, deploy]
[INFO] ------------------------------------------------------------------------
[INFO] [clean:clean]
[INFO] Deleting directory /home/continuum/continuum-1.1/apps/continuum/webapp/WEB-INF/working-directory/23/studio-dsml-parser/target
[INFO] [remote-resources:process {execution: default}]
[INFO] [resources:resources]
[INFO] Using default encoding to copy filtered resources.
[INFO] [compiler:compile]
[INFO] Compiling 49 source files to /home/continuum/continuum-1.1/apps/continuum/webapp/WEB-INF/working-directory/23/studio-dsml-parser/target/classes
[INFO] [resources:testResources]
[INFO] Using default encoding to copy filtered resources.
[INFO] [compiler:testCompile]
[INFO] Compiling 26 source files to /home/continuum/continuum-1.1/apps/continuum/webapp/WEB-INF/working-directory/23/studio-dsml-parser/target/test-classes
[WARNING] /home/continuum/continuum-1.1/apps/continuum/webapp/WEB-INF/working-directory/23/studio-dsml-parser/src/test/java/org/apache/directory/studio/dsmlv2/addResponse/AddResponseTest.java:[36,24] com.sun.jndi.ldap.LdapURL is Sun proprietary API and may be removed in a future release

[WARNING] /home/continuum/continuum-1.1/apps/continuum/webapp/WEB-INF/working-directory/23/studio-dsml-parser/src/test/java/org/apache/directory/studio/dsmlv2/compareResponse/CompareResponseTest.java:[36,24] com.sun.jndi.ldap.LdapURL is Sun proprietary API and may be removed in a future release

[WARNING] /home/continuum/continuum-1.1/apps/continuum/webapp/WEB-INF/working-directory/23/studio-dsml-parser/src/test/java/org/apache/directory/studio/dsmlv2/delResponse/DelResponseTest.java:[36,24] com.sun.jndi.ldap.LdapURL is Sun proprietary API and may be removed in a future release

[WARNING] /home/continuum/continuum-1.1/apps/continuum/webapp/WEB-INF/working-directory/23/studio-dsml-parser/src/test/java/org/apache/directory/studio/dsmlv2/searchResponse/searchResultDone/SearchResultDoneTest.java:[37,24] com.sun.jndi.ldap.LdapURL is Sun proprietary API and may be removed in a future release

[WARNING] /home/continuum/continuum-1.1/apps/continuum/webapp/WEB-INF/working-directory/23/studio-dsml-parser/src/test/java/org/apache/directory/studio/dsmlv2/extendedResponse/ExtendedResponseTest.java:[38,24] com.sun.jndi.ldap.LdapURL is Sun proprietary API and may be removed in a future release

[WARNING] /home/continuum/continuum-1.1/apps/continuum/webapp/WEB-INF/working-directory/23/studio-dsml-parser/src/test/java/org/apache/directory/studio/dsmlv2/modDNResponse/ModifyDNResponseTest.java:[36,24] com.sun.jndi.ldap.LdapURL is Sun proprietary API and may be removed in a future release

[WARNING] /home/continuum/continuum-1.1/apps/continuum/webapp/WEB-INF/working-directory/23/studio-dsml-parser/src/test/java/org/apache/directory/studio/dsmlv2/modifyResponse/ModifyResponseTest.java:[36,24] com.sun.jndi.ldap.LdapURL is Sun proprietary API and may be removed in a future release

[WARNING] /home/continuum/continuum-1.1/apps/continuum/webapp/WEB-INF/working-directory/23/studio-dsml-parser/src/test/java/org/apache/directory/studio/dsmlv2/authResponse/AuthResponseTest.java:[36,24] com.sun.jndi.ldap.LdapURL is Sun proprietary API and may be removed in a future release

[WARNING] /home/continuum/continuum-1.1/apps/continuum/webapp/WEB-INF/working-directory/23/studio-dsml-parser/src/test/java/org/apache/directory/studio/dsmlv2/addResponse/AddResponseTest.java:[347,30] com.sun.jndi.ldap.LdapURL is Sun proprietary API and may be removed in a future release

[WARNING] /home/continuum/continuum-1.1/apps/continuum/webapp/WEB-INF/working-directory/23/studio-dsml-parser/src/test/java/org/apache/directory/studio/dsmlv2/addResponse/AddResponseTest.java:[418,30] com.sun.jndi.ldap.LdapURL is Sun proprietary API and may be removed in a future release

[WARNING] /home/continuum/continuum-1.1/apps/continuum/webapp/WEB-INF/working-directory/23/studio-dsml-parser/src/test/java/org/apache/directory/studio/dsmlv2/addResponse/AddResponseTest.java:[429,30] com.sun.jndi.ldap.LdapURL is Sun proprietary API and may be removed in a future release

[WARNING] /home/continuum/continuum-1.1/apps/continuum/webapp/WEB-INF/working-directory/23/studio-dsml-parser/src/test/java/org/apache/directory/studio/dsmlv2/addResponse/AddResponseTest.java:[470,30] com.sun.jndi.ldap.LdapURL is Sun proprietary API and may be removed in a future release

[WARNING] /home/continuum/continuum-1.1/apps/continuum/webapp/WEB-INF/working-directory/23/studio-dsml-parser/src/test/java/org/apache/directory/studio/dsmlv2/compareResponse/CompareResponseTest.java:[350,30] com.sun.jndi.ldap.LdapURL is Sun proprietary API and may be removed in a future release

[WARNING] /home/continuum/continuum-1.1/apps/continuum/webapp/WEB-INF/working-directory/23/studio-dsml-parser/src/test/java/org/apache/directory/studio/dsmlv2/compareResponse/CompareResponseTest.java:[421,30] com.sun.jndi.ldap.LdapURL is Sun proprietary API and may be removed in a future release

[WARNING] /home/continuum/continuum-1.1/apps/continuum/webapp/WEB-INF/working-directory/23/studio-dsml-parser/src/test/java/org/apache/directory/studio/dsmlv2/compareResponse/CompareResponseTest.java:[432,30] com.sun.jndi.ldap.LdapURL is Sun proprietary API and may be removed in a future release

[WARNING] /home/continuum/continuum-1.1/apps/continuum/webapp/WEB-INF/working-directory/23/studio-dsml-parser/src/test/java/org/apache/directory/studio/dsmlv2/compareResponse/CompareResponseTest.java:[473,30] com.sun.jndi.ldap.LdapURL is Sun proprietary API and may be removed in a future release

[WARNING] /home/continuum/continuum-1.1/apps/continuum/webapp/WEB-INF/working-directory/23/studio-dsml-parser/src/test/java/org/apache/directory/studio/dsmlv2/delResponse/DelResponseTest.java:[347,30] com.sun.jndi.ldap.LdapURL is Sun proprietary API and may be removed in a future release

[WARNING] /home/continuum/continuum-1.1/apps/continuum/webapp/WEB-INF/working-directory/23/studio-dsml-parser/src/test/java/org/apache/directory/studio/dsmlv2/delResponse/DelResponseTest.java:[418,30] com.sun.jndi.ldap.LdapURL is Sun proprietary API and may be removed in a future release

[WARNING] /home/continuum/continuum-1.1/apps/continuum/webapp/WEB-INF/working-directory/23/studio-dsml-parser/src/test/java/org/apache/directory/studio/dsmlv2/delResponse/DelResponseTest.java:[429,30] com.sun.jndi.ldap.LdapURL is Sun proprietary API and may be removed in a future release

[WARNING] /home/continuum/continuum-1.1/apps/continuum/webapp/WEB-INF/working-directory/23/studio-dsml-parser/src/test/java/org/apache/directory/studio/dsmlv2/delResponse/DelResponseTest.java:[470,30] com.sun.jndi.ldap.LdapURL is Sun proprietary API and may be removed in a future release

[WARNING] /home/continuum/continuum-1.1/apps/continuum/webapp/WEB-INF/working-directory/23/studio-dsml-parser/src/test/java/org/apache/directory/studio/dsmlv2/searchResponse/searchResultDone/SearchResultDoneTest.java:[359,30] com.sun.jndi.ldap.LdapURL is Sun proprietary API and may be removed in a future release

[WARNING] /home/continuum/continuum-1.1/apps/continuum/webapp/WEB-INF/working-directory/23/studio-dsml-parser/src/test/java/org/apache/directory/studio/dsmlv2/searchResponse/searchResultDone/SearchResultDoneTest.java:[432,30] com.sun.jndi.ldap.LdapURL is Sun proprietary API and may be removed in a future release

[WARNING] /home/continuum/continuum-1.1/apps/continuum/webapp/WEB-INF/working-directory/23/studio-dsml-parser/src/test/java/org/apache/directory/studio/dsmlv2/searchResponse/searchResultDone/SearchResultDoneTest.java:[443,30] com.sun.jndi.ldap.LdapURL is Sun proprietary API and may be removed in a future release

[WARNING] /home/continuum/continuum-1.1/apps/continuum/webapp/WEB-INF/working-directory/23/studio-dsml-parser/src/test/java/org/apache/directory/studio/dsmlv2/searchResponse/searchResultDone/SearchResultDoneTest.java:[485,30] com.sun.jndi.ldap.LdapURL is Sun proprietary API and may be removed in a future release

[WARNING] /home/continuum/continuum-1.1/apps/continuum/webapp/WEB-INF/working-directory/23/studio-dsml-parser/src/test/java/org/apache/directory/studio/dsmlv2/extendedResponse/ExtendedResponseTest.java:[352,30] com.sun.jndi.ldap.LdapURL is Sun proprietary API and may be removed in a future release

[WARNING] /home/continuum/continuum-1.1/apps/continuum/webapp/WEB-INF/working-directory/23/studio-dsml-parser/src/test/java/org/apache/directory/studio/dsmlv2/extendedResponse/ExtendedResponseTest.java:[423,30] com.sun.jndi.ldap.LdapURL is Sun proprietary API and may be removed in a future release

[WARNING] /home/continuum/continuum-1.1/apps/continuum/webapp/WEB-INF/working-directory/23/studio-dsml-parser/src/test/java/org/apache/directory/studio/dsmlv2/extendedResponse/ExtendedResponseTest.java:[434,30] com.sun.jndi.ldap.LdapURL is Sun proprietary API and may be removed in a future release

[WARNING] /home/continuum/continuum-1.1/apps/continuum/webapp/WEB-INF/working-directory/23/studio-dsml-parser/src/test/java/org/apache/directory/studio/dsmlv2/extendedResponse/ExtendedResponseTest.java:[475,30] com.sun.jndi.ldap.LdapURL is Sun proprietary API and may be removed in a future release

[WARNING] /home/continuum/continuum-1.1/apps/continuum/webapp/WEB-INF/working-directory/23/studio-dsml-parser/src/test/java/org/apache/directory/studio/dsmlv2/modDNResponse/ModifyDNResponseTest.java:[350,30] com.sun.jndi.ldap.LdapURL is Sun proprietary API and may be removed in a future release

[WARNING] /home/continuum/continuum-1.1/apps/continuum/webapp/WEB-INF/working-directory/23/studio-dsml-parser/src/test/java/org/apache/directory/studio/dsmlv2/modDNResponse/ModifyDNResponseTest.java:[421,30] com.sun.jndi.ldap.LdapURL is Sun proprietary API and may be removed in a future release

[WARNING] /home/continuum/continuum-1.1/apps/continuum/webapp/WEB-INF/working-directory/23/studio-dsml-parser/src/test/java/org/apache/directory/studio/dsmlv2/modDNResponse/ModifyDNResponseTest.java:[432,30] com.sun.jndi.ldap.LdapURL is Sun proprietary API and may be removed in a future release

[WARNING] /home/continuum/continuum-1.1/apps/continuum/webapp/WEB-INF/working-directory/23/studio-dsml-parser/src/test/java/org/apache/directory/studio/dsmlv2/modDNResponse/ModifyDNResponseTest.java:[473,30] com.sun.jndi.ldap.LdapURL is Sun proprietary API and may be removed in a future release

[WARNING] /home/continuum/continuum-1.1/apps/continuum/webapp/WEB-INF/working-directory/23/studio-dsml-parser/src/test/java/org/apache/directory/studio/dsmlv2/modifyResponse/ModifyResponseTest.java:[350,30] com.sun.jndi.ldap.LdapURL is Sun proprietary API and may be removed in a future release

[WARNING] /home/continuum/continuum-1.1/apps/continuum/webapp/WEB-INF/working-directory/23/studio-dsml-parser/src/test/java/org/apache/directory/studio/dsmlv2/modifyResponse/ModifyResponseTest.java:[421,30] com.sun.jndi.ldap.LdapURL is Sun proprietary API and may be removed in a future release

[WARNING] /home/continuum/continuum-1.1/apps/continuum/webapp/WEB-INF/working-directory/23/studio-dsml-parser/src/test/java/org/apache/directory/studio/dsmlv2/modifyResponse/ModifyResponseTest.java:[432,30] com.sun.jndi.ldap.LdapURL is Sun proprietary API and may be removed in a future release

[WARNING] /home/continuum/continuum-1.1/apps/continuum/webapp/WEB-INF/working-directory/23/studio-dsml-parser/src/test/java/org/apache/directory/studio/dsmlv2/modifyResponse/ModifyResponseTest.java:[473,30] com.sun.jndi.ldap.LdapURL is Sun proprietary API and may be removed in a future release

[WARNING] /home/continuum/continuum-1.1/apps/continuum/webapp/WEB-INF/working-directory/23/studio-dsml-parser/src/test/java/org/apache/directory/studio/dsmlv2/authResponse/AuthResponseTest.java:[349,30] com.sun.jndi.ldap.LdapURL is Sun proprietary API and may be removed in a future release

[WARNING] /home/continuum/continuum-1.1/apps/continuum/webapp/WEB-INF/working-directory/23/studio-dsml-parser/src/test/java/org/apache/directory/studio/dsmlv2/authResponse/AuthResponseTest.java:[420,30] com.sun.jndi.ldap.LdapURL is Sun proprietary API and may be removed in a future release

[WARNING] /home/continuum/continuum-1.1/apps/continuum/webapp/WEB-INF/working-directory/23/studio-dsml-parser/src/test/java/org/apache/directory/studio/dsmlv2/authResponse/AuthResponseTest.java:[431,30] com.sun.jndi.ldap.LdapURL is Sun proprietary API and may be removed in a future release

[WARNING] /home/continuum/continuum-1.1/apps/continuum/webapp/WEB-INF/working-directory/23/studio-dsml-parser/src/test/java/org/apache/directory/studio/dsmlv2/authResponse/AuthResponseTest.java:[472,30] com.sun.jndi.ldap.LdapURL is Sun proprietary API and may be removed in a future release

[INFO] [surefire:test]
[INFO] Surefire report directory: /home/continuum/continuum-1.1/apps/continuum/webapp/WEB-INF/working-directory/23/studio-dsml-parser/target/surefire-reports

-------------------------------------------------------
 T E S T S
-------------------------------------------------------
Running org.apache.directory.studio.dsmlv2.modifyResponse.ModifyResponseTest
Tests run: 18, Failures: 0, Errors: 0, Skipped: 0, Time elapsed: 0.177 sec
Running org.apache.directory.studio.dsmlv2.searchRequest.SearchRequestTest
Tests run: 95, Failures: 0, Errors: 0, Skipped: 0, Time elapsed: 0.211 sec
Running org.apache.directory.studio.dsmlv2.authResponse.AuthResponseTest
Tests run: 18, Failures: 0, Errors: 0, Skipped: 0, Time elapsed: 0.02 sec
Running org.apache.directory.studio.dsmlv2.errorResponse.ErrorResponseTest
Tests run: 14, Failures: 0, Errors: 0, Skipped: 0, Time elapsed: 0.017 sec
Running org.apache.directory.studio.dsmlv2.batchResponse.BatchResponseTest
Tests run: 21, Failures: 0, Errors: 0, Skipped: 0, Time elapsed: 0.022 sec
Running org.apache.directory.studio.dsmlv2.addRequest.AddRequestTest
Tests run: 17, Failures: 0, Errors: 0, Skipped: 0, Time elapsed: 0.024 sec
Running org.apache.directory.studio.dsmlv2.modDNResponse.ModifyDNResponseTest
Tests run: 18, Failures: 0, Errors: 0, Skipped: 0, Time elapsed: 0.018 sec
Running org.apache.directory.studio.dsmlv2.searchResponse.searchResultReference.SearchResultReferenceTest
Tests run: 11, Failures: 0, Errors: 0, Skipped: 0, Time elapsed: 0.028 sec
Running org.apache.directory.studio.dsmlv2.searchResponse.searchResultEntry.SearchResultEntryTest
Tests run: 17, Failures: 0, Errors: 0, Skipped: 0, Time elapsed: 0.018 sec
Running org.apache.directory.studio.dsmlv2.modifyRequest.ModifyRequestTest
Tests run: 21, Failures: 0, Errors: 0, Skipped: 0, Time elapsed: 0.022 sec
Running org.apache.directory.studio.dsmlv2.authRequest.AuthRequestTest
Tests run: 10, Failures: 0, Errors: 0, Skipped: 0, Time elapsed: 0.012 sec
Running org.apache.directory.studio.dsmlv2.extendedRequest.ExtendedRequestTest
Tests run: 14, Failures: 0, Errors: 0, Skipped: 0, Time elapsed: 0.014 sec
Running org.apache.directory.studio.dsmlv2.delRequest.DelRequestTest
Tests run: 10, Failures: 0, Errors: 0, Skipped: 0, Time elapsed: 0.012 sec
Running org.apache.directory.studio.dsmlv2.modDNRequest.ModifyDNRequestTest
Tests run: 17, Failures: 0, Errors: 0, Skipped: 0, Time elapsed: 0.017 sec
Running org.apache.directory.studio.dsmlv2.compareRequest.CompareRequestTest
Tests run: 18, Failures: 0, Errors: 0, Skipped: 0, Time elapsed: 0.056 sec
Running org.apache.directory.studio.dsmlv2.addResponse.AddResponseTest
Tests run: 18, Failures: 0, Errors: 0, Skipped: 0, Time elapsed: 0.046 sec
Running org.apache.directory.studio.dsmlv2.searchResponse.searchResultDone.SearchResultDoneTest
Tests run: 18, Failures: 0, Errors: 0, Skipped: 0, Time elapsed: 0.03 sec
Running org.apache.directory.studio.dsmlv2.delResponse.DelResponseTest
Tests run: 18, Failures: 0, Errors: 0, Skipped: 0, Time elapsed: 0.05 sec
Running org.apache.directory.studio.dsmlv2.compareResponse.CompareResponseTest
Tests run: 18, Failures: 0, Errors: 0, Skipped: 0, Time elapsed: 0.016 sec
Running org.apache.directory.studio.dsmlv2.searchResponse.SearchResponseTest
Tests run: 12, Failures: 0, Errors: 0, Skipped: 0, Time elapsed: 0.032 sec
Running org.apache.directory.studio.dsmlv2.abandonRequest.AbandonRequestTest
Tests run: 10, Failures: 0, Errors: 0, Skipped: 0, Time elapsed: 0.01 sec
Running org.apache.directory.studio.dsmlv2.extendedResponse.ExtendedResponseTest
Tests run: 25, Failures: 0, Errors: 0, Skipped: 0, Time elapsed: 0.02 sec
Running org.apache.directory.studio.dsmlv2.batchRequest.BatchRequestTest
Tests run: 22, Failures: 0, Errors: 0, Skipped: 0, Time elapsed: 0.022 sec

Results :

Tests run: 460, Failures: 0, Errors: 0, Skipped: 0

[INFO] [jar:jar]
[INFO] Building jar: /home/continuum/continuum-1.1/apps/continuum/webapp/WEB-INF/working-directory/23/studio-dsml-parser/target/studio-dsml-parser-0.4.3-SNAPSHOT.jar
[INFO] [tools:verify-legal-files {execution: verify-legal-files}]
[INFO] Checking legal files in: studio-dsml-parser-0.4.3-SNAPSHOT.jar
[INFO] [install:install]
[INFO] Installing /home/continuum/continuum-1.1/apps/continuum/webapp/WEB-INF/working-directory/23/studio-dsml-parser/target/studio-dsml-parser-0.4.3-SNAPSHOT.jar to /home/continuum/.m2/repository/org/apache/directory/studio/studio-dsml-parser/0.4.3-SNAPSHOT/studio-dsml-parser-0.4.3-SNAPSHOT.jar
[INFO] [deploy:deploy]
altDeploymentRepository = id::default::scpexe://vm094.oxylos.org/var/www/html/mirror-maven2/
[INFO] Using alternate deployment repository id::default::scpexe://vm094.oxylos.org/var/www/html/mirror-maven2/
[INFO] Retrieving previous build number from id
Uploading: scpexe://vm094.oxylos.org/var/www/html/mirror-maven2//org/apache/directory/studio/studio-dsml-parser/0.4.3-SNAPSHOT/studio-dsml-parser-0.4.3-SNAPSHOT.jar
[INFO] Retrieving previous metadata from id
[INFO] Uploading repository metadata for: 'snapshot org.apache.directory.studio:studio-dsml-parser:0.4.3-SNAPSHOT'
[INFO] Uploading project information for studio-dsml-parser 0.4.3-SNAPSHOT
[INFO] Retrieving previous metadata from id
[INFO] Uploading repository metadata for: 'artifact org.apache.directory.studio:studio-dsml-parser'
[INFO] ------------------------------------------------------------------------
[INFO] Building Apache Directory Studio Jars
[INFO]    task-segment: [clean, deploy]
[INFO] ------------------------------------------------------------------------
[INFO] [clean:clean]
[INFO] Deleting directory /home/continuum/continuum-1.1/apps/continuum/webapp/WEB-INF/working-directory/23/jars/target
[INFO] [remote-resources:process {execution: default}]
[INFO] [resources:resources]
[INFO] Using default encoding to copy filtered resources.
[INFO] [studio:prepare-jar-package {execution: default}]
[INFO] Copying /home/continuum/.m2/repository/antlr/antlr/2.7.7/antlr-2.7.7.jar to
               /home/continuum/continuum-1.1/apps/continuum/webapp/WEB-INF/working-directory/23/jars/target/classes/lib/antlr-2.7.7.jar
[INFO] Copying /home/continuum/.m2/repository/commons-codec/commons-codec/1.3/commons-codec-1.3.jar to
               /home/continuum/continuum-1.1/apps/continuum/webapp/WEB-INF/working-directory/23/jars/target/classes/lib/commons-codec-1.3.jar
[INFO] Copying /home/continuum/.m2/repository/commons-collections/commons-collections/3.2/commons-collections-3.2.jar to
               /home/continuum/continuum-1.1/apps/continuum/webapp/WEB-INF/working-directory/23/jars/target/classes/lib/commons-collections-3.2.jar
[INFO] Copying /home/continuum/.m2/repository/commons-io/commons-io/1.3.1/commons-io-1.3.1.jar to
               /home/continuum/continuum-1.1/apps/continuum/webapp/WEB-INF/working-directory/23/jars/target/classes/lib/commons-io-1.3.1.jar
[INFO] Copying /home/continuum/.m2/repository/commons-lang/commons-lang/2.3/commons-lang-2.3.jar to
               /home/continuum/continuum-1.1/apps/continuum/webapp/WEB-INF/working-directory/23/jars/target/classes/lib/commons-lang-2.3.jar
[INFO] Copying /home/continuum/.m2/repository/dom4j/dom4j/1.6.1/dom4j-1.6.1.jar to
               /home/continuum/continuum-1.1/apps/continuum/webapp/WEB-INF/working-directory/23/jars/target/classes/lib/dom4j-1.6.1.jar
[INFO] Copying /home/continuum/.m2/repository/org/slf4j/nlog4j/1.2.25/nlog4j-1.2.25.jar to
               /home/continuum/continuum-1.1/apps/continuum/webapp/WEB-INF/working-directory/23/jars/target/classes/lib/nlog4j-1.2.25.jar
[INFO] Copying /home/continuum/.m2/repository/org/apache/directory/shared/shared-asn1/0.9.12-SNAPSHOT/shared-asn1-0.9.12-SNAPSHOT.jar to
               /home/continuum/continuum-1.1/apps/continuum/webapp/WEB-INF/working-directory/23/jars/target/classes/lib/shared-asn1-0.9.12-SNAPSHOT.jar
[INFO] Copying /home/continuum/.m2/repository/org/apache/directory/shared/shared-ldap/0.9.12-SNAPSHOT/shared-ldap-0.9.12-SNAPSHOT.jar to
               /home/continuum/continuum-1.1/apps/continuum/webapp/WEB-INF/working-directory/23/jars/target/classes/lib/shared-ldap-0.9.12-SNAPSHOT.jar
[INFO] Copying /home/continuum/.m2/repository/org/apache/directory/shared/shared-ldap-constants/0.9.12-SNAPSHOT/shared-ldap-constants-0.9.12-SNAPSHOT.jar to
               /home/continuum/continuum-1.1/apps/continuum/webapp/WEB-INF/working-directory/23/jars/target/classes/lib/shared-ldap-constants-0.9.12-SNAPSHOT.jar
[INFO] Copying /home/continuum/continuum-1.1/apps/continuum/webapp/WEB-INF/working-directory/23/studio-dsml-parser/target/studio-dsml-parser-0.4.3-SNAPSHOT.jar to
               /home/continuum/continuum-1.1/apps/continuum/webapp/WEB-INF/working-directory/23/jars/target/classes/lib/studio-dsml-parser-0.4.3-SNAPSHOT.jar
[INFO] Copying /home/continuum/.m2/repository/xpp3/xpp3/1.1.3.4.O/xpp3-1.1.3.4.O.jar to
               /home/continuum/continuum-1.1/apps/continuum/webapp/WEB-INF/working-directory/23/jars/target/classes/lib/xpp3-1.1.3.4.O.jar
[INFO] [compiler:compile]
[INFO] Nothing to compile - all classes are up to date
[INFO] [resources:testResources]
[INFO] Using default encoding to copy filtered resources.
[INFO] [compiler:testCompile]
[INFO] Nothing to compile - all classes are up to date
[INFO] [surefire:test]
[INFO] Tests are skipped.
[INFO] [jar:jar]
[INFO] Building jar: /home/continuum/continuum-1.1/apps/continuum/webapp/WEB-INF/working-directory/23/jars/target/jars-1.3.0.SNAPSHOT.jar
[INFO] [tools:verify-legal-files {execution: verify-legal-files}]
[INFO] Checking legal files in: jars-1.3.0.SNAPSHOT.jar
[INFO] [install:install]
[INFO] Installing /home/continuum/continuum-1.1/apps/continuum/webapp/WEB-INF/working-directory/23/jars/target/jars-1.3.0.SNAPSHOT.jar to /home/continuum/.m2/repository/org/apache/directory/studio/jars/1.3.0.SNAPSHOT/jars-1.3.0.SNAPSHOT.jar
[INFO] [deploy:deploy]
altDeploymentRepository = id::default::scpexe://vm094.oxylos.org/var/www/html/mirror-maven2/
[INFO] Using alternate deployment repository id::default::scpexe://vm094.oxylos.org/var/www/html/mirror-maven2/
[INFO] Retrieving previous build number from id
Uploading: scpexe://vm094.oxylos.org/var/www/html/mirror-maven2//org/apache/directory/studio/jars/1.3.0.SNAPSHOT/jars-1.3.0.SNAPSHOT.jar
[INFO] Uploading project information for jars 1.3.0.SNAPSHOT
[INFO] Retrieving previous metadata from id
[INFO] Uploading repository metadata for: 'snapshot org.apache.directory.studio:jars:1.3.0.SNAPSHOT'
[INFO] Retrieving previous metadata from id
[INFO] Uploading repository metadata for: 'artifact org.apache.directory.studio:jars'
[INFO] ------------------------------------------------------------------------
[INFO] Building Apache Directory Studio LDIF Parser
[INFO]    task-segment: [clean, deploy]
[INFO] ------------------------------------------------------------------------
[INFO] [clean:clean]
[INFO] Deleting directory /home/continuum/continuum-1.1/apps/continuum/webapp/WEB-INF/working-directory/23/ldif-parser/target
[INFO] [remote-resources:process {execution: default}]
[INFO] [resources:resources]
[INFO] Using default encoding to copy filtered resources.
[INFO] [studio:prepare-jar-package {execution: default}]
[INFO] [compiler:compile]
[INFO] Compiling 41 source files to /home/continuum/continuum-1.1/apps/continuum/webapp/WEB-INF/working-directory/23/ldif-parser/target/classes
[INFO] [resources:testResources]
[INFO] Using default encoding to copy filtered resources.
[INFO] [compiler:testCompile]
[INFO] Compiling 3 source files to /home/continuum/continuum-1.1/apps/continuum/webapp/WEB-INF/working-directory/23/ldif-parser/target/test-classes
[INFO] [surefire:test]
[INFO] Surefire report directory: /home/continuum/continuum-1.1/apps/continuum/webapp/WEB-INF/working-directory/23/ldif-parser/target/surefire-reports

-------------------------------------------------------
 T E S T S
-------------------------------------------------------
Running org.apache.directory.studio.ldifparser.model.lines.LdifDnLineTest
Tests run: 5, Failures: 0, Errors: 0, Skipped: 0, Time elapsed: 0.038 sec
Running org.apache.directory.studio.ldifparser.model.lines.LdifAttrValLineTest
Tests run: 5, Failures: 0, Errors: 0, Skipped: 0, Time elapsed: 0.01 sec
Running org.apache.directory.studio.ldifparser.parser.LdifParserTest
Tests run: 1, Failures: 0, Errors: 0, Skipped: 0, Time elapsed: 0.018 sec

Results :

Tests run: 11, Failures: 0, Errors: 0, Skipped: 0

[INFO] [jar:jar]
[INFO] Building jar: /home/continuum/continuum-1.1/apps/continuum/webapp/WEB-INF/working-directory/23/ldif-parser/target/ldifparser-1.3.0.SNAPSHOT.jar
[INFO] [tools:verify-legal-files {execution: verify-legal-files}]
[INFO] Checking legal files in: ldifparser-1.3.0.SNAPSHOT.jar
[INFO] [install:install]
[INFO] Installing /home/continuum/continuum-1.1/apps/continuum/webapp/WEB-INF/working-directory/23/ldif-parser/target/ldifparser-1.3.0.SNAPSHOT.jar to /home/continuum/.m2/repository/org/apache/directory/studio/ldifparser/1.3.0.SNAPSHOT/ldifparser-1.3.0.SNAPSHOT.jar
[INFO] [deploy:deploy]
altDeploymentRepository = id::default::scpexe://vm094.oxylos.org/var/www/html/mirror-maven2/
[INFO] Using alternate deployment repository id::default::scpexe://vm094.oxylos.org/var/www/html/mirror-maven2/
[INFO] Retrieving previous build number from id
Uploading: scpexe://vm094.oxylos.org/var/www/html/mirror-maven2//org/apache/directory/studio/ldifparser/1.3.0.SNAPSHOT/ldifparser-1.3.0.SNAPSHOT.jar
[INFO] Uploading project information for ldifparser 1.3.0.SNAPSHOT
[INFO] Retrieving previous metadata from id
[INFO] Uploading repository metadata for: 'snapshot org.apache.directory.studio:ldifparser:1.3.0.SNAPSHOT'
[INFO] Retrieving previous metadata from id
[INFO] Uploading repository metadata for: 'artifact org.apache.directory.studio:ldifparser'
[INFO] ------------------------------------------------------------------------
[INFO] Building Apache Directory Studio Connection Core
[INFO]    task-segment: [clean, deploy]
[INFO] ------------------------------------------------------------------------
[INFO] [clean:clean]
[INFO] Deleting directory /home/continuum/continuum-1.1/apps/continuum/webapp/WEB-INF/working-directory/23/connection-core/target
[INFO] [remote-resources:process {execution: default}]
[INFO] [resources:resources]
[INFO] Using default encoding to copy filtered resources.
[INFO] [studio:prepare-jar-package {execution: default}]
[INFO] [compiler:compile]
[INFO] Compiling 43 source files to /home/continuum/continuum-1.1/apps/continuum/webapp/WEB-INF/working-directory/23/connection-core/target/classes
[INFO] [resources:testResources]
[INFO] Using default encoding to copy filtered resources.
[INFO] [compiler:testCompile]
[INFO] Nothing to compile - all classes are up to date
[INFO] [surefire:test]
[INFO] Tests are skipped.
[INFO] [jar:jar]
[INFO] Building jar: /home/continuum/continuum-1.1/apps/continuum/webapp/WEB-INF/working-directory/23/connection-core/target/connection.core-1.3.0.SNAPSHOT.jar
[INFO] [tools:verify-legal-files {execution: verify-legal-files}]
[INFO] Checking legal files in: connection.core-1.3.0.SNAPSHOT.jar
[INFO] [install:install]
[INFO] Installing /home/continuum/continuum-1.1/apps/continuum/webapp/WEB-INF/working-directory/23/connection-core/target/connection.core-1.3.0.SNAPSHOT.jar to /home/continuum/.m2/repository/org/apache/directory/studio/connection.core/1.3.0.SNAPSHOT/connection.core-1.3.0.SNAPSHOT.jar
[INFO] [deploy:deploy]
altDeploymentRepository = id::default::scpexe://vm094.oxylos.org/var/www/html/mirror-maven2/
[INFO] Using alternate deployment repository id::default::scpexe://vm094.oxylos.org/var/www/html/mirror-maven2/
[INFO] Retrieving previous build number from id
Uploading: scpexe://vm094.oxylos.org/var/www/html/mirror-maven2//org/apache/directory/studio/connection.core/1.3.0.SNAPSHOT/connection.core-1.3.0.SNAPSHOT.jar
[INFO] Retrieving previous metadata from id
[INFO] Uploading repository metadata for: 'snapshot org.apache.directory.studio:connection.core:1.3.0.SNAPSHOT'
[INFO] Retrieving previous metadata from id
[INFO] Uploading repository metadata for: 'artifact org.apache.directory.studio:connection.core'
[INFO] Uploading project information for connection.core 1.3.0.SNAPSHOT
[INFO] ------------------------------------------------------------------------
[INFO] Building Apache Directory Studio LDAP Browser Core
[INFO]    task-segment: [clean, deploy]
[INFO] ------------------------------------------------------------------------
[INFO] [clean:clean]
[INFO] Deleting directory /home/continuum/continuum-1.1/apps/continuum/webapp/WEB-INF/working-directory/23/ldapbrowser-core/target
[INFO] [remote-resources:process {execution: default}]
[INFO] [resources:resources]
[INFO] Using default encoding to copy filtered resources.
[INFO] [studio:prepare-jar-package {execution: default}]
[INFO] Copying /home/continuum/.m2/repository/org/apache/poi/poi/3.0.1-FINAL/poi-3.0.1-FINAL.jar to
               /home/continuum/continuum-1.1/apps/continuum/webapp/WEB-INF/working-directory/23/ldapbrowser-core/target/classes/lib/poi-3.0.1-FINAL.jar
[INFO] [compiler:compile]
[INFO] Compiling 133 source files to /home/continuum/continuum-1.1/apps/continuum/webapp/WEB-INF/working-directory/23/ldapbrowser-core/target/classes
[INFO] [resources:testResources]
[INFO] Using default encoding to copy filtered resources.
[INFO] [compiler:testCompile]
[INFO] Compiling 3 source files to /home/continuum/continuum-1.1/apps/continuum/webapp/WEB-INF/working-directory/23/ldapbrowser-core/target/test-classes
[INFO] [surefire:test]
[INFO] Surefire report directory: /home/continuum/continuum-1.1/apps/continuum/webapp/WEB-INF/working-directory/23/ldapbrowser-core/target/surefire-reports

-------------------------------------------------------
 T E S T S
-------------------------------------------------------
Running org.apache.directory.studio.ldapbrowser.core.model.LdapFilterParserErrorTolerantTest
Tests run: 4, Failures: 0, Errors: 0, Skipped: 0, Time elapsed: 0.046 sec
Running org.apache.directory.studio.ldapbrowser.core.model.LdapFilterParserTest
Tests run: 25, Failures: 0, Errors: 0, Skipped: 0, Time elapsed: 0.026 sec
Running org.apache.directory.studio.ldapbrowser.core.model.PasswordTest
Tests run: 12, Failures: 0, Errors: 0, Skipped: 0, Time elapsed: 0.186 sec

Results :

Tests run: 41, Failures: 0, Errors: 0, Skipped: 0

[INFO] [jar:jar]
[INFO] Building jar: /home/continuum/continuum-1.1/apps/continuum/webapp/WEB-INF/working-directory/23/ldapbrowser-core/target/ldapbrowser.core-1.3.0.SNAPSHOT.jar
[INFO] [tools:verify-legal-files {execution: verify-legal-files}]
[INFO] Checking legal files in: ldapbrowser.core-1.3.0.SNAPSHOT.jar
[INFO] [install:install]
[INFO] Installing /home/continuum/continuum-1.1/apps/continuum/webapp/WEB-INF/working-directory/23/ldapbrowser-core/target/ldapbrowser.core-1.3.0.SNAPSHOT.jar to /home/continuum/.m2/repository/org/apache/directory/studio/ldapbrowser.core/1.3.0.SNAPSHOT/ldapbrowser.core-1.3.0.SNAPSHOT.jar
[INFO] [deploy:deploy]
altDeploymentRepository = id::default::scpexe://vm094.oxylos.org/var/www/html/mirror-maven2/
[INFO] Using alternate deployment repository id::default::scpexe://vm094.oxylos.org/var/www/html/mirror-maven2/
[INFO] Retrieving previous build number from id
Uploading: scpexe://vm094.oxylos.org/var/www/html/mirror-maven2//org/apache/directory/studio/ldapbrowser.core/1.3.0.SNAPSHOT/ldapbrowser.core-1.3.0.SNAPSHOT.jar
[INFO] Retrieving previous metadata from id
[INFO] Uploading repository metadata for: 'snapshot org.apache.directory.studio:ldapbrowser.core:1.3.0.SNAPSHOT'
[INFO] Uploading project information for ldapbrowser.core 1.3.0.SNAPSHOT
[INFO] Retrieving previous metadata from id
[INFO] Uploading repository metadata for: 'artifact org.apache.directory.studio:ldapbrowser.core'
[INFO] ------------------------------------------------------------------------
[INFO] Building Apache Directory Studio Connection UI
[INFO]    task-segment: [clean, deploy]
[INFO] ------------------------------------------------------------------------
[INFO] [clean:clean]
[INFO] Deleting directory /home/continuum/continuum-1.1/apps/continuum/webapp/WEB-INF/working-directory/23/connection-ui/target
[INFO] [remote-resources:process {execution: default}]
[INFO] [resources:resources]
[INFO] Using default encoding to copy filtered resources.
[INFO] [studio:prepare-jar-package {execution: default}]
[INFO] [compiler:compile]
[INFO] Compiling 48 source files to /home/continuum/continuum-1.1/apps/continuum/webapp/WEB-INF/working-directory/23/connection-ui/target/classes
[INFO] [resources:testResources]
[INFO] Using default encoding to copy filtered resources.
[INFO] [compiler:testCompile]
[INFO] Nothing to compile - all classes are up to date
[INFO] [surefire:test]
[INFO] Tests are skipped.
[INFO] [jar:jar]
[INFO] Building jar: /home/continuum/continuum-1.1/apps/continuum/webapp/WEB-INF/working-directory/23/connection-ui/target/connection.ui-1.3.0.SNAPSHOT.jar
[INFO] [tools:verify-legal-files {execution: verify-legal-files}]
[INFO] Checking legal files in: connection.ui-1.3.0.SNAPSHOT.jar
[INFO] [install:install]
[INFO] Installing /home/continuum/continuum-1.1/apps/continuum/webapp/WEB-INF/working-directory/23/connection-ui/target/connection.ui-1.3.0.SNAPSHOT.jar to /home/continuum/.m2/repository/org/apache/directory/studio/connection.ui/1.3.0.SNAPSHOT/connection.ui-1.3.0.SNAPSHOT.jar
[INFO] [deploy:deploy]
altDeploymentRepository = id::default::scpexe://vm094.oxylos.org/var/www/html/mirror-maven2/
[INFO] Using alternate deployment repository id::default::scpexe://vm094.oxylos.org/var/www/html/mirror-maven2/
[INFO] Retrieving previous build number from id
Uploading: scpexe://vm094.oxylos.org/var/www/html/mirror-maven2//org/apache/directory/studio/connection.ui/1.3.0.SNAPSHOT/connection.ui-1.3.0.SNAPSHOT.jar
[INFO] Uploading project information for connection.ui 1.3.0.SNAPSHOT
[INFO] Retrieving previous metadata from id
[INFO] Uploading repository metadata for: 'snapshot org.apache.directory.studio:connection.ui:1.3.0.SNAPSHOT'
[INFO] Retrieving previous metadata from id
[INFO] Uploading repository metadata for: 'artifact org.apache.directory.studio:connection.ui'
[INFO] ------------------------------------------------------------------------
[INFO] Building Apache Directory Studio LDAP Browser Common
[INFO]    task-segment: [clean, deploy]
[INFO] ------------------------------------------------------------------------
[INFO] [clean:clean]
[INFO] Deleting directory /home/continuum/continuum-1.1/apps/continuum/webapp/WEB-INF/working-directory/23/ldapbrowser-common/target
[INFO] [remote-resources:process {execution: default}]
[INFO] [resources:resources]
[INFO] Using default encoding to copy filtered resources.
[INFO] [studio:prepare-jar-package {execution: default}]
[INFO] [compiler:compile]
[INFO] Compiling 145 source files to /home/continuum/continuum-1.1/apps/continuum/webapp/WEB-INF/working-directory/23/ldapbrowser-common/target/classes
[INFO] [resources:testResources]
[INFO] Using default encoding to copy filtered resources.
[INFO] [compiler:testCompile]
[INFO] Nothing to compile - all classes are up to date
[INFO] [surefire:test]
[INFO] Tests are skipped.
[INFO] [jar:jar]
[INFO] Building jar: /home/continuum/continuum-1.1/apps/continuum/webapp/WEB-INF/working-directory/23/ldapbrowser-common/target/ldapbrowser.common-1.3.0.SNAPSHOT.jar
[INFO] [tools:verify-legal-files {execution: verify-legal-files}]
[INFO] Checking legal files in: ldapbrowser.common-1.3.0.SNAPSHOT.jar
[INFO] [install:install]
[INFO] Installing /home/continuum/continuum-1.1/apps/continuum/webapp/WEB-INF/working-directory/23/ldapbrowser-common/target/ldapbrowser.common-1.3.0.SNAPSHOT.jar to /home/continuum/.m2/repository/org/apache/directory/studio/ldapbrowser.common/1.3.0.SNAPSHOT/ldapbrowser.common-1.3.0.SNAPSHOT.jar
[INFO] [deploy:deploy]
altDeploymentRepository = id::default::scpexe://vm094.oxylos.org/var/www/html/mirror-maven2/
[INFO] Using alternate deployment repository id::default::scpexe://vm094.oxylos.org/var/www/html/mirror-maven2/
[INFO] Retrieving previous build number from id
Uploading: scpexe://vm094.oxylos.org/var/www/html/mirror-maven2//org/apache/directory/studio/ldapbrowser.common/1.3.0.SNAPSHOT/ldapbrowser.common-1.3.0.SNAPSHOT.jar
[INFO] Uploading project information for ldapbrowser.common 1.3.0.SNAPSHOT
[INFO] Retrieving previous metadata from id
[INFO] Uploading repository metadata for: 'artifact org.apache.directory.studio:ldapbrowser.common'
[INFO] Retrieving previous metadata from id
[INFO] Uploading repository metadata for: 'snapshot org.apache.directory.studio:ldapbrowser.common:1.3.0.SNAPSHOT'
[INFO] ------------------------------------------------------------------------
[INFO] Building Apache Directory Studio Value Editors
[INFO]    task-segment: [clean, deploy]
[INFO] ------------------------------------------------------------------------
[INFO] [clean:clean]
[INFO] Deleting directory /home/continuum/continuum-1.1/apps/continuum/webapp/WEB-INF/working-directory/23/valueeditors/target
[INFO] [remote-resources:process {execution: default}]
[INFO] [resources:resources]
[INFO] Using default encoding to copy filtered resources.
[INFO] [studio:prepare-jar-package {execution: default}]
[INFO] [compiler:compile]
[INFO] Compiling 17 source files to /home/continuum/continuum-1.1/apps/continuum/webapp/WEB-INF/working-directory/23/valueeditors/target/classes
[INFO] [resources:testResources]
[INFO] Using default encoding to copy filtered resources.
[INFO] [compiler:testCompile]
[INFO] Nothing to compile - all classes are up to date
[INFO] [surefire:test]
[INFO] Tests are skipped.
[INFO] [jar:jar]
[INFO] Building jar: /home/continuum/continuum-1.1/apps/continuum/webapp/WEB-INF/working-directory/23/valueeditors/target/valueeditors-1.3.0.SNAPSHOT.jar
[INFO] [tools:verify-legal-files {execution: verify-legal-files}]
[INFO] Checking legal files in: valueeditors-1.3.0.SNAPSHOT.jar
[INFO] [install:install]
[INFO] Installing /home/continuum/continuum-1.1/apps/continuum/webapp/WEB-INF/working-directory/23/valueeditors/target/valueeditors-1.3.0.SNAPSHOT.jar to /home/continuum/.m2/repository/org/apache/directory/studio/valueeditors/1.3.0.SNAPSHOT/valueeditors-1.3.0.SNAPSHOT.jar
[INFO] [deploy:deploy]
altDeploymentRepository = id::default::scpexe://vm094.oxylos.org/var/www/html/mirror-maven2/
[INFO] Using alternate deployment repository id::default::scpexe://vm094.oxylos.org/var/www/html/mirror-maven2/
[INFO] Retrieving previous build number from id
Uploading: scpexe://vm094.oxylos.org/var/www/html/mirror-maven2//org/apache/directory/studio/valueeditors/1.3.0.SNAPSHOT/valueeditors-1.3.0.SNAPSHOT.jar
[INFO] Uploading project information for valueeditors 1.3.0.SNAPSHOT
[INFO] Retrieving previous metadata from id
[INFO] Uploading repository metadata for: 'artifact org.apache.directory.studio:valueeditors'
[INFO] Retrieving previous metadata from id
[INFO] Uploading repository metadata for: 'snapshot org.apache.directory.studio:valueeditors:1.3.0.SNAPSHOT'
[INFO] ------------------------------------------------------------------------
[INFO] Building Apache Directory Studio ACI Item Editor
[INFO]    task-segment: [clean, deploy]
[INFO] ------------------------------------------------------------------------
[INFO] [clean:clean]
[INFO] Deleting directory /home/continuum/continuum-1.1/apps/continuum/webapp/WEB-INF/working-directory/23/aciitemeditor/target
[INFO] [remote-resources:process {execution: default}]
[INFO] [resources:resources]
[INFO] Using default encoding to copy filtered resources.
[INFO] [studio:prepare-jar-package {execution: default}]
[INFO] [compiler:compile]
[INFO] Compiling 49 source files to /home/continuum/continuum-1.1/apps/continuum/webapp/WEB-INF/working-directory/23/aciitemeditor/target/classes
[INFO] [resources:testResources]
[INFO] Using default encoding to copy filtered resources.
[INFO] [compiler:testCompile]
[INFO] Nothing to compile - all classes are up to date
[INFO] [surefire:test]
[INFO] Tests are skipped.
[INFO] [jar:jar]
[INFO] Building jar: /home/continuum/continuum-1.1/apps/continuum/webapp/WEB-INF/working-directory/23/aciitemeditor/target/aciitemeditor-1.3.0.SNAPSHOT.jar
[INFO] [tools:verify-legal-files {execution: verify-legal-files}]
[INFO] Checking legal files in: aciitemeditor-1.3.0.SNAPSHOT.jar
[INFO] [install:install]
[INFO] Installing /home/continuum/continuum-1.1/apps/continuum/webapp/WEB-INF/working-directory/23/aciitemeditor/target/aciitemeditor-1.3.0.SNAPSHOT.jar to /home/continuum/.m2/repository/org/apache/directory/studio/aciitemeditor/1.3.0.SNAPSHOT/aciitemeditor-1.3.0.SNAPSHOT.jar
[INFO] [deploy:deploy]
altDeploymentRepository = id::default::scpexe://vm094.oxylos.org/var/www/html/mirror-maven2/
[INFO] Using alternate deployment repository id::default::scpexe://vm094.oxylos.org/var/www/html/mirror-maven2/
[INFO] Retrieving previous build number from id
Uploading: scpexe://vm094.oxylos.org/var/www/html/mirror-maven2//org/apache/directory/studio/aciitemeditor/1.3.0.SNAPSHOT/aciitemeditor-1.3.0.SNAPSHOT.jar
[INFO] Retrieving previous metadata from id
[INFO] Uploading repository metadata for: 'snapshot org.apache.directory.studio:aciitemeditor:1.3.0.SNAPSHOT'
[INFO] Retrieving previous metadata from id
[INFO] Uploading repository metadata for: 'artifact org.apache.directory.studio:aciitemeditor'
[INFO] Uploading project information for aciitemeditor 1.3.0.SNAPSHOT
[INFO] ------------------------------------------------------------------------
[INFO] Building Apache Directory Studio Schema Editor
[INFO]    task-segment: [clean, deploy]
[INFO] ------------------------------------------------------------------------
[INFO] [clean:clean]
[INFO] Deleting directory /home/continuum/continuum-1.1/apps/continuum/webapp/WEB-INF/working-directory/23/schemaeditor/target
[INFO] [remote-resources:process {execution: default}]
[INFO] [resources:resources]
[INFO] Using default encoding to copy filtered resources.
[INFO] [studio:prepare-jar-package {execution: default}]
[INFO] Copying /home/continuum/.m2/repository/org/apache/directory/shared/shared-converter/0.9.12-SNAPSHOT/shared-converter-0.9.12-SNAPSHOT.jar to
               /home/continuum/continuum-1.1/apps/continuum/webapp/WEB-INF/working-directory/23/schemaeditor/target/classes/lib/shared-converter-0.9.12-SNAPSHOT.jar
[INFO] [compiler:compile]
[INFO] Compiling 280 source files to /home/continuum/continuum-1.1/apps/continuum/webapp/WEB-INF/working-directory/23/schemaeditor/target/classes
[INFO] [resources:testResources]
[INFO] Using default encoding to copy filtered resources.
[INFO] [compiler:testCompile]
[INFO] Compiling 2 source files to /home/continuum/continuum-1.1/apps/continuum/webapp/WEB-INF/working-directory/23/schemaeditor/target/test-classes
[INFO] [surefire:test]
[INFO] Surefire report directory: /home/continuum/continuum-1.1/apps/continuum/webapp/WEB-INF/working-directory/23/schemaeditor/target/surefire-reports

-------------------------------------------------------
 T E S T S
-------------------------------------------------------
Running org.apache.directory.studio.schemaeditor.model.difference.DifferenceEngineTest
Tests run: 35, Failures: 0, Errors: 0, Skipped: 0, Time elapsed: 0.064 sec
Running org.apache.directory.studio.schemaeditor.model.alias.AliasesStringParserTest
Tests run: 13, Failures: 0, Errors: 0, Skipped: 0, Time elapsed: 0.017 sec

Results :

Tests run: 48, Failures: 0, Errors: 0, Skipped: 0

[INFO] [jar:jar]
[INFO] Building jar: /home/continuum/continuum-1.1/apps/continuum/webapp/WEB-INF/working-directory/23/schemaeditor/target/schemaeditor-1.3.0.SNAPSHOT.jar
[INFO] [tools:verify-legal-files {execution: verify-legal-files}]
[INFO] Checking legal files in: schemaeditor-1.3.0.SNAPSHOT.jar
[INFO] [install:install]
[INFO] Installing /home/continuum/continuum-1.1/apps/continuum/webapp/WEB-INF/working-directory/23/schemaeditor/target/schemaeditor-1.3.0.SNAPSHOT.jar to /home/continuum/.m2/repository/org/apache/directory/studio/schemaeditor/1.3.0.SNAPSHOT/schemaeditor-1.3.0.SNAPSHOT.jar
[INFO] [deploy:deploy]
altDeploymentRepository = id::default::scpexe://vm094.oxylos.org/var/www/html/mirror-maven2/
[INFO] Using alternate deployment repository id::default::scpexe://vm094.oxylos.org/var/www/html/mirror-maven2/
[INFO] Retrieving previous build number from id
Uploading: scpexe://vm094.oxylos.org/var/www/html/mirror-maven2//org/apache/directory/studio/schemaeditor/1.3.0.SNAPSHOT/schemaeditor-1.3.0.SNAPSHOT.jar
[INFO] Retrieving previous metadata from id
[INFO] Uploading repository metadata for: 'snapshot org.apache.directory.studio:schemaeditor:1.3.0.SNAPSHOT'
[INFO] Uploading project information for schemaeditor 1.3.0.SNAPSHOT
[INFO] Retrieving previous metadata from id
[INFO] Uploading repository metadata for: 'artifact org.apache.directory.studio:schemaeditor'
[INFO] ------------------------------------------------------------------------
[INFO] Building Apache Directory Studio Schema Editor Feature
[INFO]    task-segment: [clean, deploy]
[INFO] ------------------------------------------------------------------------
[INFO] [clean:clean]
[INFO] Deleting directory /home/continuum/continuum-1.1/apps/continuum/webapp/WEB-INF/working-directory/23/schemaeditor-feature/target
[INFO] [remote-resources:process {execution: default}]
[INFO] [resources:resources]
[INFO] Using default encoding to copy filtered resources.
[INFO] [compiler:compile]
[INFO] No sources to compile
[INFO] [resources:testResources]
[INFO] Using default encoding to copy filtered resources.
[INFO] [compiler:testCompile]
[INFO] No sources to compile
[INFO] [surefire:test]
[INFO] Tests are skipped.
[INFO] [jar:jar]
[INFO] Building jar: /home/continuum/continuum-1.1/apps/continuum/webapp/WEB-INF/working-directory/23/schemaeditor-feature/target/schemaeditor.feature-1.3.0.SNAPSHOT.jar
[INFO] [resources:resources {execution: default}]
[INFO] Using default encoding to copy filtered resources.
[INFO] [tools:verify-legal-files {execution: verify-legal-files}]
[INFO] Checking legal files in: schemaeditor.feature-1.3.0.SNAPSHOT.jar
[INFO] [install:install]
[INFO] Installing /home/continuum/continuum-1.1/apps/continuum/webapp/WEB-INF/working-directory/23/schemaeditor-feature/target/schemaeditor.feature-1.3.0.SNAPSHOT.jar to /home/continuum/.m2/repository/org/apache/directory/studio/schemaeditor.feature/1.3.0.SNAPSHOT/schemaeditor.feature-1.3.0.SNAPSHOT.jar
[INFO] [deploy:deploy]
altDeploymentRepository = id::default::scpexe://vm094.oxylos.org/var/www/html/mirror-maven2/
[INFO] Using alternate deployment repository id::default::scpexe://vm094.oxylos.org/var/www/html/mirror-maven2/
[INFO] Retrieving previous build number from id
Uploading: scpexe://vm094.oxylos.org/var/www/html/mirror-maven2//org/apache/directory/studio/schemaeditor.feature/1.3.0.SNAPSHOT/schemaeditor.feature-1.3.0.SNAPSHOT.jar
[INFO] Retrieving previous metadata from id
[INFO] Uploading repository metadata for: 'snapshot org.apache.directory.studio:schemaeditor.feature:1.3.0.SNAPSHOT'
[INFO] Retrieving previous metadata from id
[INFO] Uploading repository metadata for: 'artifact org.apache.directory.studio:schemaeditor.feature'
[INFO] Uploading project information for schemaeditor.feature 1.3.0.SNAPSHOT
[INFO] ------------------------------------------------------------------------
[INFO] Building Apache Directory Studio Schema Editor Help
[INFO]    task-segment: [clean, deploy]
[INFO] ------------------------------------------------------------------------
[INFO] [clean:clean]
[INFO] Deleting directory /home/continuum/continuum-1.1/apps/continuum/webapp/WEB-INF/working-directory/23/schemaeditor-help/target
[INFO] [remote-resources:process {execution: default}]
[INFO] [resources:resources]
[INFO] Using default encoding to copy filtered resources.
[INFO] [dependency:unpack {execution: unpack-docbook-dependencies}]
[INFO] Configured Artifact: docbook:docbook-xml:?:zip
[INFO] Configured Artifact: docbook:docbook-xsl:?:zip
[INFO] Unpacking /home/continuum/.m2/repository/docbook/docbook-xml/4.5/docbook-xml-4.5.zipto
 /home/continuum/continuum-1.1/apps/continuum/webapp/WEB-INF/working-directory/23/schemaeditor-help/target/docbook/docbook-xml
with Includes null and excludes:null
[INFO] Unpacking /home/continuum/.m2/repository/docbook/docbook-xsl/1.71.1/docbook-xsl-1.71.1.zipto
 /home/continuum/continuum-1.1/apps/continuum/webapp/WEB-INF/working-directory/23/schemaeditor-help/target/docbook
with Includes null and excludes:null
[INFO] [compiler:compile]
[INFO] No sources to compile
[INFO] [antrun:run {execution: build-eclipse-help}]
[INFO] Executing tasks
     [move] Moving 1057 files to /home/continuum/continuum-1.1/apps/continuum/webapp/WEB-INF/working-directory/23/schemaeditor-help/target/docbook
     [xslt] Processing /home/continuum/continuum-1.1/apps/continuum/webapp/WEB-INF/working-directory/23/schemaeditor-help/target/docbook/documents/0_index.xml to /home/continuum/continuum-1.1/apps/continuum/webapp/WEB-INF/working-directory/23/schemaeditor-help/target/classes/index.html
     [xslt] Loading stylesheet /home/continuum/continuum-1.1/apps/continuum/webapp/WEB-INF/working-directory/23/schemaeditor-help/target/docbook/docbook-xsl/eclipse/eclipse.xsl
     [xslt] file:/home/continuum/continuum-1.1/apps/continuum/webapp/WEB-INF/working-directory/23/schemaeditor-help/target/docbook/docbook-xsl/html/chunker.xsl:98:18: Warning! Writing html/gettingstarted_download_install.html for section(gettingstarted_download_install)
     [xslt] file:/home/continuum/continuum-1.1/apps/continuum/webapp/WEB-INF/working-directory/23/schemaeditor-help/target/docbook/docbook-xsl/html/chunker.xsl:98:18: Warning! Writing html/gettingstarted_views_hierarchy.html for section(gettingstarted_views_hierarchy)
     [xslt] file:/home/continuum/continuum-1.1/apps/continuum/webapp/WEB-INF/working-directory/23/schemaeditor-help/target/docbook/docbook-xsl/html/chunker.xsl:98:18: Warning! Writing html/gettingstarted_views_problems.html for section(gettingstarted_views_problems)
     [xslt] file:/home/continuum/continuum-1.1/apps/continuum/webapp/WEB-INF/working-directory/23/schemaeditor-help/target/docbook/docbook-xsl/html/chunker.xsl:98:18: Warning! Writing html/gettingstarted_views_projects.html for section(gettingstarted_views_projects)
     [xslt] file:/home/continuum/continuum-1.1/apps/continuum/webapp/WEB-INF/working-directory/23/schemaeditor-help/target/docbook/docbook-xsl/html/chunker.xsl:98:18: Warning! Writing html/gettingstarted_views_schema.html for section(gettingstarted_views_schema)
     [xslt] file:/home/continuum/continuum-1.1/apps/continuum/webapp/WEB-INF/working-directory/23/schemaeditor-help/target/docbook/docbook-xsl/html/chunker.xsl:98:18: Warning! Writing html/gettingstarted_views_search.html for section(gettingstarted_views_search)
     [xslt] file:/home/continuum/continuum-1.1/apps/continuum/webapp/WEB-INF/working-directory/23/schemaeditor-help/target/docbook/docbook-xsl/html/chunker.xsl:98:18: Warning! Writing html/gettingstarted_views.html for section(gettingstarted_views)
     [xslt] file:/home/continuum/continuum-1.1/apps/continuum/webapp/WEB-INF/working-directory/23/schemaeditor-help/target/docbook/docbook-xsl/html/chunker.xsl:98:18: Warning! Writing html/gettingstarted_editors_attribute_type.html for section(gettingstarted_editors_attribute_type)
     [xslt] file:/home/continuum/continuum-1.1/apps/continuum/webapp/WEB-INF/working-directory/23/schemaeditor-help/target/docbook/docbook-xsl/html/chunker.xsl:98:18: Warning! Writing html/gettingstarted_editors_object_class.html for section(gettingstarted_editors_object_class)
     [xslt] file:/home/continuum/continuum-1.1/apps/continuum/webapp/WEB-INF/working-directory/23/schemaeditor-help/target/docbook/docbook-xsl/html/chunker.xsl:98:18: Warning! Writing html/gettingstarted_editors_schema.html for section(gettingstarted_editors_schema)
     [xslt] file:/home/continuum/continuum-1.1/apps/continuum/webapp/WEB-INF/working-directory/23/schemaeditor-help/target/docbook/docbook-xsl/html/chunker.xsl:98:18: Warning! Writing html/gettingstarted_editors.html for section(gettingstarted_editors)
     [xslt] file:/home/continuum/continuum-1.1/apps/continuum/webapp/WEB-INF/working-directory/23/schemaeditor-help/target/docbook/docbook-xsl/html/chunker.xsl:98:18: Warning! Writing html/gettingstarted.html for chapter(gettingstarted)
     [xslt] file:/home/continuum/continuum-1.1/apps/continuum/webapp/WEB-INF/working-directory/23/schemaeditor-help/target/docbook/docbook-xsl/html/html.xsl:148:18: Warning! ID recommended on simplesect: Page 1
     [xslt] file:/home/continuum/continuum-1.1/apps/continuum/webapp/WEB-INF/working-directory/23/schemaeditor-help/target/docbook/docbook-xsl/html/html.xsl:148:18: Warning! ID recommended on simplesect: Page 2
     [xslt] file:/home/continuum/continuum-1.1/apps/continuum/webapp/WEB-INF/working-directory/23/schemaeditor-help/target/docbook/docbook-xsl/html/chunker.xsl:98:18: Warning! Writing html/tasks_creating_new_project.html for section(tasks_creating_new_project)
     [xslt] file:/home/continuum/continuum-1.1/apps/continuum/webapp/WEB-INF/working-directory/23/schemaeditor-help/target/docbook/docbook-xsl/html/chunker.xsl:98:18: Warning! Writing html/tasks_importing_projects.html for section(tasks_importing_projects)
     [xslt] file:/home/continuum/continuum-1.1/apps/continuum/webapp/WEB-INF/working-directory/23/schemaeditor-help/target/docbook/docbook-xsl/html/chunker.xsl:98:18: Warning! Writing html/tasks_exporting_projects.html for section(tasks_exporting_projects)
     [xslt] file:/home/continuum/continuum-1.1/apps/continuum/webapp/WEB-INF/working-directory/23/schemaeditor-help/target/docbook/docbook-xsl/html/chunker.xsl:98:18: Warning! Writing html/tasks_creating_new_schema.html for section(tasks_creating_new_schema)
     [xslt] file:/home/continuum/continuum-1.1/apps/continuum/webapp/WEB-INF/working-directory/23/schemaeditor-help/target/docbook/docbook-xsl/html/chunker.xsl:98:18: Warning! Writing html/tasks_importing_schemas_from_xml_files.html for section(tasks_importing_schemas_from_xml_files)
     [xslt] file:/home/continuum/continuum-1.1/apps/continuum/webapp/WEB-INF/working-directory/23/schemaeditor-help/target/docbook/docbook-xsl/html/chunker.xsl:98:18: Warning! Writing html/tasks_importing_schemas_from_openldap_files.html for section(tasks_importing_schemas_from_openldap_files)
     [xslt] file:/home/continuum/continuum-1.1/apps/continuum/webapp/WEB-INF/working-directory/23/schemaeditor-help/target/docbook/docbook-xsl/html/chunker.xsl:98:18: Warning! Writing html/tasks_importing_core_schemas_files.html for section(tasks_importing_core_schemas_files)
     [xslt] file:/home/continuum/continuum-1.1/apps/continuum/webapp/WEB-INF/working-directory/23/schemaeditor-help/target/docbook/docbook-xsl/html/chunker.xsl:98:18: Warning! Writing html/tasks_importing_schemas.html for section(tasks_importing_schemas)
     [xslt] file:/home/continuum/continuum-1.1/apps/continuum/webapp/WEB-INF/working-directory/23/schemaeditor-help/target/docbook/docbook-xsl/html/chunker.xsl:98:18: Warning! Writing html/tasks_exporting_schemas_as_xml_files.html for section(tasks_exporting_schemas_as_xml_files)
     [xslt] file:/home/continuum/continuum-1.1/apps/continuum/webapp/WEB-INF/working-directory/23/schemaeditor-help/target/docbook/docbook-xsl/html/chunker.xsl:98:18: Warning! Writing html/tasks_exporting_schemas_as_openldap_files.html for section(tasks_exporting_schemas_as_openldap_files)
     [xslt] file:/home/continuum/continuum-1.1/apps/continuum/webapp/WEB-INF/working-directory/23/schemaeditor-help/target/docbook/docbook-xsl/html/chunker.xsl:98:18: Warning! Writing html/tasks_exporting_schemas_for_apache_ds.html for section(tasks_exporting_schemas_for_apache_ds)
     [xslt] file:/home/continuum/continuum-1.1/apps/continuum/webapp/WEB-INF/working-directory/23/schemaeditor-help/target/docbook/docbook-xsl/html/chunker.xsl:98:18: Warning! Writing html/tasks_exporting_schemas.html for section(tasks_exporting_schemas)
     [xslt] file:/home/continuum/continuum-1.1/apps/continuum/webapp/WEB-INF/working-directory/23/schemaeditor-help/target/docbook/docbook-xsl/html/html.xsl:148:18: Warning! ID recommended on simplesect: Page 1
     [xslt] file:/home/continuum/continuum-1.1/apps/continuum/webapp/WEB-INF/working-directory/23/schemaeditor-help/target/docbook/docbook-xsl/html/html.xsl:148:18: Warning! ID recommended on simplesect: Page 2
     [xslt] file:/home/continuum/continuum-1.1/apps/continuum/webapp/WEB-INF/working-directory/23/schemaeditor-help/target/docbook/docbook-xsl/html/html.xsl:148:18: Warning! ID recommended on simplesect: Page 3
     [xslt] file:/home/continuum/continuum-1.1/apps/continuum/webapp/WEB-INF/working-directory/23/schemaeditor-help/target/docbook/docbook-xsl/html/chunker.xsl:98:18: Warning! Writing html/tasks_creating_new_attribute_type.html for section(tasks_creating_new_attribute_type)
     [xslt] file:/home/continuum/continuum-1.1/apps/continuum/webapp/WEB-INF/working-directory/23/schemaeditor-help/target/docbook/docbook-xsl/html/html.xsl:148:18: Warning! ID recommended on simplesect: Page 1
     [xslt] file:/home/continuum/continuum-1.1/apps/continuum/webapp/WEB-INF/working-directory/23/schemaeditor-help/target/docbook/docbook-xsl/html/html.xsl:148:18: Warning! ID recommended on simplesect: Page 2
     [xslt] file:/home/continuum/continuum-1.1/apps/continuum/webapp/WEB-INF/working-directory/23/schemaeditor-help/target/docbook/docbook-xsl/html/html.xsl:148:18: Warning! ID recommended on simplesect: Page 3
     [xslt] file:/home/continuum/continuum-1.1/apps/continuum/webapp/WEB-INF/working-directory/23/schemaeditor-help/target/docbook/docbook-xsl/html/html.xsl:148:18: Warning! ID recommended on simplesect: Page 4
     [xslt] file:/home/continuum/continuum-1.1/apps/continuum/webapp/WEB-INF/working-directory/23/schemaeditor-help/target/docbook/docbook-xsl/html/chunker.xsl:98:18: Warning! Writing html/tasks_creating_new_object_class.html for section(tasks_creating_new_object_class)
     [xslt] file:/home/continuum/continuum-1.1/apps/continuum/webapp/WEB-INF/working-directory/23/schemaeditor-help/target/docbook/docbook-xsl/html/chunker.xsl:98:18: Warning! Writing html/tasks.html for chapter(tasks)
     [xslt] file:/home/continuum/continuum-1.1/apps/continuum/webapp/WEB-INF/working-directory/23/schemaeditor-help/target/docbook/docbook-xsl/html/chunker.xsl:98:18: Warning! Writing html/reference_hierarchy_view_preferences.html for section(reference_hierarchy_view_preferences)
     [xslt] file:/home/continuum/continuum-1.1/apps/continuum/webapp/WEB-INF/working-directory/23/schemaeditor-help/target/docbook/docbook-xsl/html/chunker.xsl:98:18: Warning! Writing html/reference_schema_view_preferences.html for section(reference_schema_view_preferences)
     [xslt] file:/home/continuum/continuum-1.1/apps/continuum/webapp/WEB-INF/working-directory/23/schemaeditor-help/target/docbook/docbook-xsl/html/chunker.xsl:98:18: Warning! Writing html/reference_search_view_preferences.html for section(reference_search_view_preferences)
     [xslt] file:/home/continuum/continuum-1.1/apps/continuum/webapp/WEB-INF/working-directory/23/schemaeditor-help/target/docbook/docbook-xsl/html/chunker.xsl:98:18: Warning! Writing html/reference_preferences.html for section(reference_preferences)
     [xslt] file:/home/continuum/continuum-1.1/apps/continuum/webapp/WEB-INF/working-directory/23/schemaeditor-help/target/docbook/docbook-xsl/html/chunker.xsl:98:18: Warning! Writing html/reference.html for chapter(reference)
     [xslt] file:/home/continuum/continuum-1.1/apps/continuum/webapp/WEB-INF/working-directory/23/schemaeditor-help/target/docbook/docbook-xsl/html/html.xsl:148:18: Warning! ID recommended on simplesect: What's new in 1.2.0
     [xslt] file:/home/continuum/continuum-1.1/apps/continuum/webapp/WEB-INF/working-directory/23/schemaeditor-help/target/docbook/docbook-xsl/html/html.xsl:148:18: Warning! ID recommended on simplesect: What's new in 1.1.0
     [xslt] file:/home/continuum/continuum-1.1/apps/continuum/webapp/WEB-INF/working-directory/23/schemaeditor-help/target/docbook/docbook-xsl/html/chunker.xsl:98:18: Warning! Writing html/whats_new.html for chapter(whats_new)
     [xslt] file:/home/continuum/continuum-1.1/apps/continuum/webapp/WEB-INF/working-directory/23/schemaeditor-help/target/docbook/docbook-xsl/html/html.xsl:148:18: Warning! ID recommended on simplesect: Apache Directory Studio 1.2.0 - (2008, a...
     [xslt] file:/home/continuum/continuum-1.1/apps/continuum/webapp/WEB-INF/working-directory/23/schemaeditor-help/target/docbook/docbook-xsl/html/html.xsl:148:18: Warning! ID recommended on simplesect: Apache Directory Studio 1.1.0 - (2008, m...
     [xslt] file:/home/continuum/continuum-1.1/apps/continuum/webapp/WEB-INF/working-directory/23/schemaeditor-help/target/docbook/docbook-xsl/html/html.xsl:148:18: Warning! ID recommended on simplesect: Apache Directory Studio 1.0.1 - (2007, s...
     [xslt] file:/home/continuum/continuum-1.1/apps/continuum/webapp/WEB-INF/working-directory/23/schemaeditor-help/target/docbook/docbook-xsl/html/html.xsl:148:18: Warning! ID recommended on simplesect: Apache Directory Studio 1.0.0 - (2007, s...
     [xslt] file:/home/continuum/continuum-1.1/apps/continuum/webapp/WEB-INF/working-directory/23/schemaeditor-help/target/docbook/docbook-xsl/html/chunker.xsl:98:18: Warning! Writing html/release_notes.html for chapter(release_notes)
     [xslt] file:/home/continuum/continuum-1.1/apps/continuum/webapp/WEB-INF/working-directory/23/schemaeditor-help/target/docbook/docbook-xsl/html/chunker.xsl:98:18: Warning! Writing html/index.html for book
     [xslt] file:/home/continuum/continuum-1.1/apps/continuum/webapp/WEB-INF/working-directory/23/schemaeditor-help/target/docbook/docbook-xsl/html/chunker.xsl:98:18: Warning! Writing toc.xml
     [xslt] file:/home/continuum/continuum-1.1/apps/continuum/webapp/WEB-INF/working-directory/23/schemaeditor-help/target/docbook/docbook-xsl/html/chunker.xsl:98:18: Warning! Writing plugin.xml
[INFO] Executed tasks
[INFO] [resources:testResources]
[INFO] Using default encoding to copy filtered resources.
[INFO] [compiler:testCompile]
[INFO] No sources to compile
[INFO] [surefire:test]
[INFO] Tests are skipped.
[INFO] [jar:jar]
[INFO] Building jar: /home/continuum/continuum-1.1/apps/continuum/webapp/WEB-INF/working-directory/23/schemaeditor-help/target/schemaeditor.help-1.3.0.SNAPSHOT.jar
[INFO] [tools:verify-legal-files {execution: verify-legal-files}]
[INFO] Checking legal files in: schemaeditor.help-1.3.0.SNAPSHOT.jar
[INFO] [install:install]
[INFO] Installing /home/continuum/continuum-1.1/apps/continuum/webapp/WEB-INF/working-directory/23/schemaeditor-help/target/schemaeditor.help-1.3.0.SNAPSHOT.jar to /home/continuum/.m2/repository/org/apache/directory/studio/schemaeditor.help/1.3.0.SNAPSHOT/schemaeditor.help-1.3.0.SNAPSHOT.jar
[INFO] [deploy:deploy]
altDeploymentRepository = id::default::scpexe://vm094.oxylos.org/var/www/html/mirror-maven2/
[INFO] Using alternate deployment repository id::default::scpexe://vm094.oxylos.org/var/www/html/mirror-maven2/
[INFO] Retrieving previous build number from id
Uploading: scpexe://vm094.oxylos.org/var/www/html/mirror-maven2//org/apache/directory/studio/schemaeditor.help/1.3.0.SNAPSHOT/schemaeditor.help-1.3.0.SNAPSHOT.jar
[INFO] Retrieving previous metadata from id
[INFO] Uploading repository metadata for: 'artifact org.apache.directory.studio:schemaeditor.help'
[INFO] Uploading project information for schemaeditor.help 1.3.0.SNAPSHOT
[INFO] Retrieving previous metadata from id
[INFO] Uploading repository metadata for: 'snapshot org.apache.directory.studio:schemaeditor.help:1.3.0.SNAPSHOT'
[INFO] ------------------------------------------------------------------------
[INFO] Building Apache Directory Studio RCP
[INFO]    task-segment: [clean, deploy]
[INFO] ------------------------------------------------------------------------
[INFO] [clean:clean]
[INFO] Deleting directory /home/continuum/continuum-1.1/apps/continuum/webapp/WEB-INF/working-directory/23/rcp/target
[INFO] [remote-resources:process {execution: default}]
[INFO] [resources:resources]
[INFO] Using default encoding to copy filtered resources.
[INFO] [studio:prepare-jar-package {execution: default}]
[INFO] Copying /home/continuum/.m2/repository/org/slf4j/nlog4j/1.2.25/nlog4j-1.2.25.jar to
               /home/continuum/continuum-1.1/apps/continuum/webapp/WEB-INF/working-directory/23/rcp/target/classes/lib/nlog4j-1.2.25.jar
[INFO] [compiler:compile]
[INFO] Compiling 13 source files to /home/continuum/continuum-1.1/apps/continuum/webapp/WEB-INF/working-directory/23/rcp/target/classes
[INFO] [resources:testResources]
[INFO] Using default encoding to copy filtered resources.
[INFO] [compiler:testCompile]
[INFO] Nothing to compile - all classes are up to date
[INFO] [surefire:test]
[INFO] Tests are skipped.
[INFO] [jar:jar]
[INFO] Building jar: /home/continuum/continuum-1.1/apps/continuum/webapp/WEB-INF/working-directory/23/rcp/target/rcp-1.3.0.SNAPSHOT.jar
[INFO] [tools:verify-legal-files {execution: verify-legal-files}]
[INFO] Checking legal files in: rcp-1.3.0.SNAPSHOT.jar
[INFO] [install:install]
[INFO] Installing /home/continuum/continuum-1.1/apps/continuum/webapp/WEB-INF/working-directory/23/rcp/target/rcp-1.3.0.SNAPSHOT.jar to /home/continuum/.m2/repository/org/apache/directory/studio/rcp/1.3.0.SNAPSHOT/rcp-1.3.0.SNAPSHOT.jar
[INFO] [deploy:deploy]
altDeploymentRepository = id::default::scpexe://vm094.oxylos.org/var/www/html/mirror-maven2/
[INFO] Using alternate deployment repository id::default::scpexe://vm094.oxylos.org/var/www/html/mirror-maven2/
[INFO] Retrieving previous build number from id
Uploading: scpexe://vm094.oxylos.org/var/www/html/mirror-maven2//org/apache/directory/studio/rcp/1.3.0.SNAPSHOT/rcp-1.3.0.SNAPSHOT.jar
[INFO] Retrieving previous metadata from id
[INFO] Uploading repository metadata for: 'snapshot org.apache.directory.studio:rcp:1.3.0.SNAPSHOT'
[INFO] Uploading project information for rcp 1.3.0.SNAPSHOT
[INFO] Retrieving previous metadata from id
[INFO] Uploading repository metadata for: 'artifact org.apache.directory.studio:rcp'
[INFO] ------------------------------------------------------------------------
[INFO] Building Apache Directory Studio RCP Feature
[INFO]    task-segment: [clean, deploy]
[INFO] ------------------------------------------------------------------------
[INFO] [clean:clean]
[INFO] Deleting directory /home/continuum/continuum-1.1/apps/continuum/webapp/WEB-INF/working-directory/23/rcp-feature/target
[INFO] [remote-resources:process {execution: default}]
[INFO] [resources:resources]
[INFO] Using default encoding to copy filtered resources.
[INFO] [compiler:compile]
[INFO] No sources to compile
[INFO] [resources:testResources]
[INFO] Using default encoding to copy filtered resources.
[INFO] [compiler:testCompile]
[INFO] No sources to compile
[INFO] [surefire:test]
[INFO] Tests are skipped.
[INFO] [jar:jar]
[INFO] Building jar: /home/continuum/continuum-1.1/apps/continuum/webapp/WEB-INF/working-directory/23/rcp-feature/target/rcp.feature-1.3.0.SNAPSHOT.jar
[INFO] [resources:resources {execution: default}]
[INFO] Using default encoding to copy filtered resources.
[INFO] [tools:verify-legal-files {execution: verify-legal-files}]
[INFO] Checking legal files in: rcp.feature-1.3.0.SNAPSHOT.jar
[INFO] [install:install]
[INFO] Installing /home/continuum/continuum-1.1/apps/continuum/webapp/WEB-INF/working-directory/23/rcp-feature/target/rcp.feature-1.3.0.SNAPSHOT.jar to /home/continuum/.m2/repository/org/apache/directory/studio/rcp.feature/1.3.0.SNAPSHOT/rcp.feature-1.3.0.SNAPSHOT.jar
[INFO] [deploy:deploy]
altDeploymentRepository = id::default::scpexe://vm094.oxylos.org/var/www/html/mirror-maven2/
[INFO] Using alternate deployment repository id::default::scpexe://vm094.oxylos.org/var/www/html/mirror-maven2/
[INFO] Retrieving previous build number from id
Uploading: scpexe://vm094.oxylos.org/var/www/html/mirror-maven2//org/apache/directory/studio/rcp.feature/1.3.0.SNAPSHOT/rcp.feature-1.3.0.SNAPSHOT.jar
[INFO] Retrieving previous metadata from id
[INFO] Uploading repository metadata for: 'snapshot org.apache.directory.studio:rcp.feature:1.3.0.SNAPSHOT'
[INFO] Retrieving previous metadata from id
[INFO] Uploading repository metadata for: 'artifact org.apache.directory.studio:rcp.feature'
[INFO] Uploading project information for rcp.feature 1.3.0.SNAPSHOT
[INFO] ------------------------------------------------------------------------
[INFO] Building Apache Directory Studio RCP Help
[INFO]    task-segment: [clean, deploy]
[INFO] ------------------------------------------------------------------------
[INFO] [clean:clean]
[INFO] Deleting directory /home/continuum/continuum-1.1/apps/continuum/webapp/WEB-INF/working-directory/23/rcp-help/target
[INFO] [remote-resources:process {execution: default}]
[INFO] [resources:resources]
[INFO] Using default encoding to copy filtered resources.
[INFO] [dependency:unpack {execution: unpack-docbook-dependencies}]
[INFO] Configured Artifact: docbook:docbook-xml:?:zip
[INFO] Configured Artifact: docbook:docbook-xsl:?:zip
[INFO] Unpacking /home/continuum/.m2/repository/docbook/docbook-xml/4.5/docbook-xml-4.5.zipto
 /home/continuum/continuum-1.1/apps/continuum/webapp/WEB-INF/working-directory/23/rcp-help/target/docbook/docbook-xml
with Includes null and excludes:null
[INFO] Unpacking /home/continuum/.m2/repository/docbook/docbook-xsl/1.71.1/docbook-xsl-1.71.1.zipto
 /home/continuum/continuum-1.1/apps/continuum/webapp/WEB-INF/working-directory/23/rcp-help/target/docbook
with Includes null and excludes:null
[INFO] [compiler:compile]
[INFO] No sources to compile
[INFO] [antrun:run {execution: build-eclipse-help}]
[INFO] Executing tasks
     [move] Moving 1057 files to /home/continuum/continuum-1.1/apps/continuum/webapp/WEB-INF/working-directory/23/rcp-help/target/docbook
     [xslt] Processing /home/continuum/continuum-1.1/apps/continuum/webapp/WEB-INF/working-directory/23/rcp-help/target/docbook/documents/0_index.xml to /home/continuum/continuum-1.1/apps/continuum/webapp/WEB-INF/working-directory/23/rcp-help/target/classes/index.html
     [xslt] Loading stylesheet /home/continuum/continuum-1.1/apps/continuum/webapp/WEB-INF/working-directory/23/rcp-help/target/docbook/docbook-xsl/eclipse/eclipse.xsl
     [xslt] file:/home/continuum/continuum-1.1/apps/continuum/webapp/WEB-INF/working-directory/23/rcp-help/target/docbook/docbook-xsl/html/chunker.xsl:98:18: Warning! Writing html/download_install.html for section(download_install)
     [xslt] file:/home/continuum/continuum-1.1/apps/continuum/webapp/WEB-INF/working-directory/23/rcp-help/target/docbook/docbook-xsl/html/chunker.xsl:98:18: Warning! Writing html/gettingstarted.html for chapter(gettingstarted)
     [xslt] file:/home/continuum/continuum-1.1/apps/continuum/webapp/WEB-INF/working-directory/23/rcp-help/target/docbook/docbook-xsl/html/chunker.xsl:98:18: Warning! Writing html/running.html for section(running)
     [xslt] file:/home/continuum/continuum-1.1/apps/continuum/webapp/WEB-INF/working-directory/23/rcp-help/target/docbook/docbook-xsl/html/chunker.xsl:98:18: Warning! Writing html/enabling_disabling_uninstalling_features.html for section(enabling_disabling_uninstalling_features)
     [xslt] file:/home/continuum/continuum-1.1/apps/continuum/webapp/WEB-INF/working-directory/23/rcp-help/target/docbook/docbook-xsl/html/chunker.xsl:98:18: Warning! Writing html/updating.html for section(updating)
     [xslt] file:/home/continuum/continuum-1.1/apps/continuum/webapp/WEB-INF/working-directory/23/rcp-help/target/docbook/docbook-xsl/html/chunker.xsl:98:18: Warning! Writing html/reporting_a_bug.html for section(reporting_a_bug)
     [xslt] file:/home/continuum/continuum-1.1/apps/continuum/webapp/WEB-INF/working-directory/23/rcp-help/target/docbook/docbook-xsl/html/chunker.xsl:98:18: Warning! Writing html/tasks.html for chapter(tasks)
     [xslt] file:/home/continuum/continuum-1.1/apps/continuum/webapp/WEB-INF/working-directory/23/rcp-help/target/docbook/docbook-xsl/html/chunker.xsl:98:18: Warning! Writing html/help_server.html for section(help_server)
     [xslt] file:/home/continuum/continuum-1.1/apps/continuum/webapp/WEB-INF/working-directory/23/rcp-help/target/docbook/docbook-xsl/html/chunker.xsl:98:18: Warning! Writing html/help.html for section(help)
     [xslt] file:/home/continuum/continuum-1.1/apps/continuum/webapp/WEB-INF/working-directory/23/rcp-help/target/docbook/docbook-xsl/html/chunker.xsl:98:18: Warning! Writing html/automatic_updates.html for section(automatic_updates)
     [xslt] file:/home/continuum/continuum-1.1/apps/continuum/webapp/WEB-INF/working-directory/23/rcp-help/target/docbook/docbook-xsl/html/chunker.xsl:98:18: Warning! Writing html/install_update.html for section(install_update)
     [xslt] file:/home/continuum/continuum-1.1/apps/continuum/webapp/WEB-INF/working-directory/23/rcp-help/target/docbook/docbook-xsl/html/chunker.xsl:98:18: Warning! Writing html/installed_jres.html for section(installed_jres)
     [xslt] file:/home/continuum/continuum-1.1/apps/continuum/webapp/WEB-INF/working-directory/23/rcp-help/target/docbook/docbook-xsl/html/chunker.xsl:98:18: Warning! Writing html/network_connections.html for section(network_connections)
     [xslt] file:/home/continuum/continuum-1.1/apps/continuum/webapp/WEB-INF/working-directory/23/rcp-help/target/docbook/docbook-xsl/html/chunker.xsl:98:18: Warning! Writing html/accessibility.html for section(accessibility)
     [xslt] file:/home/continuum/continuum-1.1/apps/continuum/webapp/WEB-INF/working-directory/23/rcp-help/target/docbook/docbook-xsl/html/chunker.xsl:98:18: Warning! Writing html/annotations.html for section(annotations)
     [xslt] file:/home/continuum/continuum-1.1/apps/continuum/webapp/WEB-INF/working-directory/23/rcp-help/target/docbook/docbook-xsl/html/chunker.xsl:98:18: Warning! Writing html/linked_mode.html for section(linked_mode)
     [xslt] file:/home/continuum/continuum-1.1/apps/continuum/webapp/WEB-INF/working-directory/23/rcp-help/target/docbook/docbook-xsl/html/chunker.xsl:98:18: Warning! Writing html/quick_diff.html for section(quick_diff)
     [xslt] file:/home/continuum/continuum-1.1/apps/continuum/webapp/WEB-INF/working-directory/23/rcp-help/target/docbook/docbook-xsl/html/chunker.xsl:98:18: Warning! Writing html/spelling.html for section(spelling)
     [xslt] file:/home/continuum/continuum-1.1/apps/continuum/webapp/WEB-INF/working-directory/23/rcp-help/target/docbook/docbook-xsl/html/chunker.xsl:98:18: Warning! Writing html/text_editors.html for section(text_editors)
     [xslt] file:/home/continuum/continuum-1.1/apps/continuum/webapp/WEB-INF/working-directory/23/rcp-help/target/docbook/docbook-xsl/html/chunker.xsl:98:18: Warning! Writing html/preferences.html for section(preferences)
     [xslt] file:/home/continuum/continuum-1.1/apps/continuum/webapp/WEB-INF/working-directory/23/rcp-help/target/docbook/docbook-xsl/html/chunker.xsl:98:18: Warning! Writing html/reference.html for chapter(reference)
     [xslt] file:/home/continuum/continuum-1.1/apps/continuum/webapp/WEB-INF/working-directory/23/rcp-help/target/docbook/docbook-xsl/html/html.xsl:148:18: Warning! ID recommended on simplesect: What's new in 1.2.0
     [xslt] file:/home/continuum/continuum-1.1/apps/continuum/webapp/WEB-INF/working-directory/23/rcp-help/target/docbook/docbook-xsl/html/chunker.xsl:98:18: Warning! Writing html/whats_new.html for chapter(whats_new)
     [xslt] file:/home/continuum/continuum-1.1/apps/continuum/webapp/WEB-INF/working-directory/23/rcp-help/target/docbook/docbook-xsl/html/html.xsl:148:18: Warning! ID recommended on simplesect: Apache Directory Studio 1.2.0 - (2008, a...
     [xslt] file:/home/continuum/continuum-1.1/apps/continuum/webapp/WEB-INF/working-directory/23/rcp-help/target/docbook/docbook-xsl/html/html.xsl:148:18: Warning! ID recommended on simplesect: 
     [xslt] 			Apache Directory Studio 1.1.0 - (200...
     [xslt] file:/home/continuum/continuum-1.1/apps/continuum/webapp/WEB-INF/working-directory/23/rcp-help/target/docbook/docbook-xsl/html/html.xsl:148:18: Warning! ID recommended on simplesect: 
     [xslt] 			Apache Directory Studio 1.0.0 (2007,...
     [xslt] file:/home/continuum/continuum-1.1/apps/continuum/webapp/WEB-INF/working-directory/23/rcp-help/target/docbook/docbook-xsl/html/chunker.xsl:98:18: Warning! Writing html/release_notes.html for chapter(release_notes)
     [xslt] file:/home/continuum/continuum-1.1/apps/continuum/webapp/WEB-INF/working-directory/23/rcp-help/target/docbook/docbook-xsl/html/chunker.xsl:98:18: Warning! Writing html/index.html for book
     [xslt] file:/home/continuum/continuum-1.1/apps/continuum/webapp/WEB-INF/working-directory/23/rcp-help/target/docbook/docbook-xsl/html/chunker.xsl:98:18: Warning! Writing toc.xml
     [xslt] file:/home/continuum/continuum-1.1/apps/continuum/webapp/WEB-INF/working-directory/23/rcp-help/target/docbook/docbook-xsl/html/chunker.xsl:98:18: Warning! Writing plugin.xml
[INFO] Executed tasks
[INFO] [resources:testResources]
[INFO] Using default encoding to copy filtered resources.
[INFO] [compiler:testCompile]
[INFO] No sources to compile
[INFO] [surefire:test]
[INFO] Tests are skipped.
[INFO] [jar:jar]
[INFO] Building jar: /home/continuum/continuum-1.1/apps/continuum/webapp/WEB-INF/working-directory/23/rcp-help/target/rcp.help-1.3.0.SNAPSHOT.jar
[INFO] [tools:verify-legal-files {execution: verify-legal-files}]
[INFO] Checking legal files in: rcp.help-1.3.0.SNAPSHOT.jar
[INFO] [install:install]
[INFO] Installing /home/continuum/continuum-1.1/apps/continuum/webapp/WEB-INF/working-directory/23/rcp-help/target/rcp.help-1.3.0.SNAPSHOT.jar to /home/continuum/.m2/repository/org/apache/directory/studio/rcp.help/1.3.0.SNAPSHOT/rcp.help-1.3.0.SNAPSHOT.jar
[INFO] [deploy:deploy]
altDeploymentRepository = id::default::scpexe://vm094.oxylos.org/var/www/html/mirror-maven2/
[INFO] Using alternate deployment repository id::default::scpexe://vm094.oxylos.org/var/www/html/mirror-maven2/
[INFO] Retrieving previous build number from id
Uploading: scpexe://vm094.oxylos.org/var/www/html/mirror-maven2//org/apache/directory/studio/rcp.help/1.3.0.SNAPSHOT/rcp.help-1.3.0.SNAPSHOT.jar
[INFO] Retrieving previous metadata from id
[INFO] Uploading repository metadata for: 'artifact org.apache.directory.studio:rcp.help'
[INFO] Uploading project information for rcp.help 1.3.0.SNAPSHOT
[INFO] Retrieving previous metadata from id
[INFO] Uploading repository metadata for: 'snapshot org.apache.directory.studio:rcp.help:1.3.0.SNAPSHOT'
[INFO] ------------------------------------------------------------------------
[INFO] Building Apache Directory Studio LDIF Editor
[INFO]    task-segment: [clean, deploy]
[INFO] ------------------------------------------------------------------------
[INFO] [clean:clean]
[INFO] Deleting directory /home/continuum/continuum-1.1/apps/continuum/webapp/WEB-INF/working-directory/23/ldifeditor/target
[INFO] [remote-resources:process {execution: default}]
[INFO] [resources:resources]
[INFO] Using default encoding to copy filtered resources.
[INFO] [studio:prepare-jar-package {execution: default}]
[INFO] [compiler:compile]
[INFO] Compiling 42 source files to /home/continuum/continuum-1.1/apps/continuum/webapp/WEB-INF/working-directory/23/ldifeditor/target/classes
[INFO] [resources:testResources]
[INFO] Using default encoding to copy filtered resources.
[INFO] [compiler:testCompile]
[INFO] Nothing to compile - all classes are up to date
[INFO] [surefire:test]
[INFO] Tests are skipped.
[INFO] [jar:jar]
[INFO] Building jar: /home/continuum/continuum-1.1/apps/continuum/webapp/WEB-INF/working-directory/23/ldifeditor/target/ldifeditor-1.3.0.SNAPSHOT.jar
[INFO] [tools:verify-legal-files {execution: verify-legal-files}]
[INFO] Checking legal files in: ldifeditor-1.3.0.SNAPSHOT.jar
[INFO] [install:install]
[INFO] Installing /home/continuum/continuum-1.1/apps/continuum/webapp/WEB-INF/working-directory/23/ldifeditor/target/ldifeditor-1.3.0.SNAPSHOT.jar to /home/continuum/.m2/repository/org/apache/directory/studio/ldifeditor/1.3.0.SNAPSHOT/ldifeditor-1.3.0.SNAPSHOT.jar
[INFO] [deploy:deploy]
altDeploymentRepository = id::default::scpexe://vm094.oxylos.org/var/www/html/mirror-maven2/
[INFO] Using alternate deployment repository id::default::scpexe://vm094.oxylos.org/var/www/html/mirror-maven2/
[INFO] Retrieving previous build number from id
Uploading: scpexe://vm094.oxylos.org/var/www/html/mirror-maven2//org/apache/directory/studio/ldifeditor/1.3.0.SNAPSHOT/ldifeditor-1.3.0.SNAPSHOT.jar
[INFO] Retrieving previous metadata from id
[INFO] Uploading repository metadata for: 'snapshot org.apache.directory.studio:ldifeditor:1.3.0.SNAPSHOT'
[INFO] Uploading project information for ldifeditor 1.3.0.SNAPSHOT
[INFO] Retrieving previous metadata from id
[INFO] Uploading repository metadata for: 'artifact org.apache.directory.studio:ldifeditor'
[INFO] ------------------------------------------------------------------------
[INFO] Building Apache Directory Studio LDIF Editor Feature
[INFO]    task-segment: [clean, deploy]
[INFO] ------------------------------------------------------------------------
[INFO] [clean:clean]
[INFO] Deleting directory /home/continuum/continuum-1.1/apps/continuum/webapp/WEB-INF/working-directory/23/ldifeditor-feature/target
[INFO] [remote-resources:process {execution: default}]
[INFO] [resources:resources]
[INFO] Using default encoding to copy filtered resources.
[INFO] [compiler:compile]
[INFO] No sources to compile
[INFO] [resources:testResources]
[INFO] Using default encoding to copy filtered resources.
[INFO] [compiler:testCompile]
[INFO] No sources to compile
[INFO] [surefire:test]
[INFO] Tests are skipped.
[INFO] [jar:jar]
[INFO] Building jar: /home/continuum/continuum-1.1/apps/continuum/webapp/WEB-INF/working-directory/23/ldifeditor-feature/target/ldifeditor.feature-1.3.0.SNAPSHOT.jar
[INFO] [resources:resources {execution: default}]
[INFO] Using default encoding to copy filtered resources.
[INFO] [tools:verify-legal-files {execution: verify-legal-files}]
[INFO] Checking legal files in: ldifeditor.feature-1.3.0.SNAPSHOT.jar
[INFO] [install:install]
[INFO] Installing /home/continuum/continuum-1.1/apps/continuum/webapp/WEB-INF/working-directory/23/ldifeditor-feature/target/ldifeditor.feature-1.3.0.SNAPSHOT.jar to /home/continuum/.m2/repository/org/apache/directory/studio/ldifeditor.feature/1.3.0.SNAPSHOT/ldifeditor.feature-1.3.0.SNAPSHOT.jar
[INFO] [deploy:deploy]
altDeploymentRepository = id::default::scpexe://vm094.oxylos.org/var/www/html/mirror-maven2/
[INFO] Using alternate deployment repository id::default::scpexe://vm094.oxylos.org/var/www/html/mirror-maven2/
[INFO] Retrieving previous build number from id
Uploading: scpexe://vm094.oxylos.org/var/www/html/mirror-maven2//org/apache/directory/studio/ldifeditor.feature/1.3.0.SNAPSHOT/ldifeditor.feature-1.3.0.SNAPSHOT.jar
[INFO] Uploading project information for ldifeditor.feature 1.3.0.SNAPSHOT
[INFO] Retrieving previous metadata from id
[INFO] Uploading repository metadata for: 'snapshot org.apache.directory.studio:ldifeditor.feature:1.3.0.SNAPSHOT'
[INFO] Retrieving previous metadata from id
[INFO] Uploading repository metadata for: 'artifact org.apache.directory.studio:ldifeditor.feature'
[INFO] ------------------------------------------------------------------------
[INFO] Building Apache Directory Studio LDIF Editor Help
[INFO]    task-segment: [clean, deploy]
[INFO] ------------------------------------------------------------------------
[INFO] [clean:clean]
[INFO] Deleting directory /home/continuum/continuum-1.1/apps/continuum/webapp/WEB-INF/working-directory/23/ldifeditor-help/target
[INFO] [remote-resources:process {execution: default}]
[INFO] [resources:resources]
[INFO] Using default encoding to copy filtered resources.
[INFO] [dependency:unpack {execution: unpack-docbook-dependencies}]
[INFO] Configured Artifact: docbook:docbook-xml:?:zip
[INFO] Configured Artifact: docbook:docbook-xsl:?:zip
[INFO] Unpacking /home/continuum/.m2/repository/docbook/docbook-xml/4.5/docbook-xml-4.5.zipto
 /home/continuum/continuum-1.1/apps/continuum/webapp/WEB-INF/working-directory/23/ldifeditor-help/target/docbook/docbook-xml
with Includes null and excludes:null
[INFO] Unpacking /home/continuum/.m2/repository/docbook/docbook-xsl/1.71.1/docbook-xsl-1.71.1.zipto
 /home/continuum/continuum-1.1/apps/continuum/webapp/WEB-INF/working-directory/23/ldifeditor-help/target/docbook
with Includes null and excludes:null
[INFO] [compiler:compile]
[INFO] No sources to compile
[INFO] [antrun:run {execution: build-eclipse-help}]
[INFO] Executing tasks
     [move] Moving 1057 files to /home/continuum/continuum-1.1/apps/continuum/webapp/WEB-INF/working-directory/23/ldifeditor-help/target/docbook
     [xslt] Processing /home/continuum/continuum-1.1/apps/continuum/webapp/WEB-INF/working-directory/23/ldifeditor-help/target/docbook/documents/0_index.xml to /home/continuum/continuum-1.1/apps/continuum/webapp/WEB-INF/working-directory/23/ldifeditor-help/target/classes/index.html
     [xslt] Loading stylesheet /home/continuum/continuum-1.1/apps/continuum/webapp/WEB-INF/working-directory/23/ldifeditor-help/target/docbook/docbook-xsl/eclipse/eclipse.xsl
     [xslt] file:/home/continuum/continuum-1.1/apps/continuum/webapp/WEB-INF/working-directory/23/ldifeditor-help/target/docbook/docbook-xsl/html/chunker.xsl:98:18: Warning! Writing html/gettingstarted_download_install.html for section(gettingstarted_download_install)
     [xslt] file:/home/continuum/continuum-1.1/apps/continuum/webapp/WEB-INF/working-directory/23/ldifeditor-help/target/docbook/docbook-xsl/html/chunker.xsl:98:18: Warning! Writing html/gettingstarted_overview.html for section(gettingstarted_overview)
     [xslt] file:/home/continuum/continuum-1.1/apps/continuum/webapp/WEB-INF/working-directory/23/ldifeditor-help/target/docbook/docbook-xsl/html/chunker.xsl:98:18: Warning! Writing html/gettingstarted_working.html for section(gettingstarted_working)
     [xslt] file:/home/continuum/continuum-1.1/apps/continuum/webapp/WEB-INF/working-directory/23/ldifeditor-help/target/docbook/docbook-xsl/html/chunker.xsl:98:18: Warning! Writing html/gettingstarted_outline.html for section(gettingstarted_outline)
     [xslt] file:/home/continuum/continuum-1.1/apps/continuum/webapp/WEB-INF/working-directory/23/ldifeditor-help/target/docbook/docbook-xsl/html/chunker.xsl:98:18: Warning! Writing html/gettingstarted_preferences.html for section(gettingstarted_preferences)
     [xslt] file:/home/continuum/continuum-1.1/apps/continuum/webapp/WEB-INF/working-directory/23/ldifeditor-help/target/docbook/docbook-xsl/html/chunker.xsl:98:18: Warning! Writing html/gettingstarted.html for chapter(gettingstarted)
     [xslt] file:/home/continuum/continuum-1.1/apps/continuum/webapp/WEB-INF/working-directory/23/ldifeditor-help/target/docbook/docbook-xsl/html/chunker.xsl:98:18: Warning! Writing html/tasks.html for chapter(tasks)
     [xslt] file:/home/continuum/continuum-1.1/apps/continuum/webapp/WEB-INF/working-directory/23/ldifeditor-help/target/docbook/docbook-xsl/html/chunker.xsl:98:18: Warning! Writing html/reference.html for chapter(reference)
     [xslt] file:/home/continuum/continuum-1.1/apps/continuum/webapp/WEB-INF/working-directory/23/ldifeditor-help/target/docbook/docbook-xsl/html/chunker.xsl:98:18: Warning! Writing html/tipsandtricks.html for chapter(tipsandtricks)
     [xslt] file:/home/continuum/continuum-1.1/apps/continuum/webapp/WEB-INF/working-directory/23/ldifeditor-help/target/docbook/docbook-xsl/html/html.xsl:148:18: Warning! ID recommended on simplesect: Apache Directory Studio 1.2.0 - (2008, a...
     [xslt] file:/home/continuum/continuum-1.1/apps/continuum/webapp/WEB-INF/working-directory/23/ldifeditor-help/target/docbook/docbook-xsl/html/html.xsl:148:18: Warning! ID recommended on simplesect: Apache Directory Studio 1.1.0 - (2008, m...
     [xslt] file:/home/continuum/continuum-1.1/apps/continuum/webapp/WEB-INF/working-directory/23/ldifeditor-help/target/docbook/docbook-xsl/html/html.xsl:148:18: Warning! ID recommended on simplesect: Apache Directory Studio 1.0.0 - (2007, s...
     [xslt] file:/home/continuum/continuum-1.1/apps/continuum/webapp/WEB-INF/working-directory/23/ldifeditor-help/target/docbook/docbook-xsl/html/chunker.xsl:98:18: Warning! Writing html/releasenotes.html for chapter(releasenotes)
     [xslt] file:/home/continuum/continuum-1.1/apps/continuum/webapp/WEB-INF/working-directory/23/ldifeditor-help/target/docbook/docbook-xsl/html/chunker.xsl:98:18: Warning! Writing html/index.html for book
     [xslt] file:/home/continuum/continuum-1.1/apps/continuum/webapp/WEB-INF/working-directory/23/ldifeditor-help/target/docbook/docbook-xsl/html/chunker.xsl:98:18: Warning! Writing toc.xml
     [xslt] file:/home/continuum/continuum-1.1/apps/continuum/webapp/WEB-INF/working-directory/23/ldifeditor-help/target/docbook/docbook-xsl/html/chunker.xsl:98:18: Warning! Writing plugin.xml
[INFO] Executed tasks
[INFO] [resources:testResources]
[INFO] Using default encoding to copy filtered resources.
[INFO] [compiler:testCompile]
[INFO] No sources to compile
[INFO] [surefire:test]
[INFO] Tests are skipped.
[INFO] [jar:jar]
[INFO] Building jar: /home/continuum/continuum-1.1/apps/continuum/webapp/WEB-INF/working-directory/23/ldifeditor-help/target/ldifeditor.help-1.3.0.SNAPSHOT.jar
[INFO] [tools:verify-legal-files {execution: verify-legal-files}]
[INFO] Checking legal files in: ldifeditor.help-1.3.0.SNAPSHOT.jar
[INFO] [install:install]
[INFO] Installing /home/continuum/continuum-1.1/apps/continuum/webapp/WEB-INF/working-directory/23/ldifeditor-help/target/ldifeditor.help-1.3.0.SNAPSHOT.jar to /home/continuum/.m2/repository/org/apache/directory/studio/ldifeditor.help/1.3.0.SNAPSHOT/ldifeditor.help-1.3.0.SNAPSHOT.jar
[INFO] [deploy:deploy]
altDeploymentRepository = id::default::scpexe://vm094.oxylos.org/var/www/html/mirror-maven2/
[INFO] Using alternate deployment repository id::default::scpexe://vm094.oxylos.org/var/www/html/mirror-maven2/
[INFO] Retrieving previous build number from id
Uploading: scpexe://vm094.oxylos.org/var/www/html/mirror-maven2//org/apache/directory/studio/ldifeditor.help/1.3.0.SNAPSHOT/ldifeditor.help-1.3.0.SNAPSHOT.jar
[INFO] Retrieving previous metadata from id
[INFO] Uploading repository metadata for: 'artifact org.apache.directory.studio:ldifeditor.help'
[INFO] Retrieving previous metadata from id
[INFO] Uploading repository metadata for: 'snapshot org.apache.directory.studio:ldifeditor.help:1.3.0.SNAPSHOT'
[INFO] Uploading project information for ldifeditor.help 1.3.0.SNAPSHOT
[INFO] ------------------------------------------------------------------------
[INFO] Building Apache Directory Studio LDAP Browser UI
[INFO]    task-segment: [clean, deploy]
[INFO] ------------------------------------------------------------------------
[INFO] [clean:clean]
[INFO] Deleting directory /home/continuum/continuum-1.1/apps/continuum/webapp/WEB-INF/working-directory/23/ldapbrowser-ui/target
[INFO] [remote-resources:process {execution: default}]
[INFO] [resources:resources]
[INFO] Using default encoding to copy filtered resources.
[INFO] [studio:prepare-jar-package {execution: default}]
[INFO] [compiler:compile]
[INFO] Compiling 170 source files to /home/continuum/continuum-1.1/apps/continuum/webapp/WEB-INF/working-directory/23/ldapbrowser-ui/target/classes
[INFO] [resources:testResources]
[INFO] Using default encoding to copy filtered resources.
[INFO] [compiler:testCompile]
[INFO] Nothing to compile - all classes are up to date
[INFO] [surefire:test]
[INFO] Tests are skipped.
[INFO] [jar:jar]
[INFO] Building jar: /home/continuum/continuum-1.1/apps/continuum/webapp/WEB-INF/working-directory/23/ldapbrowser-ui/target/ldapbrowser.ui-1.3.0.SNAPSHOT.jar
[INFO] [tools:verify-legal-files {execution: verify-legal-files}]
[INFO] Checking legal files in: ldapbrowser.ui-1.3.0.SNAPSHOT.jar
[INFO] [install:install]
[INFO] Installing /home/continuum/continuum-1.1/apps/continuum/webapp/WEB-INF/working-directory/23/ldapbrowser-ui/target/ldapbrowser.ui-1.3.0.SNAPSHOT.jar to /home/continuum/.m2/repository/org/apache/directory/studio/ldapbrowser.ui/1.3.0.SNAPSHOT/ldapbrowser.ui-1.3.0.SNAPSHOT.jar
[INFO] [deploy:deploy]
altDeploymentRepository = id::default::scpexe://vm094.oxylos.org/var/www/html/mirror-maven2/
[INFO] Using alternate deployment repository id::default::scpexe://vm094.oxylos.org/var/www/html/mirror-maven2/
[INFO] Retrieving previous build number from id
Uploading: scpexe://vm094.oxylos.org/var/www/html/mirror-maven2//org/apache/directory/studio/ldapbrowser.ui/1.3.0.SNAPSHOT/ldapbrowser.ui-1.3.0.SNAPSHOT.jar
[INFO] Retrieving previous metadata from id
[INFO] Uploading repository metadata for: 'artifact org.apache.directory.studio:ldapbrowser.ui'
[INFO] Uploading project information for ldapbrowser.ui 1.3.0.SNAPSHOT
[INFO] Retrieving previous metadata from id
[INFO] Uploading repository metadata for: 'snapshot org.apache.directory.studio:ldapbrowser.ui:1.3.0.SNAPSHOT'
[INFO] ------------------------------------------------------------------------
[INFO] Building Apache Directory Studio LDAP Browser Feature
[INFO]    task-segment: [clean, deploy]
[INFO] ------------------------------------------------------------------------
[INFO] [clean:clean]
[INFO] Deleting directory /home/continuum/continuum-1.1/apps/continuum/webapp/WEB-INF/working-directory/23/ldapbrowser-feature/target
[INFO] [remote-resources:process {execution: default}]
[INFO] [resources:resources]
[INFO] Using default encoding to copy filtered resources.
[INFO] [compiler:compile]
[INFO] No sources to compile
[INFO] [resources:testResources]
[INFO] Using default encoding to copy filtered resources.
[INFO] [compiler:testCompile]
[INFO] No sources to compile
[INFO] [surefire:test]
[INFO] Tests are skipped.
[INFO] [jar:jar]
[INFO] Building jar: /home/continuum/continuum-1.1/apps/continuum/webapp/WEB-INF/working-directory/23/ldapbrowser-feature/target/ldapbrowser.feature-1.3.0.SNAPSHOT.jar
[INFO] [resources:resources {execution: default}]
[INFO] Using default encoding to copy filtered resources.
[INFO] [tools:verify-legal-files {execution: verify-legal-files}]
[INFO] Checking legal files in: ldapbrowser.feature-1.3.0.SNAPSHOT.jar
[INFO] [install:install]
[INFO] Installing /home/continuum/continuum-1.1/apps/continuum/webapp/WEB-INF/working-directory/23/ldapbrowser-feature/target/ldapbrowser.feature-1.3.0.SNAPSHOT.jar to /home/continuum/.m2/repository/org/apache/directory/studio/ldapbrowser.feature/1.3.0.SNAPSHOT/ldapbrowser.feature-1.3.0.SNAPSHOT.jar
[INFO] [deploy:deploy]
altDeploymentRepository = id::default::scpexe://vm094.oxylos.org/var/www/html/mirror-maven2/
[INFO] Using alternate deployment repository id::default::scpexe://vm094.oxylos.org/var/www/html/mirror-maven2/
[INFO] Retrieving previous build number from id
Uploading: scpexe://vm094.oxylos.org/var/www/html/mirror-maven2//org/apache/directory/studio/ldapbrowser.feature/1.3.0.SNAPSHOT/ldapbrowser.feature-1.3.0.SNAPSHOT.jar
[INFO] Retrieving previous metadata from id
[INFO] Uploading repository metadata for: 'artifact org.apache.directory.studio:ldapbrowser.feature'
[INFO] Uploading project information for ldapbrowser.feature 1.3.0.SNAPSHOT
[INFO] Retrieving previous metadata from id
[INFO] Uploading repository metadata for: 'snapshot org.apache.directory.studio:ldapbrowser.feature:1.3.0.SNAPSHOT'
[INFO] ------------------------------------------------------------------------
[INFO] Building Apache Directory Studio LDAP Browser Help
[INFO]    task-segment: [clean, deploy]
[INFO] ------------------------------------------------------------------------
[INFO] [clean:clean]
[INFO] Deleting directory /home/continuum/continuum-1.1/apps/continuum/webapp/WEB-INF/working-directory/23/ldapbrowser-help/target
[INFO] [remote-resources:process {execution: default}]
[INFO] [resources:resources]
[INFO] Using default encoding to copy filtered resources.
[INFO] [dependency:unpack {execution: unpack-docbook-dependencies}]
[INFO] Configured Artifact: docbook:docbook-xml:?:zip
[INFO] Configured Artifact: docbook:docbook-xsl:?:zip
[INFO] Unpacking /home/continuum/.m2/repository/docbook/docbook-xml/4.5/docbook-xml-4.5.zipto
 /home/continuum/continuum-1.1/apps/continuum/webapp/WEB-INF/working-directory/23/ldapbrowser-help/target/docbook/docbook-xml
with Includes null and excludes:null
[INFO] Unpacking /home/continuum/.m2/repository/docbook/docbook-xsl/1.71.1/docbook-xsl-1.71.1.zipto
 /home/continuum/continuum-1.1/apps/continuum/webapp/WEB-INF/working-directory/23/ldapbrowser-help/target/docbook
with Includes null and excludes:null
[INFO] [compiler:compile]
[INFO] No sources to compile
[INFO] [antrun:run {execution: build-eclipse-help}]
[INFO] Executing tasks
     [move] Moving 1057 files to /home/continuum/continuum-1.1/apps/continuum/webapp/WEB-INF/working-directory/23/ldapbrowser-help/target/docbook
     [xslt] Processing /home/continuum/continuum-1.1/apps/continuum/webapp/WEB-INF/working-directory/23/ldapbrowser-help/target/docbook/documents/0_index.xml to /home/continuum/continuum-1.1/apps/continuum/webapp/WEB-INF/working-directory/23/ldapbrowser-help/target/classes/index.html
     [xslt] Loading stylesheet /home/continuum/continuum-1.1/apps/continuum/webapp/WEB-INF/working-directory/23/ldapbrowser-help/target/docbook/docbook-xsl/eclipse/eclipse.xsl
     [xslt] file:/home/continuum/continuum-1.1/apps/continuum/webapp/WEB-INF/working-directory/23/ldapbrowser-help/target/docbook/docbook-xsl/html/chunker.xsl:98:18: Warning! Writing html/gettingstarted_download_install.html for section(gettingstarted_download_install)
     [xslt] file:/home/continuum/continuum-1.1/apps/continuum/webapp/WEB-INF/working-directory/23/ldapbrowser-help/target/docbook/docbook-xsl/html/chunker.xsl:98:18: Warning! Writing html/gettingstarted_open_perspecitve.html for section(gettingstarted_open_perspecitve)
     [xslt] file:/home/continuum/continuum-1.1/apps/continuum/webapp/WEB-INF/working-directory/23/ldapbrowser-help/target/docbook/docbook-xsl/html/chunker.xsl:98:18: Warning! Writing html/gettingstarted_create_connection.html for section(gettingstarted_create_connection)
     [xslt] file:/home/continuum/continuum-1.1/apps/continuum/webapp/WEB-INF/working-directory/23/ldapbrowser-help/target/docbook/docbook-xsl/html/chunker.xsl:98:18: Warning! Writing html/gettingstarted_browse.html for section(gettingstarted_browse)
     [xslt] file:/home/continuum/continuum-1.1/apps/continuum/webapp/WEB-INF/working-directory/23/ldapbrowser-help/target/docbook/docbook-xsl/html/chunker.xsl:98:18: Warning! Writing html/gettingstarted_search.html for section(gettingstarted_search)
     [xslt] file:/home/continuum/continuum-1.1/apps/continuum/webapp/WEB-INF/working-directory/23/ldapbrowser-help/target/docbook/docbook-xsl/html/chunker.xsl:98:18: Warning! Writing html/gettingstarted.html for chapter(gettingstarted)
     [xslt] file:/home/continuum/continuum-1.1/apps/continuum/webapp/WEB-INF/working-directory/23/ldapbrowser-help/target/docbook/docbook-xsl/html/chunker.xsl:98:18: Warning! Writing html/tools_ldap_perspective.html for section(tools_ldap_perspective)
     [xslt] file:/home/continuum/continuum-1.1/apps/continuum/webapp/WEB-INF/working-directory/23/ldapbrowser-help/target/docbook/docbook-xsl/html/chunker.xsl:98:18: Warning! Writing html/tools_connections_view.html for section(tools_connections_view)
     [xslt] file:/home/continuum/continuum-1.1/apps/continuum/webapp/WEB-INF/working-directory/23/ldapbrowser-help/target/docbook/docbook-xsl/html/chunker.xsl:98:18: Warning! Writing html/tools_browser_view_overview.html for section(tools_browser_view_overview)
     [xslt] file:/home/continuum/continuum-1.1/apps/continuum/webapp/WEB-INF/working-directory/23/ldapbrowser-help/target/docbook/docbook-xsl/html/chunker.xsl:98:18: Warning! Writing html/tools_browser_view_dit.html for section(tools_browser_view_dit)
     [xslt] file:/home/continuum/continuum-1.1/apps/continuum/webapp/WEB-INF/working-directory/23/ldapbrowser-help/target/docbook/docbook-xsl/html/chunker.xsl:98:18: Warning! Writing html/tools_browser_view_searches.html for section(tools_browser_view_searches)
     [xslt] file:/home/continuum/continuum-1.1/apps/continuum/webapp/WEB-INF/working-directory/23/ldapbrowser-help/target/docbook/docbook-xsl/html/chunker.xsl:98:18: Warning! Writing html/tools_browser_view_bookmarks.html for section(tools_browser_view_bookmarks)
     [xslt] file:/home/continuum/continuum-1.1/apps/continuum/webapp/WEB-INF/working-directory/23/ldapbrowser-help/target/docbook/docbook-xsl/html/chunker.xsl:98:18: Warning! Writing html/tools_browser_view_contextmenu.html for section(tools_browser_view_contextmenu)
     [xslt] file:/home/continuum/continuum-1.1/apps/continuum/webapp/WEB-INF/working-directory/23/ldapbrowser-help/target/docbook/docbook-xsl/html/chunker.xsl:98:18: Warning! Writing html/tools_browser_view.html for section(tools_browser_view)
     [xslt] file:/home/continuum/continuum-1.1/apps/continuum/webapp/WEB-INF/working-directory/23/ldapbrowser-help/target/docbook/docbook-xsl/html/chunker.xsl:98:18: Warning! Writing html/tools_entry_editor_overview.html for section(tools_entry_editor_overview)
     [xslt] file:/home/continuum/continuum-1.1/apps/continuum/webapp/WEB-INF/working-directory/23/ldapbrowser-help/target/docbook/docbook-xsl/html/chunker.xsl:98:18: Warning! Writing html/tools_entry_editor_features.html for section(tools_entry_editor_features)
     [xslt] file:/home/continuum/continuum-1.1/apps/continuum/webapp/WEB-INF/working-directory/23/ldapbrowser-help/target/docbook/docbook-xsl/html/chunker.xsl:98:18: Warning! Writing html/tools_entry_editor_contextmenu.html for section(tools_entry_editor_contextmenu)
     [xslt] file:/home/continuum/continuum-1.1/apps/continuum/webapp/WEB-INF/working-directory/23/ldapbrowser-help/target/docbook/docbook-xsl/html/chunker.xsl:98:18: Warning! Writing html/tools_entry_editor.html for section(tools_entry_editor)
     [xslt] file:/home/continuum/continuum-1.1/apps/continuum/webapp/WEB-INF/working-directory/23/ldapbrowser-help/target/docbook/docbook-xsl/html/chunker.xsl:98:18: Warning! Writing html/tools_search_result_editor_overview.html for section(tools_search_result_editor_overview)
     [xslt] file:/home/continuum/continuum-1.1/apps/continuum/webapp/WEB-INF/working-directory/23/ldapbrowser-help/target/docbook/docbook-xsl/html/chunker.xsl:98:18: Warning! Writing html/tools_search_result_editor_features.html for section(tools_search_result_editor_features)
     [xslt] file:/home/continuum/continuum-1.1/apps/continuum/webapp/WEB-INF/working-directory/23/ldapbrowser-help/target/docbook/docbook-xsl/html/chunker.xsl:98:18: Warning! Writing html/tools_search_result_editor_contextmenu.html for section(tools_search_result_editor_contextmenu)
     [xslt] file:/home/continuum/continuum-1.1/apps/continuum/webapp/WEB-INF/working-directory/23/ldapbrowser-help/target/docbook/docbook-xsl/html/chunker.xsl:98:18: Warning! Writing html/tools_search_result_editor.html for section(tools_search_result_editor)
     [xslt] file:/home/continuum/continuum-1.1/apps/continuum/webapp/WEB-INF/working-directory/23/ldapbrowser-help/target/docbook/docbook-xsl/html/chunker.xsl:98:18: Warning! Writing html/tools_schema_browser_overview.html for section(tools_schema_browser_overview)
     [xslt] file:/home/continuum/continuum-1.1/apps/continuum/webapp/WEB-INF/working-directory/23/ldapbrowser-help/target/docbook/docbook-xsl/html/chunker.xsl:98:18: Warning! Writing html/tools_schema_browser_ocd.html for section(tools_schema_browser_ocd)
     [xslt] file:/home/continuum/continuum-1.1/apps/continuum/webapp/WEB-INF/working-directory/23/ldapbrowser-help/target/docbook/docbook-xsl/html/chunker.xsl:98:18: Warning! Writing html/tools_schema_browser_atd.html for section(tools_schema_browser_atd)
     [xslt] file:/home/continuum/continuum-1.1/apps/continuum/webapp/WEB-INF/working-directory/23/ldapbrowser-help/target/docbook/docbook-xsl/html/chunker.xsl:98:18: Warning! Writing html/tools_schema_browser_lsd.html for section(tools_schema_browser_lsd)
     [xslt] file:/home/continuum/continuum-1.1/apps/continuum/webapp/WEB-INF/working-directory/23/ldapbrowser-help/target/docbook/docbook-xsl/html/chunker.xsl:98:18: Warning! Writing html/tools_schema_browser_mrd.html for section(tools_schema_browser_mrd)
     [xslt] file:/home/continuum/continuum-1.1/apps/continuum/webapp/WEB-INF/working-directory/23/ldapbrowser-help/target/docbook/docbook-xsl/html/chunker.xsl:98:18: Warning! Writing html/tools_schema_browser_mru.html for section(tools_schema_browser_mru)
     [xslt] file:/home/continuum/continuum-1.1/apps/continuum/webapp/WEB-INF/working-directory/23/ldapbrowser-help/target/docbook/docbook-xsl/html/chunker.xsl:98:18: Warning! Writing html/tools_schema_browser.html for section(tools_schema_browser)
     [xslt] file:/home/continuum/continuum-1.1/apps/continuum/webapp/WEB-INF/working-directory/23/ldapbrowser-help/target/docbook/docbook-xsl/common/common.xsl:1209:20: Warning! Error: no ID for constraint linkend: preferences_modification_logs_view.
     [xslt] file:/home/continuum/continuum-1.1/apps/continuum/webapp/WEB-INF/working-directory/23/ldapbrowser-help/target/docbook/docbook-xsl/html/chunker.xsl:98:18: Warning! Writing html/tools_modification_logs_view.html for section(tools_modification_logs_view)
     [xslt] file:/home/continuum/continuum-1.1/apps/continuum/webapp/WEB-INF/working-directory/23/ldapbrowser-help/target/docbook/docbook-xsl/common/common.xsl:1209:20: Warning! Error: no ID for constraint linkend: preferences_search_logs_view.
     [xslt] file:/home/continuum/continuum-1.1/apps/continuum/webapp/WEB-INF/working-directory/23/ldapbrowser-help/target/docbook/docbook-xsl/html/chunker.xsl:98:18: Warning! Writing html/tools_search_logs_view.html for section(tools_search_logs_view)
     [xslt] file:/home/continuum/continuum-1.1/apps/continuum/webapp/WEB-INF/working-directory/23/ldapbrowser-help/target/docbook/docbook-xsl/html/chunker.xsl:98:18: Warning! Writing html/tools_progress_view.html for section(tools_progress_view)
     [xslt] file:/home/continuum/continuum-1.1/apps/continuum/webapp/WEB-INF/working-directory/23/ldapbrowser-help/target/docbook/docbook-xsl/html/chunker.xsl:98:18: Warning! Writing html/tools_viewsandeditors.html for section(tools_viewsandeditors)
     [xslt] file:/home/continuum/continuum-1.1/apps/continuum/webapp/WEB-INF/working-directory/23/ldapbrowser-help/target/docbook/docbook-xsl/html/chunker.xsl:98:18: Warning! Writing html/tools_newconnection_wizard.html for section(tools_newconnection_wizard)
     [xslt] file:/home/continuum/continuum-1.1/apps/continuum/webapp/WEB-INF/working-directory/23/ldapbrowser-help/target/docbook/docbook-xsl/html/chunker.xsl:98:18: Warning! Writing html/tools_newentry_wizard.html for section(tools_newentry_wizard)
     [xslt] file:/home/continuum/continuum-1.1/apps/continuum/webapp/WEB-INF/working-directory/23/ldapbrowser-help/target/docbook/docbook-xsl/html/chunker.xsl:98:18: Warning! Writing html/tools_editentry_wizard.html for section(tools_editentry_wizard)
     [xslt] file:/home/continuum/continuum-1.1/apps/continuum/webapp/WEB-INF/working-directory/23/ldapbrowser-help/target/docbook/docbook-xsl/html/chunker.xsl:98:18: Warning! Writing html/tools_attribute_wizard.html for section(tools_attribute_wizard)
     [xslt] file:/home/continuum/continuum-1.1/apps/continuum/webapp/WEB-INF/working-directory/23/ldapbrowser-help/target/docbook/docbook-xsl/html/chunker.xsl:98:18: Warning! Writing html/tools_search_dialog.html for section(tools_search_dialog)
     [xslt] file:/home/continuum/continuum-1.1/apps/continuum/webapp/WEB-INF/working-directory/23/ldapbrowser-help/target/docbook/docbook-xsl/html/chunker.xsl:98:18: Warning! Writing html/tools_batchoperation_wizard.html for section(tools_batchoperation_wizard)
     [xslt] file:/home/continuum/continuum-1.1/apps/continuum/webapp/WEB-INF/working-directory/23/ldapbrowser-help/target/docbook/docbook-xsl/html/chunker.xsl:98:18: Warning! Writing html/tools_ldifimport_wizard.html for section(tools_ldifimport_wizard)
     [xslt] file:/home/continuum/continuum-1.1/apps/continuum/webapp/WEB-INF/working-directory/23/ldapbrowser-help/target/docbook/docbook-xsl/html/chunker.xsl:98:18: Warning! Writing html/tools_dsmlimport_wizard.html for section(tools_dsmlimport_wizard)
     [xslt] file:/home/continuum/continuum-1.1/apps/continuum/webapp/WEB-INF/working-directory/23/ldapbrowser-help/target/docbook/docbook-xsl/html/chunker.xsl:98:18: Warning! Writing html/tools_ldifexport_wizard.html for section(tools_ldifexport_wizard)
     [xslt] file:/home/continuum/continuum-1.1/apps/continuum/webapp/WEB-INF/working-directory/23/ldapbrowser-help/target/docbook/docbook-xsl/html/chunker.xsl:98:18: Warning! Writing html/tools_dsmlexport_wizard.html for section(tools_dsmlexport_wizard)
     [xslt] file:/home/continuum/continuum-1.1/apps/continuum/webapp/WEB-INF/working-directory/23/ldapbrowser-help/target/docbook/docbook-xsl/html/chunker.xsl:98:18: Warning! Writing html/tools_csvexport_wizard.html for section(tools_csvexport_wizard)
     [xslt] file:/home/continuum/continuum-1.1/apps/continuum/webapp/WEB-INF/working-directory/23/ldapbrowser-help/target/docbook/docbook-xsl/html/chunker.xsl:98:18: Warning! Writing html/tools_excelexport_wizard.html for section(tools_excelexport_wizard)
     [xslt] file:/home/continuum/continuum-1.1/apps/continuum/webapp/WEB-INF/working-directory/23/ldapbrowser-help/target/docbook/docbook-xsl/html/chunker.xsl:98:18: Warning! Writing html/tools_referral_connection_dialog.html for section(tools_referral_connection_dialog)
     [xslt] file:/home/continuum/continuum-1.1/apps/continuum/webapp/WEB-INF/working-directory/23/ldapbrowser-help/target/docbook/docbook-xsl/html/chunker.xsl:98:18: Warning! Writing html/tools_filter_editor_dialog.html for section(tools_filter_editor_dialog)
     [xslt] file:/home/continuum/continuum-1.1/apps/continuum/webapp/WEB-INF/working-directory/23/ldapbrowser-help/target/docbook/docbook-xsl/html/chunker.xsl:98:18: Warning! Writing html/tools_rename_entry_dialog.html for section(tools_rename_entry_dialog)
     [xslt] file:/home/continuum/continuum-1.1/apps/continuum/webapp/WEB-INF/working-directory/23/ldapbrowser-help/target/docbook/docbook-xsl/html/chunker.xsl:98:18: Warning! Writing html/tools_move_entries_dialog.html for section(tools_move_entries_dialog)
     [xslt] file:/home/continuum/continuum-1.1/apps/continuum/webapp/WEB-INF/working-directory/23/ldapbrowser-help/target/docbook/docbook-xsl/html/chunker.xsl:98:18: Warning! Writing html/tools_wizardsanddialogs.html for section(tools_wizardsanddialogs)
     [xslt] file:/home/continuum/continuum-1.1/apps/continuum/webapp/WEB-INF/working-directory/23/ldapbrowser-help/target/docbook/docbook-xsl/html/chunker.xsl:98:18: Warning! Writing html/tools_value_editors_concept.html for section(tools_value_editors_concept)
     [xslt] file:/home/continuum/continuum-1.1/apps/continuum/webapp/WEB-INF/working-directory/23/ldapbrowser-help/target/docbook/docbook-xsl/html/chunker.xsl:98:18: Warning! Writing html/tools_value_editors_inplacetexteditor.html for section(tools_value_editors_inplacetexteditor)
     [xslt] file:/home/continuum/continuum-1.1/apps/continuum/webapp/WEB-INF/working-directory/23/ldapbrowser-help/target/docbook/docbook-xsl/html/chunker.xsl:98:18: Warning! Writing html/tools_value_editors_texteditor.html for section(tools_value_editors_texteditor)
     [xslt] file:/home/continuum/continuum-1.1/apps/continuum/webapp/WEB-INF/working-directory/23/ldapbrowser-help/target/docbook/docbook-xsl/html/chunker.xsl:98:18: Warning! Writing html/tools_value_editors_hexeditor.html for section(tools_value_editors_hexeditor)
     [xslt] file:/home/continuum/continuum-1.1/apps/continuum/webapp/WEB-INF/working-directory/23/ldapbrowser-help/target/docbook/docbook-xsl/html/chunker.xsl:98:18: Warning! Writing html/tools_value_editors_passwordeditor.html for section(tools_value_editors_passwordeditor)
     [xslt] file:/home/continuum/continuum-1.1/apps/continuum/webapp/WEB-INF/working-directory/23/ldapbrowser-help/target/docbook/docbook-xsl/html/chunker.xsl:98:18: Warning! Writing html/tools_value_editors_imageeditor.html for section(tools_value_editors_imageeditor)
     [xslt] file:/home/continuum/continuum-1.1/apps/continuum/webapp/WEB-INF/working-directory/23/ldapbrowser-help/target/docbook/docbook-xsl/html/chunker.xsl:98:18: Warning! Writing html/tools_value_editors_objectclasseditor.html for section(tools_value_editors_objectclasseditor)
     [xslt] file:/home/continuum/continuum-1.1/apps/continuum/webapp/WEB-INF/working-directory/23/ldapbrowser-help/target/docbook/docbook-xsl/html/chunker.xsl:98:18: Warning! Writing html/tools_value_editors_addresseditor.html for section(tools_value_editors_addresseditor)
     [xslt] file:/home/continuum/continuum-1.1/apps/continuum/webapp/WEB-INF/working-directory/23/ldapbrowser-help/target/docbook/docbook-xsl/html/chunker.xsl:98:18: Warning! Writing html/tools_value_editors_dneditor.html for section(tools_value_editors_dneditor)
     [xslt] file:/home/continuum/continuum-1.1/apps/continuum/webapp/WEB-INF/working-directory/23/ldapbrowser-help/target/docbook/docbook-xsl/html/chunker.xsl:98:18: Warning! Writing html/tools_value_editors_timestampeditor.html for section(tools_value_editors_timestampeditor)
     [xslt] file:/home/continuum/continuum-1.1/apps/continuum/webapp/WEB-INF/working-directory/23/ldapbrowser-help/target/docbook/docbook-xsl/html/chunker.xsl:98:18: Warning! Writing html/tools_value_editors_oideditor.html for section(tools_value_editors_oideditor)
     [xslt] file:/home/continuum/continuum-1.1/apps/continuum/webapp/WEB-INF/working-directory/23/ldapbrowser-help/target/docbook/docbook-xsl/html/chunker.xsl:98:18: Warning! Writing html/tools_value_editors.html for section(tools_value_editors)
     [xslt] file:/home/continuum/continuum-1.1/apps/continuum/webapp/WEB-INF/working-directory/23/ldapbrowser-help/target/docbook/docbook-xsl/html/chunker.xsl:98:18: Warning! Writing html/tools_connection_properties.html for section(tools_connection_properties)
     [xslt] file:/home/continuum/continuum-1.1/apps/continuum/webapp/WEB-INF/working-directory/23/ldapbrowser-help/target/docbook/docbook-xsl/html/chunker.xsl:98:18: Warning! Writing html/tools_entry_properties.html for section(tools_entry_properties)
     [xslt] file:/home/continuum/continuum-1.1/apps/continuum/webapp/WEB-INF/working-directory/23/ldapbrowser-help/target/docbook/docbook-xsl/html/chunker.xsl:98:18: Warning! Writing html/tools_attribute_properties.html for section(tools_attribute_properties)
     [xslt] file:/home/continuum/continuum-1.1/apps/continuum/webapp/WEB-INF/working-directory/23/ldapbrowser-help/target/docbook/docbook-xsl/html/chunker.xsl:98:18: Warning! Writing html/tools_value_properties.html for section(tools_value_properties)
     [xslt] file:/home/continuum/continuum-1.1/apps/continuum/webapp/WEB-INF/working-directory/23/ldapbrowser-help/target/docbook/docbook-xsl/html/chunker.xsl:98:18: Warning! Writing html/tools_search_properties.html for section(tools_search_properties)
     [xslt] file:/home/continuum/continuum-1.1/apps/continuum/webapp/WEB-INF/working-directory/23/ldapbrowser-help/target/docbook/docbook-xsl/html/chunker.xsl:98:18: Warning! Writing html/tools_bookmark_properties.html for section(tools_bookmark_properties)
     [xslt] file:/home/continuum/continuum-1.1/apps/continuum/webapp/WEB-INF/working-directory/23/ldapbrowser-help/target/docbook/docbook-xsl/html/chunker.xsl:98:18: Warning! Writing html/tools_properties.html for section(tools_properties)
     [xslt] file:/home/continuum/continuum-1.1/apps/continuum/webapp/WEB-INF/working-directory/23/ldapbrowser-help/target/docbook/docbook-xsl/html/chunker.xsl:98:18: Warning! Writing html/preferences_attributes.html for section(preferences_attributes)
     [xslt] file:/home/continuum/continuum-1.1/apps/continuum/webapp/WEB-INF/working-directory/23/ldapbrowser-help/target/docbook/docbook-xsl/html/chunker.xsl:98:18: Warning! Writing html/preferences_binary_attributes.html for section(preferences_binary_attributes)
     [xslt] file:/home/continuum/continuum-1.1/apps/continuum/webapp/WEB-INF/working-directory/23/ldapbrowser-help/target/docbook/docbook-xsl/html/chunker.xsl:98:18: Warning! Writing html/preferences_value_editors.html for section(preferences_value_editors)
     [xslt] file:/home/continuum/continuum-1.1/apps/continuum/webapp/WEB-INF/working-directory/23/ldapbrowser-help/target/docbook/docbook-xsl/html/chunker.xsl:98:18: Warning! Writing html/preferences_browser_view.html for section(preferences_browser_view)
     [xslt] file:/home/continuum/continuum-1.1/apps/continuum/webapp/WEB-INF/working-directory/23/ldapbrowser-help/target/docbook/docbook-xsl/html/chunker.xsl:98:18: Warning! Writing html/preferences_colors_and_fonts.html for section(preferences_colors_and_fonts)
     [xslt] file:/home/continuum/continuum-1.1/apps/continuum/webapp/WEB-INF/working-directory/23/ldapbrowser-help/target/docbook/docbook-xsl/html/chunker.xsl:98:18: Warning! Writing html/preferences_entry_editor.html for section(preferences_entry_editor)
     [xslt] file:/home/continuum/continuum-1.1/apps/continuum/webapp/WEB-INF/working-directory/23/ldapbrowser-help/target/docbook/docbook-xsl/html/chunker.xsl:98:18: Warning! Writing html/preferences_search_result_editor.html for section(preferences_search_result_editor)
     [xslt] file:/home/continuum/continuum-1.1/apps/continuum/webapp/WEB-INF/working-directory/23/ldapbrowser-help/target/docbook/docbook-xsl/html/chunker.xsl:98:18: Warning! Writing html/preferences_text_formats.html for section(preferences_text_formats)
     [xslt] file:/home/continuum/continuum-1.1/apps/continuum/webapp/WEB-INF/working-directory/23/ldapbrowser-help/target/docbook/docbook-xsl/html/chunker.xsl:98:18: Warning! Writing html/preferences.html for section(preferences)
     [xslt] file:/home/continuum/continuum-1.1/apps/continuum/webapp/WEB-INF/working-directory/23/ldapbrowser-help/target/docbook/docbook-xsl/html/chunker.xsl:98:18: Warning! Writing html/tools.html for chapter(tools)
     [xslt] file:/home/continuum/continuum-1.1/apps/continuum/webapp/WEB-INF/working-directory/23/ldapbrowser-help/target/docbook/docbook-xsl/html/html.xsl:148:18: Warning! ID recommended on simplesect: Using the New Connection wizard
     [xslt] file:/home/continuum/continuum-1.1/apps/continuum/webapp/WEB-INF/working-directory/23/ldapbrowser-help/target/docbook/docbook-xsl/html/html.xsl:148:18: Warning! ID recommended on simplesect: Duplicating an existing connection
     [xslt] file:/home/continuum/continuum-1.1/apps/continuum/webapp/WEB-INF/working-directory/23/ldapbrowser-help/target/docbook/docbook-xsl/html/chunker.xsl:98:18: Warning! Writing html/tasks_manage_connections_create.html for section(tasks_manage_connections_create)
     [xslt] file:/home/continuum/continuum-1.1/apps/continuum/webapp/WEB-INF/working-directory/23/ldapbrowser-help/target/docbook/docbook-xsl/html/chunker.xsl:98:18: Warning! Writing html/tasks_manage_connections_modify.html for section(tasks_manage_connections_modify)
     [xslt] file:/home/continuum/continuum-1.1/apps/continuum/webapp/WEB-INF/working-directory/23/ldapbrowser-help/target/docbook/docbook-xsl/html/chunker.xsl:98:18: Warning! Writing html/tasks_manage_connections_rename.html for section(tasks_manage_connections_rename)
     [xslt] file:/home/continuum/continuum-1.1/apps/continuum/webapp/WEB-INF/working-directory/23/ldapbrowser-help/target/docbook/docbook-xsl/html/chunker.xsl:98:18: Warning! Writing html/tasks_manage_connections_delete.html for section(tasks_manage_connections_delete)
     [xslt] file:/home/continuum/continuum-1.1/apps/continuum/webapp/WEB-INF/working-directory/23/ldapbrowser-help/target/docbook/docbook-xsl/html/chunker.xsl:98:18: Warning! Writing html/tasks_manage_connections_open.html for section(tasks_manage_connections_open)
     [xslt] file:/home/continuum/continuum-1.1/apps/continuum/webapp/WEB-INF/working-directory/23/ldapbrowser-help/target/docbook/docbook-xsl/html/chunker.xsl:98:18: Warning! Writing html/tasks_manage_connections_close.html for section(tasks_manage_connections_close)
     [xslt] file:/home/continuum/continuum-1.1/apps/continuum/webapp/WEB-INF/working-directory/23/ldapbrowser-help/target/docbook/docbook-xsl/html/chunker.xsl:98:18: Warning! Writing html/tasks_manage_connections_secure.html for section(tasks_manage_connections_secure)
     [xslt] file:/home/continuum/continuum-1.1/apps/continuum/webapp/WEB-INF/working-directory/23/ldapbrowser-help/target/docbook/docbook-xsl/html/chunker.xsl:98:18: Warning! Writing html/tasks_manage_connections.html for section(tasks_manage_connections)
     [xslt] file:/home/continuum/continuum-1.1/apps/continuum/webapp/WEB-INF/working-directory/23/ldapbrowser-help/target/docbook/docbook-xsl/html/chunker.xsl:98:18: Warning! Writing html/tasks_browse_directory_handle_large_trees.html for section(tasks_browse_directory_handle_large_trees)
     [xslt] file:/home/continuum/continuum-1.1/apps/continuum/webapp/WEB-INF/working-directory/23/ldapbrowser-help/target/docbook/docbook-xsl/html/chunker.xsl:98:18: Warning! Writing html/tasks_browse_directory_show_metadata.html for section(tasks_browse_directory_show_metadata)
     [xslt] file:/home/continuum/continuum-1.1/apps/continuum/webapp/WEB-INF/working-directory/23/ldapbrowser-help/target/docbook/docbook-xsl/html/chunker.xsl:98:18: Warning! Writing html/tasks_browse_directory_show_subentries.html for section(tasks_browse_directory_show_subentries)
     [xslt] file:/home/continuum/continuum-1.1/apps/continuum/webapp/WEB-INF/working-directory/23/ldapbrowser-help/target/docbook/docbook-xsl/html/chunker.xsl:98:18: Warning! Writing html/tasks_browse_directory_display_attributes.html for section(tasks_browse_directory_display_attributes)
     [xslt] file:/home/continuum/continuum-1.1/apps/continuum/webapp/WEB-INF/working-directory/23/ldapbrowser-help/target/docbook/docbook-xsl/html/chunker.xsl:98:18: Warning! Writing html/tasks_browse_directory_filter_attributes.html for section(tasks_browse_directory_filter_attributes)
     [xslt] file:/home/continuum/continuum-1.1/apps/continuum/webapp/WEB-INF/working-directory/23/ldapbrowser-help/target/docbook/docbook-xsl/html/chunker.xsl:98:18: Warning! Writing html/tasks_browse_directory_display_operational_attributes.html for section(tasks_browse_directory_display_operational_attributes)
     [xslt] file:/home/continuum/continuum-1.1/apps/continuum/webapp/WEB-INF/working-directory/23/ldapbrowser-help/target/docbook/docbook-xsl/html/chunker.xsl:98:18: Warning! Writing html/tasks_browse_directory.html for section(tasks_browse_directory)
     [xslt] file:/home/continuum/continuum-1.1/apps/continuum/webapp/WEB-INF/working-directory/23/ldapbrowser-help/target/docbook/docbook-xsl/html/chunker.xsl:98:18: Warning! Writing html/tasks_manage_entries_create.html for section(tasks_manage_entries_create)
     [xslt] file:/home/continuum/continuum-1.1/apps/continuum/webapp/WEB-INF/working-directory/23/ldapbrowser-help/target/docbook/docbook-xsl/html/chunker.xsl:98:18: Warning! Writing html/tasks_manage_entries_rename.html for section(tasks_manage_entries_rename)
     [xslt] file:/home/continuum/continuum-1.1/apps/continuum/webapp/WEB-INF/working-directory/23/ldapbrowser-help/target/docbook/docbook-xsl/html/chunker.xsl:98:18: Warning! Writing html/tasks_manage_entries_move.html for section(tasks_manage_entries_move)
     [xslt] file:/home/continuum/continuum-1.1/apps/continuum/webapp/WEB-INF/working-directory/23/ldapbrowser-help/target/docbook/docbook-xsl/html/chunker.xsl:98:18: Warning! Writing html/tasks_manage_entries_delete.html for section(tasks_manage_entries_delete)
     [xslt] file:/home/continuum/continuum-1.1/apps/continuum/webapp/WEB-INF/working-directory/23/ldapbrowser-help/target/docbook/docbook-xsl/html/chunker.xsl:98:18: Warning! Writing html/tasks_manage_entries_addattribute.html for section(tasks_manage_entries_addattribute)
     [xslt] file:/home/continuum/continuum-1.1/apps/continuum/webapp/WEB-INF/working-directory/23/ldapbrowser-help/target/docbook/docbook-xsl/html/chunker.xsl:98:18: Warning! Writing html/tasks_manage_entries_addvalue.html for section(tasks_manage_entries_addvalue)
     [xslt] file:/home/continuum/continuum-1.1/apps/continuum/webapp/WEB-INF/working-directory/23/ldapbrowser-help/target/docbook/docbook-xsl/html/chunker.xsl:98:18: Warning! Writing html/tasks_manage_entries_modifyvalue.html for section(tasks_manage_entries_modifyvalue)
     [xslt] file:/home/continuum/continuum-1.1/apps/continuum/webapp/WEB-INF/working-directory/23/ldapbrowser-help/target/docbook/docbook-xsl/html/chunker.xsl:98:18: Warning! Writing html/tasks_manage_entries_deletevalue.html for section(tasks_manage_entries_deletevalue)
     [xslt] file:/home/continuum/continuum-1.1/apps/continuum/webapp/WEB-INF/working-directory/23/ldapbrowser-help/target/docbook/docbook-xsl/html/chunker.xsl:98:18: Warning! Writing html/tasks_manage_entries_modifyobjectclass.html for section(tasks_manage_entries_modifyobjectclass)
     [xslt] file:/home/continuum/continuum-1.1/apps/continuum/webapp/WEB-INF/working-directory/23/ldapbrowser-help/target/docbook/docbook-xsl/html/chunker.xsl:98:18: Warning! Writing html/tasks_manage_entries.html for section(tasks_manage_entries)
     [xslt] file:/home/continuum/continuum-1.1/apps/continuum/webapp/WEB-INF/working-directory/23/ldapbrowser-help/target/docbook/docbook-xsl/html/chunker.xsl:98:18: Warning! Writing html/tasks.html for chapter(tasks)
     [xslt] file:/home/continuum/continuum-1.1/apps/continuum/webapp/WEB-INF/working-directory/23/ldapbrowser-help/target/docbook/docbook-xsl/html/chunker.xsl:98:18: Warning! Writing html/reference.html for chapter(reference)
     [xslt] file:/home/continuum/continuum-1.1/apps/continuum/webapp/WEB-INF/working-directory/23/ldapbrowser-help/target/docbook/docbook-xsl/html/chunker.xsl:98:18: Warning! Writing html/tipsandtricks.html for chapter(tipsandtricks)
     [xslt] file:/home/continuum/continuum-1.1/apps/continuum/webapp/WEB-INF/working-directory/23/ldapbrowser-help/target/docbook/docbook-xsl/html/html.xsl:148:18: Warning! ID recommended on simplesect: What's new in 1.2.0
     [xslt] file:/home/continuum/continuum-1.1/apps/continuum/webapp/WEB-INF/working-directory/23/ldapbrowser-help/target/docbook/docbook-xsl/html/html.xsl:148:18: Warning! ID recommended on simplesect: What's new in 1.1.0
     [xslt] file:/home/continuum/continuum-1.1/apps/continuum/webapp/WEB-INF/working-directory/23/ldapbrowser-help/target/docbook/docbook-xsl/html/chunker.xsl:98:18: Warning! Writing html/whats_new.html for chapter(whats_new)
     [xslt] file:/home/continuum/continuum-1.1/apps/continuum/webapp/WEB-INF/working-directory/23/ldapbrowser-help/target/docbook/docbook-xsl/html/html.xsl:148:18: Warning! ID recommended on simplesect: Apache Directory Studio 1.2.0 - (2008, a...
     [xslt] file:/home/continuum/continuum-1.1/apps/continuum/webapp/WEB-INF/working-directory/23/ldapbrowser-help/target/docbook/docbook-xsl/html/html.xsl:148:18: Warning! ID recommended on simplesect: 
     [xslt] 			Apache Directory Studio 1.1.0 - (200...
     [xslt] file:/home/continuum/continuum-1.1/apps/continuum/webapp/WEB-INF/working-directory/23/ldapbrowser-help/target/docbook/docbook-xsl/html/html.xsl:148:18: Warning! ID recommended on simplesect: 
     [xslt] 			Apache Directory Studio 1.0.1 - (200...
     [xslt] file:/home/continuum/continuum-1.1/apps/continuum/webapp/WEB-INF/working-directory/23/ldapbrowser-help/target/docbook/docbook-xsl/html/html.xsl:148:18: Warning! ID recommended on simplesect: 
     [xslt] 			Apache Directory Studio 1.0.0 - (200...
     [xslt] file:/home/continuum/continuum-1.1/apps/continuum/webapp/WEB-INF/working-directory/23/ldapbrowser-help/target/docbook/docbook-xsl/html/chunker.xsl:98:18: Warning! Writing html/release_notes.html for chapter(release_notes)
     [xslt] file:/home/continuum/continuum-1.1/apps/continuum/webapp/WEB-INF/working-directory/23/ldapbrowser-help/target/docbook/docbook-xsl/html/chunker.xsl:98:18: Warning! Writing html/index.html for book
     [xslt] file:/home/continuum/continuum-1.1/apps/continuum/webapp/WEB-INF/working-directory/23/ldapbrowser-help/target/docbook/docbook-xsl/html/chunker.xsl:98:18: Warning! Writing toc.xml
     [xslt] file:/home/continuum/continuum-1.1/apps/continuum/webapp/WEB-INF/working-directory/23/ldapbrowser-help/target/docbook/docbook-xsl/html/chunker.xsl:98:18: Warning! Writing plugin.xml
[INFO] Executed tasks
[INFO] [resources:testResources]
[INFO] Using default encoding to copy filtered resources.
[INFO] [compiler:testCompile]
[INFO] No sources to compile
[INFO] [surefire:test]
[INFO] Tests are skipped.
[INFO] [jar:jar]
[INFO] Building jar: /home/continuum/continuum-1.1/apps/continuum/webapp/WEB-INF/working-directory/23/ldapbrowser-help/target/ldapbrowser.help-1.3.0.SNAPSHOT.jar
[INFO] [tools:verify-legal-files {execution: verify-legal-files}]
[INFO] Checking legal files in: ldapbrowser.help-1.3.0.SNAPSHOT.jar
[INFO] [install:install]
[INFO] Installing /home/continuum/continuum-1.1/apps/continuum/webapp/WEB-INF/working-directory/23/ldapbrowser-help/target/ldapbrowser.help-1.3.0.SNAPSHOT.jar to /home/continuum/.m2/repository/org/apache/directory/studio/ldapbrowser.help/1.3.0.SNAPSHOT/ldapbrowser.help-1.3.0.SNAPSHOT.jar
[INFO] [deploy:deploy]
altDeploymentRepository = id::default::scpexe://vm094.oxylos.org/var/www/html/mirror-maven2/
[INFO] Using alternate deployment repository id::default::scpexe://vm094.oxylos.org/var/www/html/mirror-maven2/
[INFO] Retrieving previous build number from id
Uploading: scpexe://vm094.oxylos.org/var/www/html/mirror-maven2//org/apache/directory/studio/ldapbrowser.help/1.3.0.SNAPSHOT/ldapbrowser.help-1.3.0.SNAPSHOT.jar
[INFO] Uploading project information for ldapbrowser.help 1.3.0.SNAPSHOT
[INFO] Retrieving previous metadata from id
[INFO] Uploading repository metadata for: 'snapshot org.apache.directory.studio:ldapbrowser.help:1.3.0.SNAPSHOT'
[INFO] Retrieving previous metadata from id
[INFO] Uploading repository metadata for: 'artifact org.apache.directory.studio:ldapbrowser.help'
[INFO] ------------------------------------------------------------------------
[INFO] Building Apache Directory Studio Apache DS Configuration
[INFO]    task-segment: [clean, deploy]
[INFO] ------------------------------------------------------------------------
[INFO] [clean:clean]
[INFO] Deleting directory /home/continuum/continuum-1.1/apps/continuum/webapp/WEB-INF/working-directory/23/apacheds-configuration/target
[INFO] [remote-resources:process {execution: default}]
[INFO] [resources:resources]
[INFO] Using default encoding to copy filtered resources.
[INFO] [studio:prepare-jar-package {execution: default}]
[INFO] [compiler:compile]
[INFO] Compiling 111 source files to /home/continuum/continuum-1.1/apps/continuum/webapp/WEB-INF/working-directory/23/apacheds-configuration/target/classes
[INFO] [resources:testResources]
[INFO] Using default encoding to copy filtered resources.
[INFO] [compiler:testCompile]
[INFO] Nothing to compile - all classes are up to date
[INFO] [surefire:test]
[INFO] Tests are skipped.
[INFO] [jar:jar]
[INFO] Building jar: /home/continuum/continuum-1.1/apps/continuum/webapp/WEB-INF/working-directory/23/apacheds-configuration/target/apacheds.configuration-1.3.0.SNAPSHOT.jar
[INFO] [tools:verify-legal-files {execution: verify-legal-files}]
[INFO] Checking legal files in: apacheds.configuration-1.3.0.SNAPSHOT.jar
[INFO] [install:install]
[INFO] Installing /home/continuum/continuum-1.1/apps/continuum/webapp/WEB-INF/working-directory/23/apacheds-configuration/target/apacheds.configuration-1.3.0.SNAPSHOT.jar to /home/continuum/.m2/repository/org/apache/directory/studio/apacheds.configuration/1.3.0.SNAPSHOT/apacheds.configuration-1.3.0.SNAPSHOT.jar
[INFO] [deploy:deploy]
altDeploymentRepository = id::default::scpexe://vm094.oxylos.org/var/www/html/mirror-maven2/
[INFO] Using alternate deployment repository id::default::scpexe://vm094.oxylos.org/var/www/html/mirror-maven2/
[INFO] Retrieving previous build number from id
Uploading: scpexe://vm094.oxylos.org/var/www/html/mirror-maven2//org/apache/directory/studio/apacheds.configuration/1.3.0.SNAPSHOT/apacheds.configuration-1.3.0.SNAPSHOT.jar
[INFO] Uploading project information for apacheds.configuration 1.3.0.SNAPSHOT
[INFO] Retrieving previous metadata from id
[INFO] Uploading repository metadata for: 'artifact org.apache.directory.studio:apacheds.configuration'
[INFO] Retrieving previous metadata from id
[INFO] Uploading repository metadata for: 'snapshot org.apache.directory.studio:apacheds.configuration:1.3.0.SNAPSHOT'
[INFO] ------------------------------------------------------------------------
[INFO] Building Apache Directory Studio Apache DS Configuration Feature
[INFO]    task-segment: [clean, deploy]
[INFO] ------------------------------------------------------------------------
[INFO] [clean:clean]
[INFO] Deleting directory /home/continuum/continuum-1.1/apps/continuum/webapp/WEB-INF/working-directory/23/apacheds-configuration-feature/target
[INFO] [remote-resources:process {execution: default}]
[INFO] [resources:resources]
[INFO] Using default encoding to copy filtered resources.
[INFO] [compiler:compile]
[INFO] No sources to compile
[INFO] [resources:testResources]
[INFO] Using default encoding to copy filtered resources.
[INFO] [compiler:testCompile]
[INFO] No sources to compile
[INFO] [surefire:test]
[INFO] Tests are skipped.
[INFO] [jar:jar]
[INFO] Building jar: /home/continuum/continuum-1.1/apps/continuum/webapp/WEB-INF/working-directory/23/apacheds-configuration-feature/target/apacheds.configuration.feature-1.3.0.SNAPSHOT.jar
[INFO] [resources:resources {execution: default}]
[INFO] Using default encoding to copy filtered resources.
[INFO] [tools:verify-legal-files {execution: verify-legal-files}]
[INFO] Checking legal files in: apacheds.configuration.feature-1.3.0.SNAPSHOT.jar
[INFO] [install:install]
[INFO] Installing /home/continuum/continuum-1.1/apps/continuum/webapp/WEB-INF/working-directory/23/apacheds-configuration-feature/target/apacheds.configuration.feature-1.3.0.SNAPSHOT.jar to /home/continuum/.m2/repository/org/apache/directory/studio/apacheds.configuration.feature/1.3.0.SNAPSHOT/apacheds.configuration.feature-1.3.0.SNAPSHOT.jar
[INFO] [deploy:deploy]
altDeploymentRepository = id::default::scpexe://vm094.oxylos.org/var/www/html/mirror-maven2/
[INFO] Using alternate deployment repository id::default::scpexe://vm094.oxylos.org/var/www/html/mirror-maven2/
[INFO] Retrieving previous build number from id
Uploading: scpexe://vm094.oxylos.org/var/www/html/mirror-maven2//org/apache/directory/studio/apacheds.configuration.feature/1.3.0.SNAPSHOT/apacheds.configuration.feature-1.3.0.SNAPSHOT.jar
[INFO] Retrieving previous metadata from id
[INFO] Uploading repository metadata for: 'artifact org.apache.directory.studio:apacheds.configuration.feature'
[INFO] Uploading project information for apacheds.configuration.feature 1.3.0.SNAPSHOT
[INFO] Retrieving previous metadata from id
[INFO] Uploading repository metadata for: 'snapshot org.apache.directory.studio:apacheds.configuration.feature:1.3.0.SNAPSHOT'
[INFO] ------------------------------------------------------------------------
[INFO] Building Apache Directory Studio Apache DS Configuration Help
[INFO]    task-segment: [clean, deploy]
[INFO] ------------------------------------------------------------------------
[INFO] [clean:clean]
[INFO] Deleting directory /home/continuum/continuum-1.1/apps/continuum/webapp/WEB-INF/working-directory/23/apacheds-configuration-help/target
[INFO] [remote-resources:process {execution: default}]
[INFO] [resources:resources]
[INFO] Using default encoding to copy filtered resources.
[INFO] [dependency:unpack {execution: unpack-docbook-dependencies}]
[INFO] Configured Artifact: docbook:docbook-xml:?:zip
[INFO] Configured Artifact: docbook:docbook-xsl:?:zip
[INFO] Unpacking /home/continuum/.m2/repository/docbook/docbook-xml/4.5/docbook-xml-4.5.zipto
 /home/continuum/continuum-1.1/apps/continuum/webapp/WEB-INF/working-directory/23/apacheds-configuration-help/target/docbook/docbook-xml
with Includes null and excludes:null
[INFO] Unpacking /home/continuum/.m2/repository/docbook/docbook-xsl/1.71.1/docbook-xsl-1.71.1.zipto
 /home/continuum/continuum-1.1/apps/continuum/webapp/WEB-INF/working-directory/23/apacheds-configuration-help/target/docbook
with Includes null and excludes:null
[INFO] [compiler:compile]
[INFO] No sources to compile
[INFO] [antrun:run {execution: build-eclipse-help}]
[INFO] Executing tasks
     [move] Moving 1057 files to /home/continuum/continuum-1.1/apps/continuum/webapp/WEB-INF/working-directory/23/apacheds-configuration-help/target/docbook
     [xslt] Processing /home/continuum/continuum-1.1/apps/continuum/webapp/WEB-INF/working-directory/23/apacheds-configuration-help/target/docbook/documents/0_index.xml to /home/continuum/continuum-1.1/apps/continuum/webapp/WEB-INF/working-directory/23/apacheds-configuration-help/target/classes/index.html
     [xslt] Loading stylesheet /home/continuum/continuum-1.1/apps/continuum/webapp/WEB-INF/working-directory/23/apacheds-configuration-help/target/docbook/docbook-xsl/eclipse/eclipse.xsl
     [xslt] file:/home/continuum/continuum-1.1/apps/continuum/webapp/WEB-INF/working-directory/23/apacheds-configuration-help/target/docbook/docbook-xsl/html/chunker.xsl:98:18: Warning! Writing html/download_install.html for section(download_install)
     [xslt] file:/home/continuum/continuum-1.1/apps/continuum/webapp/WEB-INF/working-directory/23/apacheds-configuration-help/target/docbook/docbook-xsl/html/chunker.xsl:98:18: Warning! Writing html/configuration_editor_1.5.0_general.html for section(configuration_editor_1.5.0_general)
     [xslt] file:/home/continuum/continuum-1.1/apps/continuum/webapp/WEB-INF/working-directory/23/apacheds-configuration-help/target/docbook/docbook-xsl/html/chunker.xsl:98:18: Warning! Writing html/configuration_editor_1.5.0_partitions.html for section(configuration_editor_1.5.0_partitions)
     [xslt] file:/home/continuum/continuum-1.1/apps/continuum/webapp/WEB-INF/working-directory/23/apacheds-configuration-help/target/docbook/docbook-xsl/html/chunker.xsl:98:18: Warning! Writing html/configuration_editor_1.5.0_interceptors.html for section(configuration_editor_1.5.0_interceptors)
     [xslt] file:/home/continuum/continuum-1.1/apps/continuum/webapp/WEB-INF/working-directory/23/apacheds-configuration-help/target/docbook/docbook-xsl/html/chunker.xsl:98:18: Warning! Writing html/configuration_editor_1.5.0_extended_operations.html for section(configuration_editor_1.5.0_extended_operations)
     [xslt] file:/home/continuum/continuum-1.1/apps/continuum/webapp/WEB-INF/working-directory/23/apacheds-configuration-help/target/docbook/docbook-xsl/html/chunker.xsl:98:18: Warning! Writing html/configuration_editor_1.5.0.html for section(configuration_editor_1.5.0)
     [xslt] file:/home/continuum/continuum-1.1/apps/continuum/webapp/WEB-INF/working-directory/23/apacheds-configuration-help/target/docbook/docbook-xsl/html/chunker.xsl:98:18: Warning! Writing html/configuration_editor_1.5.1_general.html for section(configuration_editor_1.5.1_general)
     [xslt] file:/home/continuum/continuum-1.1/apps/continuum/webapp/WEB-INF/working-directory/23/apacheds-configuration-help/target/docbook/docbook-xsl/html/chunker.xsl:98:18: Warning! Writing html/configuration_editor_1.5.1_partitions.html for section(configuration_editor_1.5.1_partitions)
     [xslt] file:/home/continuum/continuum-1.1/apps/continuum/webapp/WEB-INF/working-directory/23/apacheds-configuration-help/target/docbook/docbook-xsl/html/chunker.xsl:98:18: Warning! Writing html/configuration_editor_1.5.1_interceptors.html for section(configuration_editor_1.5.1_interceptors)
     [xslt] file:/home/continuum/continuum-1.1/apps/continuum/webapp/WEB-INF/working-directory/23/apacheds-configuration-help/target/docbook/docbook-xsl/html/chunker.xsl:98:18: Warning! Writing html/configuration_editor_1.5.1_extended_operations.html for section(configuration_editor_1.5.1_extended_operations)
     [xslt] file:/home/continuum/continuum-1.1/apps/continuum/webapp/WEB-INF/working-directory/23/apacheds-configuration-help/target/docbook/docbook-xsl/html/chunker.xsl:98:18: Warning! Writing html/configuration_editor_1.5.1.html for section(configuration_editor_1.5.1)
     [xslt] file:/home/continuum/continuum-1.1/apps/continuum/webapp/WEB-INF/working-directory/23/apacheds-configuration-help/target/docbook/docbook-xsl/html/chunker.xsl:98:18: Warning! Writing html/configuration_editor_1.5.2_general.html for section(configuration_editor_1.5.2_general)
     [xslt] file:/home/continuum/continuum-1.1/apps/continuum/webapp/WEB-INF/working-directory/23/apacheds-configuration-help/target/docbook/docbook-xsl/html/chunker.xsl:98:18: Warning! Writing html/configuration_editor_1.5.2_authentication.html for section(configuration_editor_1.5.2_authentication)
     [xslt] file:/home/continuum/continuum-1.1/apps/continuum/webapp/WEB-INF/working-directory/23/apacheds-configuration-help/target/docbook/docbook-xsl/html/chunker.xsl:98:18: Warning! Writing html/configuration_editor_1.5.2_partitions.html for section(configuration_editor_1.5.2_partitions)
     [xslt] file:/home/continuum/continuum-1.1/apps/continuum/webapp/WEB-INF/working-directory/23/apacheds-configuration-help/target/docbook/docbook-xsl/html/chunker.xsl:98:18: Warning! Writing html/configuration_editor_1.5.2_interceptors.html for section(configuration_editor_1.5.2_interceptors)
     [xslt] file:/home/continuum/continuum-1.1/apps/continuum/webapp/WEB-INF/working-directory/23/apacheds-configuration-help/target/docbook/docbook-xsl/html/chunker.xsl:98:18: Warning! Writing html/configuration_editor_1.5.2_extended_operations.html for section(configuration_editor_1.5.2_extended_operations)
     [xslt] file:/home/continuum/continuum-1.1/apps/continuum/webapp/WEB-INF/working-directory/23/apacheds-configuration-help/target/docbook/docbook-xsl/html/chunker.xsl:98:18: Warning! Writing html/configuration_editor_1.5.2.html for section(configuration_editor_1.5.2)
     [xslt] file:/home/continuum/continuum-1.1/apps/continuum/webapp/WEB-INF/working-directory/23/apacheds-configuration-help/target/docbook/docbook-xsl/html/chunker.xsl:98:18: Warning! Writing html/configuration_editor_1.5.3_general.html for section(configuration_editor_1.5.3_general)
     [xslt] file:/home/continuum/continuum-1.1/apps/continuum/webapp/WEB-INF/working-directory/23/apacheds-configuration-help/target/docbook/docbook-xsl/html/chunker.xsl:98:18: Warning! Writing html/configuration_editor_1.5.3_authentication.html for section(configuration_editor_1.5.3_authentication)
     [xslt] file:/home/continuum/continuum-1.1/apps/continuum/webapp/WEB-INF/working-directory/23/apacheds-configuration-help/target/docbook/docbook-xsl/html/chunker.xsl:98:18: Warning! Writing html/configuration_editor_1.5.3_partitions.html for section(configuration_editor_1.5.3_partitions)
     [xslt] file:/home/continuum/continuum-1.1/apps/continuum/webapp/WEB-INF/working-directory/23/apacheds-configuration-help/target/docbook/docbook-xsl/html/chunker.xsl:98:18: Warning! Writing html/configuration_editor_1.5.3_interceptors.html for section(configuration_editor_1.5.3_interceptors)
     [xslt] file:/home/continuum/continuum-1.1/apps/continuum/webapp/WEB-INF/working-directory/23/apacheds-configuration-help/target/docbook/docbook-xsl/html/chunker.xsl:98:18: Warning! Writing html/configuration_editor_1.5.3_extended_operations.html for section(configuration_editor_1.5.3_extended_operations)
     [xslt] file:/home/continuum/continuum-1.1/apps/continuum/webapp/WEB-INF/working-directory/23/apacheds-configuration-help/target/docbook/docbook-xsl/html/chunker.xsl:98:18: Warning! Writing html/configuration_editor_1.5.3.html for section(configuration_editor_1.5.3)
     [xslt] file:/home/continuum/continuum-1.1/apps/continuum/webapp/WEB-INF/working-directory/23/apacheds-configuration-help/target/docbook/docbook-xsl/html/chunker.xsl:98:18: Warning! Writing html/configuration_editor.html for section(configuration_editor)
     [xslt] file:/home/continuum/continuum-1.1/apps/continuum/webapp/WEB-INF/working-directory/23/apacheds-configuration-help/target/docbook/docbook-xsl/html/chunker.xsl:98:18: Warning! Writing html/gettingstarted.html for chapter(gettingstarted)
     [xslt] file:/home/continuum/continuum-1.1/apps/continuum/webapp/WEB-INF/working-directory/23/apacheds-configuration-help/target/docbook/docbook-xsl/html/chunker.xsl:98:18: Warning! Writing html/open_server_configuration.html for section(open_server_configuration)
     [xslt] file:/home/continuum/continuum-1.1/apps/continuum/webapp/WEB-INF/working-directory/23/apacheds-configuration-help/target/docbook/docbook-xsl/html/chunker.xsl:98:18: Warning! Writing html/create_new_server_configuration.html for section(create_new_server_configuration)
     [xslt] file:/home/continuum/continuum-1.1/apps/continuum/webapp/WEB-INF/working-directory/23/apacheds-configuration-help/target/docbook/docbook-xsl/html/chunker.xsl:98:18: Warning! Writing html/tasks.html for chapter(tasks)
     [xslt] file:/home/continuum/continuum-1.1/apps/continuum/webapp/WEB-INF/working-directory/23/apacheds-configuration-help/target/docbook/docbook-xsl/html/html.xsl:148:18: Warning! ID recommended on simplesect: What's new in 1.2.0
     [xslt] file:/home/continuum/continuum-1.1/apps/continuum/webapp/WEB-INF/working-directory/23/apacheds-configuration-help/target/docbook/docbook-xsl/html/chunker.xsl:98:18: Warning! Writing html/whats_new.html for chapter(whats_new)
     [xslt] file:/home/continuum/continuum-1.1/apps/continuum/webapp/WEB-INF/working-directory/23/apacheds-configuration-help/target/docbook/docbook-xsl/html/html.xsl:148:18: Warning! ID recommended on simplesect: Apache Directory Studio 1.2.0 - (2008, a...
     [xslt] file:/home/continuum/continuum-1.1/apps/continuum/webapp/WEB-INF/working-directory/23/apacheds-configuration-help/target/docbook/docbook-xsl/html/html.xsl:148:18: Warning! ID recommended on simplesect: 
     [xslt] 			Apache Directory Studio 1.1.0 - (200...
     [xslt] file:/home/continuum/continuum-1.1/apps/continuum/webapp/WEB-INF/working-directory/23/apacheds-configuration-help/target/docbook/docbook-xsl/html/html.xsl:148:18: Warning! ID recommended on simplesect: Apache Directory Studio 1.0.0 - (2007, s...
     [xslt] file:/home/continuum/continuum-1.1/apps/continuum/webapp/WEB-INF/working-directory/23/apacheds-configuration-help/target/docbook/docbook-xsl/html/chunker.xsl:98:18: Warning! Writing html/release_notes.html for chapter(release_notes)
     [xslt] file:/home/continuum/continuum-1.1/apps/continuum/webapp/WEB-INF/working-directory/23/apacheds-configuration-help/target/docbook/docbook-xsl/html/chunker.xsl:98:18: Warning! Writing html/index.html for book
     [xslt] file:/home/continuum/continuum-1.1/apps/continuum/webapp/WEB-INF/working-directory/23/apacheds-configuration-help/target/docbook/docbook-xsl/html/chunker.xsl:98:18: Warning! Writing toc.xml
     [xslt] file:/home/continuum/continuum-1.1/apps/continuum/webapp/WEB-INF/working-directory/23/apacheds-configuration-help/target/docbook/docbook-xsl/html/chunker.xsl:98:18: Warning! Writing plugin.xml
[INFO] Executed tasks
[INFO] [resources:testResources]
[INFO] Using default encoding to copy filtered resources.
[INFO] [compiler:testCompile]
[INFO] No sources to compile
[INFO] [surefire:test]
[INFO] Tests are skipped.
[INFO] [jar:jar]
[INFO] Building jar: /home/continuum/continuum-1.1/apps/continuum/webapp/WEB-INF/working-directory/23/apacheds-configuration-help/target/apacheds.configuration.help-1.3.0.SNAPSHOT.jar
[INFO] [tools:verify-legal-files {execution: verify-legal-files}]
[INFO] Checking legal files in: apacheds.configuration.help-1.3.0.SNAPSHOT.jar
[INFO] [install:install]
[INFO] Installing /home/continuum/continuum-1.1/apps/continuum/webapp/WEB-INF/working-directory/23/apacheds-configuration-help/target/apacheds.configuration.help-1.3.0.SNAPSHOT.jar to /home/continuum/.m2/repository/org/apache/directory/studio/apacheds.configuration.help/1.3.0.SNAPSHOT/apacheds.configuration.help-1.3.0.SNAPSHOT.jar
[INFO] [deploy:deploy]
altDeploymentRepository = id::default::scpexe://vm094.oxylos.org/var/www/html/mirror-maven2/
[INFO] Using alternate deployment repository id::default::scpexe://vm094.oxylos.org/var/www/html/mirror-maven2/
[INFO] Retrieving previous build number from id
Uploading: scpexe://vm094.oxylos.org/var/www/html/mirror-maven2//org/apache/directory/studio/apacheds.configuration.help/1.3.0.SNAPSHOT/apacheds.configuration.help-1.3.0.SNAPSHOT.jar
[INFO] Uploading project information for apacheds.configuration.help 1.3.0.SNAPSHOT
[INFO] Retrieving previous metadata from id
[INFO] Uploading repository metadata for: 'snapshot org.apache.directory.studio:apacheds.configuration.help:1.3.0.SNAPSHOT'
[INFO] Retrieving previous metadata from id
[INFO] Uploading repository metadata for: 'artifact org.apache.directory.studio:apacheds.configuration.help'
[INFO] ------------------------------------------------------------------------
[INFO] Building Apache Directory Studio Apache DS Launcher
[INFO]    task-segment: [clean, deploy]
[INFO] ------------------------------------------------------------------------
[INFO] [clean:clean]
[INFO] Deleting directory /home/continuum/continuum-1.1/apps/continuum/webapp/WEB-INF/working-directory/23/apacheds-launcher/target
[INFO] [remote-resources:process {execution: default}]
[INFO] [resources:resources]
[INFO] Using default encoding to copy filtered resources.
[INFO] [compiler:compile]
[INFO] Compiling 2 source files to /home/continuum/continuum-1.1/apps/continuum/webapp/WEB-INF/working-directory/23/apacheds-launcher/target/classes
[INFO] [resources:testResources]
[INFO] Using default encoding to copy filtered resources.
[INFO] [compiler:testCompile]
[INFO] No sources to compile
[INFO] [surefire:test]
[INFO] Surefire report directory: /home/continuum/continuum-1.1/apps/continuum/webapp/WEB-INF/working-directory/23/apacheds-launcher/target/surefire-reports

-------------------------------------------------------
 T E S T S
-------------------------------------------------------
There are no tests to run.

Results :

Tests run: 0, Failures: 0, Errors: 0, Skipped: 0

[INFO] [jar:jar]
[INFO] Building jar: /home/continuum/continuum-1.1/apps/continuum/webapp/WEB-INF/working-directory/23/apacheds-launcher/target/apacheds-launcher-1.2.0.jar
[INFO] [tools:verify-legal-files {execution: verify-legal-files}]
[INFO] Checking legal files in: apacheds-launcher-1.2.0.jar
[INFO] [install:install]
[INFO] Installing /home/continuum/continuum-1.1/apps/continuum/webapp/WEB-INF/working-directory/23/apacheds-launcher/target/apacheds-launcher-1.2.0.jar to /home/continuum/.m2/repository/org/apache/directory/studio/apacheds-launcher/1.2.0/apacheds-launcher-1.2.0.jar
[INFO] [deploy:deploy]
altDeploymentRepository = id::default::scpexe://vm094.oxylos.org/var/www/html/mirror-maven2/
[INFO] Using alternate deployment repository id::default::scpexe://vm094.oxylos.org/var/www/html/mirror-maven2/
Uploading: scpexe://vm094.oxylos.org/var/www/html/mirror-maven2//org/apache/directory/studio/apacheds-launcher/1.2.0/apacheds-launcher-1.2.0.jar
[INFO] Retrieving previous metadata from id
[INFO] Uploading repository metadata for: 'artifact org.apache.directory.studio:apacheds-launcher'
[INFO] Uploading project information for apacheds-launcher 1.2.0
[INFO] ------------------------------------------------------------------------
[INFO] Building Apache Directory Studio Apache DS
[INFO]    task-segment: [clean, deploy]
[INFO] ------------------------------------------------------------------------
[INFO] [clean:clean]
[INFO] Deleting directory /home/continuum/continuum-1.1/apps/continuum/webapp/WEB-INF/working-directory/23/apacheds/target
[INFO] [remote-resources:process {execution: default}]
[INFO] [resources:resources]
[INFO] Using default encoding to copy filtered resources.
[INFO] [studio:prepare-jar-package {execution: default}]
[INFO] Copying /home/continuum/.m2/repository/org/apache/mina/mina-core/1.1.6/mina-core-1.1.6.jar to
               /home/continuum/continuum-1.1/apps/continuum/webapp/WEB-INF/working-directory/23/apacheds/target/classes/lib/mina-core-1.1.6.jar
[INFO] Copying /home/continuum/.m2/repository/org/slf4j/slf4j-api/1.4.3/slf4j-api-1.4.3.jar to
               /home/continuum/continuum-1.1/apps/continuum/webapp/WEB-INF/working-directory/23/apacheds/target/classes/lib/slf4j-api-1.4.3.jar
[INFO] [dependency:copy {execution: copy-server-libraries}]
[INFO] Configured Artifact: antlr:antlr:?:jar
[INFO] Configured Artifact: org.apache.directory.server:apacheds-bootstrap-extract:?:jar
[INFO] Configured Artifact: org.apache.directory.server:apacheds-bootstrap-partition:?:jar
[INFO] Configured Artifact: org.apache.directory.server:apacheds-btree-base:?:jar
[INFO] Configured Artifact: org.apache.directory.server:apacheds-core:?:jar
[INFO] Configured Artifact: org.apache.directory.server:apacheds-core-constants:?:jar
[INFO] Configured Artifact: org.apache.directory.server:apacheds-core-entry:?:jar
[INFO] Configured Artifact: org.apache.directory.server:apacheds-core-shared:?:jar
[INFO] Configured Artifact: org.apache.directory.server:apacheds-jdbm:?:jar
[INFO] Configured Artifact: org.apache.directory.server:apacheds-jdbm-store:?:jar
[INFO] Configured Artifact: org.apache.directory.server:apacheds-kerberos-shared:?:jar
[INFO] Configured Artifact: org.apache.directory.studio:apacheds-launcher:?:jar
[INFO] Configured Artifact: org.apache.directory.server:apacheds-protocol-changepw:?:jar
[INFO] Configured Artifact: org.apache.directory.server:apacheds-protocol-dns:?:jar
[INFO] Configured Artifact: org.apache.directory.server:apacheds-protocol-kerberos:?:jar
[INFO] Configured Artifact: org.apache.directory.server:apacheds-protocol-ldap:?:jar
[INFO] Configured Artifact: org.apache.directory.server:apacheds-protocol-ldap:?:jar
[INFO] Configured Artifact: org.apache.directory.server:apacheds-protocol-ntp:?:jar
[INFO] Configured Artifact: org.apache.directory.server:apacheds-protocol-shared:?:jar
[INFO] Configured Artifact: org.apache.directory.server:apacheds-schema-bootstrap:?:jar
[INFO] Configured Artifact: org.apache.directory.server:apacheds-schema-extras:?:jar
[INFO] Configured Artifact: org.apache.directory.server:apacheds-schema-registries:?:jar
[INFO] Configured Artifact: org.apache.directory.server:apacheds-server-jndi:?:jar
[INFO] Configured Artifact: org.apache.directory.server:apacheds-server-xml:?:jar
[INFO] Configured Artifact: org.apache.directory.server:apacheds-utils:?:jar
[INFO] Configured Artifact: org.apache.directory.server:apacheds-xbean-spring:?:jar
[INFO] Configured Artifact: commons-cli:commons-cli:?:jar
[INFO] Configured Artifact: commons-collections:commons-collections:?:jar
[INFO] Configured Artifact: commons-daemon:commons-daemon:?:jar
[INFO] Configured Artifact: commons-lang:commons-lang:?:jar
[INFO] Configured Artifact: org.apache.directory.daemon:daemon-bootstrappers:?:jar
[INFO] Configured Artifact: org.slf4j:jcl104-over-slf4j:?:jar
[INFO] Configured Artifact: log4j:log4j:?:jar
[INFO] Configured Artifact: org.apache.mina:mina-core:?:jar
[INFO] Configured Artifact: org.apache.mina:mina-filter-ssl:?:jar
[INFO] Configured Artifact: org.apache.directory.shared:shared-asn1:?:jar
[INFO] Configured Artifact: org.apache.directory.shared:shared-asn1-codec:?:jar
[INFO] Configured Artifact: org.apache.directory.shared:shared-bouncycastle-reduced:?:jar
[INFO] Configured Artifact: org.apache.directory.shared:shared-ldap:?:jar
[INFO] Configured Artifact: org.apache.directory.shared:shared-ldap-constants:?:jar
[INFO] Configured Artifact: org.slf4j:slf4j-api:?:jar
[INFO] Configured Artifact: org.slf4j:slf4j-log4j12:?:jar
[INFO] Configured Artifact: org.springframework:spring-beans:?:jar
[INFO] Configured Artifact: org.springframework:spring-context:?:jar
[INFO] Configured Artifact: org.springframework:spring-core:?:jar
[INFO] Configured Artifact: org.apache.xbean:xbean-spring:?:jar
[INFO] antlr:antlr:2.7.7:jar already exists in /home/continuum/continuum-1.1/apps/continuum/webapp/WEB-INF/working-directory/23/apacheds/resources/libs
[INFO] org.apache.directory.server:apacheds-bootstrap-extract:1.5.3:jar already exists in /home/continuum/continuum-1.1/apps/continuum/webapp/WEB-INF/working-directory/23/apacheds/resources/libs
[INFO] org.apache.directory.server:apacheds-bootstrap-partition:1.5.3:jar already exists in /home/continuum/continuum-1.1/apps/continuum/webapp/WEB-INF/working-directory/23/apacheds/resources/libs
[INFO] org.apache.directory.server:apacheds-btree-base:1.5.3:jar already exists in /home/continuum/continuum-1.1/apps/continuum/webapp/WEB-INF/working-directory/23/apacheds/resources/libs
[INFO] org.apache.directory.server:apacheds-core:1.5.3:jar already exists in /home/continuum/continuum-1.1/apps/continuum/webapp/WEB-INF/working-directory/23/apacheds/resources/libs
[INFO] org.apache.directory.server:apacheds-core-constants:1.5.3:jar already exists in /home/continuum/continuum-1.1/apps/continuum/webapp/WEB-INF/working-directory/23/apacheds/resources/libs
[INFO] org.apache.directory.server:apacheds-core-entry:1.5.3:jar already exists in /home/continuum/continuum-1.1/apps/continuum/webapp/WEB-INF/working-directory/23/apacheds/resources/libs
[INFO] org.apache.directory.server:apacheds-core-shared:1.5.3:jar already exists in /home/continuum/continuum-1.1/apps/continuum/webapp/WEB-INF/working-directory/23/apacheds/resources/libs
[INFO] org.apache.directory.server:apacheds-jdbm:1.5.3:jar already exists in /home/continuum/continuum-1.1/apps/continuum/webapp/WEB-INF/working-directory/23/apacheds/resources/libs
[INFO] org.apache.directory.server:apacheds-jdbm-store:1.5.3:jar already exists in /home/continuum/continuum-1.1/apps/continuum/webapp/WEB-INF/working-directory/23/apacheds/resources/libs
[INFO] org.apache.directory.server:apacheds-kerberos-shared:1.5.3:jar already exists in /home/continuum/continuum-1.1/apps/continuum/webapp/WEB-INF/working-directory/23/apacheds/resources/libs
[INFO] Copying apacheds-launcher-1.2.0.jar to /home/continuum/continuum-1.1/apps/continuum/webapp/WEB-INF/working-directory/23/apacheds/resources/libs/apacheds-launcher-1.2.0.jar
[INFO] org.apache.directory.server:apacheds-protocol-changepw:1.5.3:jar already exists in /home/continuum/continuum-1.1/apps/continuum/webapp/WEB-INF/working-directory/23/apacheds/resources/libs
[INFO] org.apache.directory.server:apacheds-protocol-dns:1.5.3:jar already exists in /home/continuum/continuum-1.1/apps/continuum/webapp/WEB-INF/working-directory/23/apacheds/resources/libs
[INFO] org.apache.directory.server:apacheds-protocol-kerberos:1.5.3:jar already exists in /home/continuum/continuum-1.1/apps/continuum/webapp/WEB-INF/working-directory/23/apacheds/resources/libs
[INFO] org.apache.directory.server:apacheds-protocol-ldap:1.5.3:jar already exists in /home/continuum/continuum-1.1/apps/continuum/webapp/WEB-INF/working-directory/23/apacheds/resources/libs
[INFO] org.apache.directory.server:apacheds-protocol-ldap:1.5.3:jar already exists in /home/continuum/continuum-1.1/apps/continuum/webapp/WEB-INF/working-directory/23/apacheds/resources/libs
[INFO] org.apache.directory.server:apacheds-protocol-ntp:1.5.3:jar already exists in /home/continuum/continuum-1.1/apps/continuum/webapp/WEB-INF/working-directory/23/apacheds/resources/libs
[INFO] org.apache.directory.server:apacheds-protocol-shared:1.5.3:jar already exists in /home/continuum/continuum-1.1/apps/continuum/webapp/WEB-INF/working-directory/23/apacheds/resources/libs
[INFO] org.apache.directory.server:apacheds-schema-bootstrap:1.5.3:jar already exists in /home/continuum/continuum-1.1/apps/continuum/webapp/WEB-INF/working-directory/23/apacheds/resources/libs
[INFO] org.apache.directory.server:apacheds-schema-extras:1.5.3:jar already exists in /home/continuum/continuum-1.1/apps/continuum/webapp/WEB-INF/working-directory/23/apacheds/resources/libs
[INFO] org.apache.directory.server:apacheds-schema-registries:1.5.3:jar already exists in /home/continuum/continuum-1.1/apps/continuum/webapp/WEB-INF/working-directory/23/apacheds/resources/libs
[INFO] org.apache.directory.server:apacheds-server-jndi:1.5.3:jar already exists in /home/continuum/continuum-1.1/apps/continuum/webapp/WEB-INF/working-directory/23/apacheds/resources/libs
[INFO] org.apache.directory.server:apacheds-server-xml:1.5.3:jar already exists in /home/continuum/continuum-1.1/apps/continuum/webapp/WEB-INF/working-directory/23/apacheds/resources/libs
[INFO] org.apache.directory.server:apacheds-utils:1.5.3:jar already exists in /home/continuum/continuum-1.1/apps/continuum/webapp/WEB-INF/working-directory/23/apacheds/resources/libs
[INFO] org.apache.directory.server:apacheds-xbean-spring:1.5.3:jar already exists in /home/continuum/continuum-1.1/apps/continuum/webapp/WEB-INF/working-directory/23/apacheds/resources/libs
[INFO] commons-cli:commons-cli:1.1:jar already exists in /home/continuum/continuum-1.1/apps/continuum/webapp/WEB-INF/working-directory/23/apacheds/resources/libs
[INFO] commons-collections:commons-collections:3.2:jar already exists in /home/continuum/continuum-1.1/apps/continuum/webapp/WEB-INF/working-directory/23/apacheds/resources/libs
[INFO] commons-daemon:commons-daemon:1.0.1:jar already exists in /home/continuum/continuum-1.1/apps/continuum/webapp/WEB-INF/working-directory/23/apacheds/resources/libs
[INFO] commons-lang:commons-lang:2.3:jar already exists in /home/continuum/continuum-1.1/apps/continuum/webapp/WEB-INF/working-directory/23/apacheds/resources/libs
[INFO] org.apache.directory.daemon:daemon-bootstrappers:1.1.3:jar already exists in /home/continuum/continuum-1.1/apps/continuum/webapp/WEB-INF/working-directory/23/apacheds/resources/libs
[INFO] org.slf4j:jcl104-over-slf4j:1.4.3:jar already exists in /home/continuum/continuum-1.1/apps/continuum/webapp/WEB-INF/working-directory/23/apacheds/resources/libs
[INFO] log4j:log4j:1.2.14:jar already exists in /home/continuum/continuum-1.1/apps/continuum/webapp/WEB-INF/working-directory/23/apacheds/resources/libs
[INFO] org.apache.mina:mina-core:1.1.6:jar already exists in /home/continuum/continuum-1.1/apps/continuum/webapp/WEB-INF/working-directory/23/apacheds/resources/libs
[INFO] org.apache.mina:mina-filter-ssl:1.1.6:jar already exists in /home/continuum/continuum-1.1/apps/continuum/webapp/WEB-INF/working-directory/23/apacheds/resources/libs
[INFO] org.apache.directory.shared:shared-asn1:0.9.11:jar already exists in /home/continuum/continuum-1.1/apps/continuum/webapp/WEB-INF/working-directory/23/apacheds/resources/libs
[INFO] org.apache.directory.shared:shared-asn1-codec:0.9.11:jar already exists in /home/continuum/continuum-1.1/apps/continuum/webapp/WEB-INF/working-directory/23/apacheds/resources/libs
[INFO] org.apache.directory.shared:shared-bouncycastle-reduced:0.9.11:jar already exists in /home/continuum/continuum-1.1/apps/continuum/webapp/WEB-INF/working-directory/23/apacheds/resources/libs
[INFO] org.apache.directory.shared:shared-ldap:0.9.11:jar already exists in /home/continuum/continuum-1.1/apps/continuum/webapp/WEB-INF/working-directory/23/apacheds/resources/libs
[INFO] org.apache.directory.shared:shared-ldap-constants:0.9.11:jar already exists in /home/continuum/continuum-1.1/apps/continuum/webapp/WEB-INF/working-directory/23/apacheds/resources/libs
[INFO] org.slf4j:slf4j-api:1.4.3:jar already exists in /home/continuum/continuum-1.1/apps/continuum/webapp/WEB-INF/working-directory/23/apacheds/resources/libs
[INFO] org.slf4j:slf4j-log4j12:1.4.3:jar already exists in /home/continuum/continuum-1.1/apps/continuum/webapp/WEB-INF/working-directory/23/apacheds/resources/libs
[INFO] org.springframework:spring-beans:2.0.6:jar already exists in /home/continuum/continuum-1.1/apps/continuum/webapp/WEB-INF/working-directory/23/apacheds/resources/libs
[INFO] org.springframework:spring-context:2.0.6:jar already exists in /home/continuum/continuum-1.1/apps/continuum/webapp/WEB-INF/working-directory/23/apacheds/resources/libs
[INFO] org.springframework:spring-core:2.0.6:jar already exists in /home/continuum/continuum-1.1/apps/continuum/webapp/WEB-INF/working-directory/23/apacheds/resources/libs
[INFO] org.apache.xbean:xbean-spring:3.3:jar already exists in /home/continuum/continuum-1.1/apps/continuum/webapp/WEB-INF/working-directory/23/apacheds/resources/libs
[INFO] [compiler:compile]
[INFO] Compiling 40 source files to /home/continuum/continuum-1.1/apps/continuum/webapp/WEB-INF/working-directory/23/apacheds/target/classes
[INFO] [resources:testResources]
[INFO] Using default encoding to copy filtered resources.
[INFO] [compiler:testCompile]
[INFO] No sources to compile
[INFO] [surefire:test]
[INFO] Surefire report directory: /home/continuum/continuum-1.1/apps/continuum/webapp/WEB-INF/working-directory/23/apacheds/target/surefire-reports

-------------------------------------------------------
 T E S T S
-------------------------------------------------------
There are no tests to run.

Results :

Tests run: 0, Failures: 0, Errors: 0, Skipped: 0

[INFO] [jar:jar]
[INFO] Building jar: /home/continuum/continuum-1.1/apps/continuum/webapp/WEB-INF/working-directory/23/apacheds/target/apacheds-1.3.0.SNAPSHOT.jar
[INFO] [tools:verify-legal-files {execution: verify-legal-files}]
[INFO] Checking legal files in: apacheds-1.3.0.SNAPSHOT.jar
[INFO] [install:install]
[INFO] Installing /home/continuum/continuum-1.1/apps/continuum/webapp/WEB-INF/working-directory/23/apacheds/target/apacheds-1.3.0.SNAPSHOT.jar to /home/continuum/.m2/repository/org/apache/directory/studio/apacheds/1.3.0.SNAPSHOT/apacheds-1.3.0.SNAPSHOT.jar
[INFO] [deploy:deploy]
altDeploymentRepository = id::default::scpexe://vm094.oxylos.org/var/www/html/mirror-maven2/
[INFO] Using alternate deployment repository id::default::scpexe://vm094.oxylos.org/var/www/html/mirror-maven2/
[INFO] Retrieving previous build number from id
Uploading: scpexe://vm094.oxylos.org/var/www/html/mirror-maven2//org/apache/directory/studio/apacheds/1.3.0.SNAPSHOT/apacheds-1.3.0.SNAPSHOT.jar
[INFO] Uploading project information for apacheds 1.3.0.SNAPSHOT
[INFO] Retrieving previous metadata from id
[INFO] Uploading repository metadata for: 'artifact org.apache.directory.studio:apacheds'
[INFO] Retrieving previous metadata from id
[INFO] Uploading repository metadata for: 'snapshot org.apache.directory.studio:apacheds:1.3.0.SNAPSHOT'
[INFO] ------------------------------------------------------------------------
[INFO] Building Apache Directory Studio Apache DS Help
[INFO]    task-segment: [clean, deploy]
[INFO] ------------------------------------------------------------------------
[INFO] [clean:clean]
[INFO] Deleting directory /home/continuum/continuum-1.1/apps/continuum/webapp/WEB-INF/working-directory/23/apacheds-help/target
[INFO] [remote-resources:process {execution: default}]
[INFO] [resources:resources]
[INFO] Using default encoding to copy filtered resources.
[INFO] [dependency:unpack {execution: unpack-docbook-dependencies}]
[INFO] Configured Artifact: docbook:docbook-xml:?:zip
[INFO] Configured Artifact: docbook:docbook-xsl:?:zip
[INFO] Unpacking /home/continuum/.m2/repository/docbook/docbook-xml/4.5/docbook-xml-4.5.zipto
 /home/continuum/continuum-1.1/apps/continuum/webapp/WEB-INF/working-directory/23/apacheds-help/target/docbook/docbook-xml
with Includes null and excludes:null
[INFO] Unpacking /home/continuum/.m2/repository/docbook/docbook-xsl/1.71.1/docbook-xsl-1.71.1.zipto
 /home/continuum/continuum-1.1/apps/continuum/webapp/WEB-INF/working-directory/23/apacheds-help/target/docbook
with Includes null and excludes:null
[INFO] [compiler:compile]
[INFO] No sources to compile
[INFO] [antrun:run {execution: build-eclipse-help}]
[INFO] Executing tasks
     [move] Moving 1057 files to /home/continuum/continuum-1.1/apps/continuum/webapp/WEB-INF/working-directory/23/apacheds-help/target/docbook
     [xslt] Processing /home/continuum/continuum-1.1/apps/continuum/webapp/WEB-INF/working-directory/23/apacheds-help/target/docbook/documents/0_index.xml to /home/continuum/continuum-1.1/apps/continuum/webapp/WEB-INF/working-directory/23/apacheds-help/target/classes/index.html
     [xslt] Loading stylesheet /home/continuum/continuum-1.1/apps/continuum/webapp/WEB-INF/working-directory/23/apacheds-help/target/docbook/docbook-xsl/eclipse/eclipse.xsl
     [xslt] file:/home/continuum/continuum-1.1/apps/continuum/webapp/WEB-INF/working-directory/23/apacheds-help/target/docbook/docbook-xsl/html/chunker.xsl:98:18: Warning! Writing html/gettingstarted_download_install.html for section(gettingstarted_download_install)
     [xslt] file:/home/continuum/continuum-1.1/apps/continuum/webapp/WEB-INF/working-directory/23/apacheds-help/target/docbook/docbook-xsl/html/chunker.xsl:98:18: Warning! Writing html/gettingstarted_views_servers.html for section(gettingstarted_views_servers)
     [xslt] file:/home/continuum/continuum-1.1/apps/continuum/webapp/WEB-INF/working-directory/23/apacheds-help/target/docbook/docbook-xsl/html/chunker.xsl:98:18: Warning! Writing html/gettingstarted_views.html for section(gettingstarted_views)
     [xslt] file:/home/continuum/continuum-1.1/apps/continuum/webapp/WEB-INF/working-directory/23/apacheds-help/target/docbook/docbook-xsl/html/chunker.xsl:98:18: Warning! Writing html/gettingstarted_editors_apacheds_configuration.html for section(gettingstarted_editors_apacheds_configuration)
     [xslt] file:/home/continuum/continuum-1.1/apps/continuum/webapp/WEB-INF/working-directory/23/apacheds-help/target/docbook/docbook-xsl/html/chunker.xsl:98:18: Warning! Writing html/gettingstarted_editors.html for section(gettingstarted_editors)
     [xslt] file:/home/continuum/continuum-1.1/apps/continuum/webapp/WEB-INF/working-directory/23/apacheds-help/target/docbook/docbook-xsl/html/chunker.xsl:98:18: Warning! Writing html/gettingstarted.html for chapter(gettingstarted)
     [xslt] file:/home/continuum/continuum-1.1/apps/continuum/webapp/WEB-INF/working-directory/23/apacheds-help/target/docbook/docbook-xsl/html/chunker.xsl:98:18: Warning! Writing html/tasks_creating_new_server.html for section(tasks_creating_new_server)
     [xslt] file:/home/continuum/continuum-1.1/apps/continuum/webapp/WEB-INF/working-directory/23/apacheds-help/target/docbook/docbook-xsl/html/chunker.xsl:98:18: Warning! Writing html/tasks_starting_server.html for section(tasks_starting_server)
     [xslt] file:/home/continuum/continuum-1.1/apps/continuum/webapp/WEB-INF/working-directory/23/apacheds-help/target/docbook/docbook-xsl/html/chunker.xsl:98:18: Warning! Writing html/tasks_stopping_server.html for section(tasks_stopping_server)
     [xslt] file:/home/continuum/continuum-1.1/apps/continuum/webapp/WEB-INF/working-directory/23/apacheds-help/target/docbook/docbook-xsl/html/chunker.xsl:98:18: Warning! Writing html/tasks_editing_configuration.html for section(tasks_editing_configuration)
     [xslt] file:/home/continuum/continuum-1.1/apps/continuum/webapp/WEB-INF/working-directory/23/apacheds-help/target/docbook/docbook-xsl/html/chunker.xsl:98:18: Warning! Writing html/tasks_deleting_server.html for section(tasks_deleting_server)
     [xslt] file:/home/continuum/continuum-1.1/apps/continuum/webapp/WEB-INF/working-directory/23/apacheds-help/target/docbook/docbook-xsl/html/chunker.xsl:98:18: Warning! Writing html/tasks.html for chapter(tasks)
     [xslt] file:/home/continuum/continuum-1.1/apps/continuum/webapp/WEB-INF/working-directory/23/apacheds-help/target/docbook/docbook-xsl/html/chunker.xsl:98:18: Warning! Writing html/reference_preferences_colors_and_fonts.html for section(reference_preferences_colors_and_fonts)
     [xslt] file:/home/continuum/continuum-1.1/apps/continuum/webapp/WEB-INF/working-directory/23/apacheds-help/target/docbook/docbook-xsl/html/chunker.xsl:98:18: Warning! Writing html/reference_preferences_server_logs.html for section(reference_preferences_server_logs)
     [xslt] file:/home/continuum/continuum-1.1/apps/continuum/webapp/WEB-INF/working-directory/23/apacheds-help/target/docbook/docbook-xsl/html/chunker.xsl:98:18: Warning! Writing html/reference_preferences.html for section(reference_preferences)
     [xslt] file:/home/continuum/continuum-1.1/apps/continuum/webapp/WEB-INF/working-directory/23/apacheds-help/target/docbook/docbook-xsl/html/chunker.xsl:98:18: Warning! Writing html/reference.html for chapter(reference)
     [xslt] file:/home/continuum/continuum-1.1/apps/continuum/webapp/WEB-INF/working-directory/23/apacheds-help/target/docbook/docbook-xsl/html/html.xsl:148:18: Warning! ID recommended on simplesect: Apache Directory Studio 1.2.0 - (2008, a...
     [xslt] file:/home/continuum/continuum-1.1/apps/continuum/webapp/WEB-INF/working-directory/23/apacheds-help/target/docbook/docbook-xsl/html/chunker.xsl:98:18: Warning! Writing html/releasenotes.html for chapter(releasenotes)
     [xslt] file:/home/continuum/continuum-1.1/apps/continuum/webapp/WEB-INF/working-directory/23/apacheds-help/target/docbook/docbook-xsl/html/chunker.xsl:98:18: Warning! Writing html/index.html for book
     [xslt] file:/home/continuum/continuum-1.1/apps/continuum/webapp/WEB-INF/working-directory/23/apacheds-help/target/docbook/docbook-xsl/html/chunker.xsl:98:18: Warning! Writing toc.xml
     [xslt] file:/home/continuum/continuum-1.1/apps/continuum/webapp/WEB-INF/working-directory/23/apacheds-help/target/docbook/docbook-xsl/html/chunker.xsl:98:18: Warning! Writing plugin.xml
[INFO] Executed tasks
[INFO] [resources:testResources]
[INFO] Using default encoding to copy filtered resources.
[INFO] [compiler:testCompile]
[INFO] No sources to compile
[INFO] [surefire:test]
[INFO] Tests are skipped.
[INFO] [jar:jar]
[INFO] Building jar: /home/continuum/continuum-1.1/apps/continuum/webapp/WEB-INF/working-directory/23/apacheds-help/target/apacheds.help-1.3.0.SNAPSHOT.jar
[INFO] [tools:verify-legal-files {execution: verify-legal-files}]
[INFO] Checking legal files in: apacheds.help-1.3.0.SNAPSHOT.jar
[INFO] [install:install]
[INFO] Installing /home/continuum/continuum-1.1/apps/continuum/webapp/WEB-INF/working-directory/23/apacheds-help/target/apacheds.help-1.3.0.SNAPSHOT.jar to /home/continuum/.m2/repository/org/apache/directory/studio/apacheds.help/1.3.0.SNAPSHOT/apacheds.help-1.3.0.SNAPSHOT.jar
[INFO] [deploy:deploy]
altDeploymentRepository = id::default::scpexe://vm094.oxylos.org/var/www/html/mirror-maven2/
[INFO] Using alternate deployment repository id::default::scpexe://vm094.oxylos.org/var/www/html/mirror-maven2/
[INFO] Retrieving previous build number from id
Uploading: scpexe://vm094.oxylos.org/var/www/html/mirror-maven2//org/apache/directory/studio/apacheds.help/1.3.0.SNAPSHOT/apacheds.help-1.3.0.SNAPSHOT.jar
[INFO] Retrieving previous metadata from id
[INFO] Uploading repository metadata for: 'snapshot org.apache.directory.studio:apacheds.help:1.3.0.SNAPSHOT'
[INFO] Uploading project information for apacheds.help 1.3.0.SNAPSHOT
[INFO] Retrieving previous metadata from id
[INFO] Uploading repository metadata for: 'artifact org.apache.directory.studio:apacheds.help'
[INFO] ------------------------------------------------------------------------
[INFO] Building Apache Directory Studio Apache DS Feature
[INFO]    task-segment: [clean, deploy]
[INFO] ------------------------------------------------------------------------
[INFO] [clean:clean]
[INFO] Deleting directory /home/continuum/continuum-1.1/apps/continuum/webapp/WEB-INF/working-directory/23/apacheds-feature/target
[INFO] [remote-resources:process {execution: default}]
[INFO] [resources:resources]
[INFO] Using default encoding to copy filtered resources.
[INFO] [compiler:compile]
[INFO] No sources to compile
[INFO] [resources:testResources]
[INFO] Using default encoding to copy filtered resources.
[INFO] [compiler:testCompile]
[INFO] No sources to compile
[INFO] [surefire:test]
[INFO] Tests are skipped.
[INFO] [jar:jar]
[INFO] Building jar: /home/continuum/continuum-1.1/apps/continuum/webapp/WEB-INF/working-directory/23/apacheds-feature/target/apacheds.feature-1.3.0.SNAPSHOT.jar
[INFO] [resources:resources {execution: default}]
[INFO] Using default encoding to copy filtered resources.
[INFO] [tools:verify-legal-files {execution: verify-legal-files}]
[INFO] Checking legal files in: apacheds.feature-1.3.0.SNAPSHOT.jar
[INFO] [install:install]
[INFO] Installing /home/continuum/continuum-1.1/apps/continuum/webapp/WEB-INF/working-directory/23/apacheds-feature/target/apacheds.feature-1.3.0.SNAPSHOT.jar to /home/continuum/.m2/repository/org/apache/directory/studio/apacheds.feature/1.3.0.SNAPSHOT/apacheds.feature-1.3.0.SNAPSHOT.jar
[INFO] [deploy:deploy]
altDeploymentRepository = id::default::scpexe://vm094.oxylos.org/var/www/html/mirror-maven2/
[INFO] Using alternate deployment repository id::default::scpexe://vm094.oxylos.org/var/www/html/mirror-maven2/
[INFO] Retrieving previous build number from id
Uploading: scpexe://vm094.oxylos.org/var/www/html/mirror-maven2//org/apache/directory/studio/apacheds.feature/1.3.0.SNAPSHOT/apacheds.feature-1.3.0.SNAPSHOT.jar
[INFO] Uploading project information for apacheds.feature 1.3.0.SNAPSHOT
[INFO] Retrieving previous metadata from id
[INFO] Uploading repository metadata for: 'snapshot org.apache.directory.studio:apacheds.feature:1.3.0.SNAPSHOT'
[INFO] Retrieving previous metadata from id
[INFO] Uploading repository metadata for: 'artifact org.apache.directory.studio:apacheds.feature'
[INFO] ------------------------------------------------------------------------
[INFO] Building Apache Directory Studio Core Integration Tests
[INFO]    task-segment: [clean, deploy]
[INFO] ------------------------------------------------------------------------
[INFO] [clean:clean]
[INFO] Deleting directory /home/continuum/continuum-1.1/apps/continuum/webapp/WEB-INF/working-directory/23/test-integration-core/target
[INFO] [remote-resources:process {execution: default}]
[WARNING] Attempting to build MavenProject instance for Artifact (org.apache.commons:commons-io:1.3.2) of type: jar; constructing POM artifact instead.
[INFO] [resources:resources]
[INFO] Using default encoding to copy filtered resources.
[INFO] [studio:prepare-jar-package {execution: default}]
[INFO] Copying /home/continuum/.m2/repository/antlr/antlr/2.7.7/antlr-2.7.7.jar to
               /home/continuum/continuum-1.1/apps/continuum/webapp/WEB-INF/working-directory/23/test-integration-core/target/classes/lib/antlr-2.7.7.jar
[INFO] Copying /home/continuum/.m2/repository/org/apache/directory/server/apacheds-bootstrap-extract/1.5.3/apacheds-bootstrap-extract-1.5.3.jar to
               /home/continuum/continuum-1.1/apps/continuum/webapp/WEB-INF/working-directory/23/test-integration-core/target/classes/lib/apacheds-bootstrap-extract-1.5.3.jar
[INFO] Copying /home/continuum/.m2/repository/org/apache/directory/server/apacheds-bootstrap-partition/1.5.3/apacheds-bootstrap-partition-1.5.3.jar to
               /home/continuum/continuum-1.1/apps/continuum/webapp/WEB-INF/working-directory/23/test-integration-core/target/classes/lib/apacheds-bootstrap-partition-1.5.3.jar
[INFO] Copying /home/continuum/.m2/repository/org/apache/directory/server/apacheds-btree-base/1.5.3/apacheds-btree-base-1.5.3.jar to
               /home/continuum/continuum-1.1/apps/continuum/webapp/WEB-INF/working-directory/23/test-integration-core/target/classes/lib/apacheds-btree-base-1.5.3.jar
[INFO] Copying /home/continuum/.m2/repository/org/apache/directory/server/apacheds-core/1.5.3/apacheds-core-1.5.3.jar to
               /home/continuum/continuum-1.1/apps/continuum/webapp/WEB-INF/working-directory/23/test-integration-core/target/classes/lib/apacheds-core-1.5.3.jar
[INFO] Copying /home/continuum/.m2/repository/org/apache/directory/server/apacheds-core-constants/1.5.3/apacheds-core-constants-1.5.3.jar to
               /home/continuum/continuum-1.1/apps/continuum/webapp/WEB-INF/working-directory/23/test-integration-core/target/classes/lib/apacheds-core-constants-1.5.3.jar
[INFO] Copying /home/continuum/.m2/repository/org/apache/directory/server/apacheds-core-entry/1.5.3/apacheds-core-entry-1.5.3.jar to
               /home/continuum/continuum-1.1/apps/continuum/webapp/WEB-INF/working-directory/23/test-integration-core/target/classes/lib/apacheds-core-entry-1.5.3.jar
[INFO] Copying /home/continuum/.m2/repository/org/apache/directory/server/apacheds-core-integ/1.5.4-SNAPSHOT/apacheds-core-integ-1.5.4-SNAPSHOT.jar to
               /home/continuum/continuum-1.1/apps/continuum/webapp/WEB-INF/working-directory/23/test-integration-core/target/classes/lib/apacheds-core-integ-1.5.4-SNAPSHOT.jar
[INFO] Copying /home/continuum/.m2/repository/org/apache/directory/server/apacheds-core-jndi/1.5.4-SNAPSHOT/apacheds-core-jndi-1.5.4-SNAPSHOT.jar to
               /home/continuum/continuum-1.1/apps/continuum/webapp/WEB-INF/working-directory/23/test-integration-core/target/classes/lib/apacheds-core-jndi-1.5.4-SNAPSHOT.jar
[INFO] Copying /home/continuum/.m2/repository/org/apache/directory/server/apacheds-core-shared/1.5.3/apacheds-core-shared-1.5.3.jar to
               /home/continuum/continuum-1.1/apps/continuum/webapp/WEB-INF/working-directory/23/test-integration-core/target/classes/lib/apacheds-core-shared-1.5.3.jar
[INFO] Copying /home/continuum/.m2/repository/org/apache/directory/server/apacheds-core-unit/1.5.4-SNAPSHOT/apacheds-core-unit-1.5.4-SNAPSHOT.jar to
               /home/continuum/continuum-1.1/apps/continuum/webapp/WEB-INF/working-directory/23/test-integration-core/target/classes/lib/apacheds-core-unit-1.5.4-SNAPSHOT.jar
[INFO] Copying /home/continuum/.m2/repository/org/apache/directory/server/apacheds-interceptor-kerberos/1.5.4-SNAPSHOT/apacheds-interceptor-kerberos-1.5.4-SNAPSHOT.jar to
               /home/continuum/continuum-1.1/apps/continuum/webapp/WEB-INF/working-directory/23/test-integration-core/target/classes/lib/apacheds-interceptor-kerberos-1.5.4-SNAPSHOT.jar
[INFO] Copying /home/continuum/.m2/repository/org/apache/directory/server/apacheds-jdbm/1.5.3/apacheds-jdbm-1.5.3.jar to
               /home/continuum/continuum-1.1/apps/continuum/webapp/WEB-INF/working-directory/23/test-integration-core/target/classes/lib/apacheds-jdbm-1.5.3.jar
[INFO] Copying /home/continuum/.m2/repository/org/apache/directory/server/apacheds-jdbm-store/1.5.3/apacheds-jdbm-store-1.5.3.jar to
               /home/continuum/continuum-1.1/apps/continuum/webapp/WEB-INF/working-directory/23/test-integration-core/target/classes/lib/apacheds-jdbm-store-1.5.3.jar
[INFO] Copying /home/continuum/.m2/repository/org/apache/directory/server/apacheds-kerberos-shared/1.5.4-SNAPSHOT/apacheds-kerberos-shared-1.5.4-SNAPSHOT.jar to
               /home/continuum/continuum-1.1/apps/continuum/webapp/WEB-INF/working-directory/23/test-integration-core/target/classes/lib/apacheds-kerberos-shared-1.5.4-SNAPSHOT.jar
[INFO] Copying /home/continuum/.m2/repository/org/apache/directory/server/apacheds-protocol-ldap/1.5.3/apacheds-protocol-ldap-1.5.3.jar to
               /home/continuum/continuum-1.1/apps/continuum/webapp/WEB-INF/working-directory/23/test-integration-core/target/classes/lib/apacheds-protocol-ldap-1.5.3.jar
[INFO] Copying /home/continuum/.m2/repository/org/apache/directory/server/apacheds-protocol-shared/1.5.3/apacheds-protocol-shared-1.5.3.jar to
               /home/continuum/continuum-1.1/apps/continuum/webapp/WEB-INF/working-directory/23/test-integration-core/target/classes/lib/apacheds-protocol-shared-1.5.3.jar
[INFO] Copying /home/continuum/.m2/repository/org/apache/directory/server/apacheds-schema-bootstrap/1.5.3/apacheds-schema-bootstrap-1.5.3.jar to
               /home/continuum/continuum-1.1/apps/continuum/webapp/WEB-INF/working-directory/23/test-integration-core/target/classes/lib/apacheds-schema-bootstrap-1.5.3.jar
[INFO] Copying /home/continuum/.m2/repository/org/apache/directory/server/apacheds-schema-extras/1.5.3/apacheds-schema-extras-1.5.3.jar to
               /home/continuum/continuum-1.1/apps/continuum/webapp/WEB-INF/working-directory/23/test-integration-core/target/classes/lib/apacheds-schema-extras-1.5.3.jar
[INFO] Copying /home/continuum/.m2/repository/org/apache/directory/server/apacheds-schema-registries/1.5.3/apacheds-schema-registries-1.5.3.jar to
               /home/continuum/continuum-1.1/apps/continuum/webapp/WEB-INF/working-directory/23/test-integration-core/target/classes/lib/apacheds-schema-registries-1.5.3.jar
[INFO] Copying /home/continuum/.m2/repository/org/apache/directory/server/apacheds-server-jndi/1.5.3/apacheds-server-jndi-1.5.3.jar to
               /home/continuum/continuum-1.1/apps/continuum/webapp/WEB-INF/working-directory/23/test-integration-core/target/classes/lib/apacheds-server-jndi-1.5.3.jar
[INFO] Copying /home/continuum/.m2/repository/org/apache/directory/server/apacheds-server-unit/1.5.4-SNAPSHOT/apacheds-server-unit-1.5.4-SNAPSHOT.jar to
               /home/continuum/continuum-1.1/apps/continuum/webapp/WEB-INF/working-directory/23/test-integration-core/target/classes/lib/apacheds-server-unit-1.5.4-SNAPSHOT.jar
[INFO] Copying /home/continuum/.m2/repository/org/apache/directory/server/apacheds-utils/1.5.3/apacheds-utils-1.5.3.jar to
               /home/continuum/continuum-1.1/apps/continuum/webapp/WEB-INF/working-directory/23/test-integration-core/target/classes/lib/apacheds-utils-1.5.3.jar
[INFO] Copying /home/continuum/.m2/repository/commons-collections/commons-collections/3.2/commons-collections-3.2.jar to
               /home/continuum/continuum-1.1/apps/continuum/webapp/WEB-INF/working-directory/23/test-integration-core/target/classes/lib/commons-collections-3.2.jar
[INFO] Copying /home/continuum/.m2/repository/org/apache/commons/commons-io/1.3.2/commons-io-1.3.2.jar to
               /home/continuum/continuum-1.1/apps/continuum/webapp/WEB-INF/working-directory/23/test-integration-core/target/classes/lib/commons-io-1.3.2.jar
[INFO] Copying /home/continuum/.m2/repository/commons-lang/commons-lang/2.3/commons-lang-2.3.jar to
               /home/continuum/continuum-1.1/apps/continuum/webapp/WEB-INF/working-directory/23/test-integration-core/target/classes/lib/commons-lang-2.3.jar
[INFO] Copying /home/continuum/.m2/repository/org/apache/mina/mina-core/1.1.6/mina-core-1.1.6.jar to
               /home/continuum/continuum-1.1/apps/continuum/webapp/WEB-INF/working-directory/23/test-integration-core/target/classes/lib/mina-core-1.1.6.jar
[INFO] Copying /home/continuum/.m2/repository/org/apache/mina/mina-filter-ssl/1.1.6/mina-filter-ssl-1.1.6.jar to
               /home/continuum/continuum-1.1/apps/continuum/webapp/WEB-INF/working-directory/23/test-integration-core/target/classes/lib/mina-filter-ssl-1.1.6.jar
[INFO] Copying /home/continuum/.m2/repository/org/slf4j/nlog4j/1.2.25/nlog4j-1.2.25.jar to
               /home/continuum/continuum-1.1/apps/continuum/webapp/WEB-INF/working-directory/23/test-integration-core/target/classes/lib/nlog4j-1.2.25.jar
[INFO] Copying /home/continuum/.m2/repository/org/apache/directory/shared/shared-asn1/0.9.12-SNAPSHOT/shared-asn1-0.9.12-SNAPSHOT.jar to
               /home/continuum/continuum-1.1/apps/continuum/webapp/WEB-INF/working-directory/23/test-integration-core/target/classes/lib/shared-asn1-0.9.12-SNAPSHOT.jar
[INFO] Copying /home/continuum/.m2/repository/org/apache/directory/shared/shared-asn1-codec/0.9.12-SNAPSHOT/shared-asn1-codec-0.9.12-SNAPSHOT.jar to
               /home/continuum/continuum-1.1/apps/continuum/webapp/WEB-INF/working-directory/23/test-integration-core/target/classes/lib/shared-asn1-codec-0.9.12-SNAPSHOT.jar
[INFO] Copying /home/continuum/.m2/repository/org/apache/directory/shared/shared-bouncycastle-reduced/0.9.11/shared-bouncycastle-reduced-0.9.11.jar to
               /home/continuum/continuum-1.1/apps/continuum/webapp/WEB-INF/working-directory/23/test-integration-core/target/classes/lib/shared-bouncycastle-reduced-0.9.11.jar
[INFO] Copying /home/continuum/.m2/repository/org/apache/directory/shared/shared-ldap/0.9.12-SNAPSHOT/shared-ldap-0.9.12-SNAPSHOT.jar to
               /home/continuum/continuum-1.1/apps/continuum/webapp/WEB-INF/working-directory/23/test-integration-core/target/classes/lib/shared-ldap-0.9.12-SNAPSHOT.jar
[INFO] Copying /home/continuum/.m2/repository/org/apache/directory/shared/shared-ldap-constants/0.9.12-SNAPSHOT/shared-ldap-constants-0.9.12-SNAPSHOT.jar to
               /home/continuum/continuum-1.1/apps/continuum/webapp/WEB-INF/working-directory/23/test-integration-core/target/classes/lib/shared-ldap-constants-0.9.12-SNAPSHOT.jar
[INFO] Copying /home/continuum/.m2/repository/org/slf4j/slf4j-api/1.4.3/slf4j-api-1.4.3.jar to
               /home/continuum/continuum-1.1/apps/continuum/webapp/WEB-INF/working-directory/23/test-integration-core/target/classes/lib/slf4j-api-1.4.3.jar
[INFO] [compiler:compile]
[INFO] Compiling 2 source files to /home/continuum/continuum-1.1/apps/continuum/webapp/WEB-INF/working-directory/23/test-integration-core/target/classes
[INFO] ------------------------------------------------------------------------
[ERROR] BUILD FAILURE
[INFO] ------------------------------------------------------------------------
[INFO] Compilation failure

/home/continuum/continuum-1.1/apps/continuum/webapp/WEB-INF/working-directory/23/test-integration-core/src/main/java/org/apache/directory/studio/test/integration/core/JNDIConnectionWrapperTest.java:[73,94] cannot find symbol
symbol  : variable ldapServer
location: class org.apache.directory.studio.test.integration.core.JNDIConnectionWrapperTest

/home/continuum/continuum-1.1/apps/continuum/webapp/WEB-INF/working-directory/23/test-integration-core/src/main/java/org/apache/directory/studio/test/integration/core/JNDIConnectionWrapperTest.java:[103,74] cannot find symbol
symbol  : variable ldapServer
location: class org.apache.directory.studio.test.integration.core.JNDIConnectionWrapperTest

/home/continuum/continuum-1.1/apps/continuum/webapp/WEB-INF/working-directory/23/test-integration-core/src/main/java/org/apache/directory/studio/test/integration/core/JNDIConnectionWrapperTest.java:[103,94] operator + cannot be applied to ldapServer.getIpPort,int

/home/continuum/continuum-1.1/apps/continuum/webapp/WEB-INF/working-directory/23/test-integration-core/src/main/java/org/apache/directory/studio/test/integration/core/JNDIConnectionWrapperTest.java:[103,30] cannot find symbol
symbol  : constructor ConnectionParameter(<nulltype>,java.lang.String,<nulltype>,org.apache.directory.studio.connection.core.ConnectionParameter.EncryptionMethod,org.apache.directory.studio.connection.core.ConnectionParameter.AuthenticationMethod,<nulltype>,<nulltype>,<nulltype>,boolean,<nulltype>)
location: class org.apache.directory.studio.connection.core.ConnectionParameter

/home/continuum/continuum-1.1/apps/continuum/webapp/WEB-INF/working-directory/23/test-integration-core/src/main/java/org/apache/directory/studio/test/integration/core/JNDIConnectionWrapperTest.java:[116,80] cannot find symbol
symbol  : variable ldapServer
location: class org.apache.directory.studio.test.integration.core.JNDIConnectionWrapperTest

/home/continuum/continuum-1.1/apps/continuum/webapp/WEB-INF/working-directory/23/test-integration-core/src/main/java/org/apache/directory/studio/test/integration/core/JNDIConnectionWrapperTest.java:[137,94] cannot find symbol
symbol  : variable ldapServer
location: class org.apache.directory.studio.test.integration.core.JNDIConnectionWrapperTest

/home/continuum/continuum-1.1/apps/continuum/webapp/WEB-INF/working-directory/23/test-integration-core/src/main/java/org/apache/directory/studio/test/integration/core/JNDIConnectionWrapperTest.java:[170,74] cannot find symbol
symbol  : variable ldapServer
location: class org.apache.directory.studio.test.integration.core.JNDIConnectionWrapperTest

/home/continuum/continuum-1.1/apps/continuum/webapp/WEB-INF/working-directory/23/test-integration-core/src/main/java/org/apache/directory/studio/test/integration/core/JNDIConnectionWrapperTest.java:[182,74] cannot find symbol
symbol  : variable ldapServer
location: class org.apache.directory.studio.test.integration.core.JNDIConnectionWrapperTest

/home/continuum/continuum-1.1/apps/continuum/webapp/WEB-INF/working-directory/23/test-integration-core/src/main/java/org/apache/directory/studio/test/integration/core/JNDIConnectionWrapperTest.java:[206,74] cannot find symbol
symbol  : variable ldapServer
location: class org.apache.directory.studio.test.integration.core.JNDIConnectionWrapperTest


[INFO] ------------------------------------------------------------------------
[INFO] For more information, run Maven with the -e switch
[INFO] ------------------------------------------------------------------------
[INFO] Total time: 9 minutes 27 seconds
[INFO] Finished at: Mon Sep 08 05:39:45 EDT 2008
[INFO] Final Memory: 108M/508M
[INFO] ------------------------------------------------------------------------

****************************************************************************



Mime
View raw message