directory-notifications mailing list archives

Site index · List index
Message view « Date » · « Thread »
Top « Date » · « Thread »
From Continuum VMBuild Server <contin...@vm094.oxylos.org>
Subject [continuum] BUILD SUCCESSFUL: Default Project Group - Apache Directory Studio Plugin - Build Def: Build and deploy the site for studio-plugin
Date Sun, 21 Sep 2008 00:01:05 GMT
Online report : http://vm094.oxylos.org/continuum/buildResult.action?buildId=2346&projectId=31

Build statistics:
  State: Ok
  Previous Build: No previous build.
  Started at: Sat 20 Sep 2008 20:00:09 -0400
  Finished at: Sat 20 Sep 2008 20:01:04 -0400
  Total time: 54s
  Build Trigger: Schedule
  Build Number: 2
  Exit code: 0
  Building machine hostname: vm094.oxylos.org
  Operating system : Linux(unknown)
  Java Home version : 
          java version "1.6.0_06"
          Java(TM) SE Runtime Environment (build 1.6.0_06-b02)
          Java HotSpot(TM) Client VM (build 10.0-b22, mixed mode, sharing)
        
  Builder version :
          Maven version: 2.0.9
          Java version: 1.6.0_06
          OS name: "linux" version: "2.6.18-53.1.14.el5" arch: "i386" Family: "unix"
    
****************************************************************************
SCM Changes:
****************************************************************************
No files changed

****************************************************************************
Dependencies Changes:
****************************************************************************
No dependencies changed


****************************************************************************
Build Defintion:
****************************************************************************
POM filename: pom.xml
Goals: clean site-deploy   
Arguments: --batch-mode
Build Fresh: false
Always Build: false
Default Build Definition: false
Schedule: DAILY_AFTERNOON
Description: Build and deploy the site for studio-plugin

****************************************************************************
Test Summary:
****************************************************************************
Tests: 4
Failures: 0
Total time: 1.2420001


****************************************************************************
Output:
****************************************************************************
[INFO] Scanning for projects...
[INFO] ------------------------------------------------------------------------
[INFO] Building Apache Directory Studio Plugin
[INFO]    task-segment: [clean, site-deploy]
[INFO] ------------------------------------------------------------------------
[INFO] [clean:clean]
[INFO] Deleting directory /home/continuum/continuum-1.1/apps/continuum/webapp/WEB-INF/working-directory/31/target
[INFO] artifact org.apache.maven.plugins:maven-javadoc-plugin: checking for updates from apache.directory.plugins
[INFO] artifact org.apache.maven.plugins:maven-jxr-plugin: checking for updates from apache.directory.plugins
[INFO] Setting property: classpath.resource.loader.class => 'org.codehaus.plexus.velocity.ContextClassLoaderResourceLoader'.
[INFO] Setting property: velocimacro.messages.on => 'false'.
[INFO] Setting property: resource.loader => 'classpath'.
[INFO] Setting property: resource.manager.logwhenfound => 'false'.
[INFO] ************************************************************** 
[INFO] Starting Jakarta Velocity v1.4
[INFO] RuntimeInstance initializing.
[INFO] Default Properties File: org/apache/velocity/runtime/defaults/velocity.properties
[INFO] Default ResourceManager initializing. (class org.apache.velocity.runtime.resource.ResourceManagerImpl)
[INFO] Resource Loader Instantiated: org.codehaus.plexus.velocity.ContextClassLoaderResourceLoader
[INFO] ClasspathResourceLoader : initialization starting.
[INFO] ClasspathResourceLoader : initialization complete.
[INFO] ResourceCache : initialized. (class org.apache.velocity.runtime.resource.ResourceCacheImpl)
[INFO] Default ResourceManager initialization complete.
[INFO] Loaded System Directive: org.apache.velocity.runtime.directive.Literal
[INFO] Loaded System Directive: org.apache.velocity.runtime.directive.Macro
[INFO] Loaded System Directive: org.apache.velocity.runtime.directive.Parse
[INFO] Loaded System Directive: org.apache.velocity.runtime.directive.Include
[INFO] Loaded System Directive: org.apache.velocity.runtime.directive.Foreach
[INFO] Created: 20 parsers.
[INFO] Velocimacro : initialization starting.
[INFO] Velocimacro : adding VMs from VM library template : VM_global_library.vm
[ERROR] ResourceManager : unable to find resource 'VM_global_library.vm' in any resource loader.
[INFO] Velocimacro : error using  VM library template VM_global_library.vm : org.apache.velocity.exception.ResourceNotFoundException: Unable to find resource 'VM_global_library.vm'
[INFO] Velocimacro :  VM library template macro registration complete.
[INFO] Velocimacro : allowInline = true : VMs can be defined inline in templates
[INFO] Velocimacro : allowInlineToOverride = false : VMs defined inline may NOT replace previous VM definitions
[INFO] Velocimacro : allowInlineLocal = false : VMs defined inline will be  global in scope if allowed.
[INFO] Velocimacro : initialization complete.
[INFO] Velocity successfully started.
[INFO] artifact org.apache.maven.plugins:maven-plugin-plugin: checking for updates from apache.directory.plugins
[INFO] artifact org.apache.maven.plugins:maven-pmd-plugin: checking for updates from apache.directory.plugins
[INFO] artifact org.apache.maven.plugins:maven-project-info-reports-plugin: checking for updates from apache.directory.plugins
[INFO] artifact org.apache.maven.plugins:maven-surefire-report-plugin: checking for updates from apache.directory.plugins
[INFO] artifact org.codehaus.mojo:cobertura-maven-plugin: checking for updates from apache.directory.plugins
[INFO] artifact org.codehaus.mojo:rat-maven-plugin: checking for updates from apache.directory.plugins
[INFO] Setting property: classpath.resource.loader.class => 'org.codehaus.plexus.velocity.ContextClassLoaderResourceLoader'.
[INFO] Setting property: velocimacro.messages.on => 'false'.
[INFO] Setting property: resource.loader => 'classpath'.
[INFO] Setting property: resource.manager.logwhenfound => 'false'.
[INFO] artifact org.codehaus.mojo:taglist-maven-plugin: checking for updates from apache.directory.plugins
[INFO] Preparing javadoc:javadoc
[INFO] No goals needed for project - skipping
[INFO] Preparing javadoc:test-aggregate
[INFO] ------------------------------------------------------------------------
[INFO] Building Apache Directory Studio Plugin
[INFO] ------------------------------------------------------------------------
[INFO] [plugin:descriptor]
[INFO] Using 2 extractors.
[INFO] Applying extractor for language: java
[INFO] Extractor for language: java found 6 mojo descriptors.
[INFO] Applying extractor for language: bsh
[INFO] Extractor for language: bsh found 0 mojo descriptors.
[INFO] Setting property: classpath.resource.loader.class => 'org.codehaus.plexus.velocity.ContextClassLoaderResourceLoader'.
[INFO] Setting property: velocimacro.messages.on => 'false'.
[INFO] Setting property: resource.loader => 'classpath'.
[INFO] Setting property: resource.manager.logwhenfound => 'false'.
[INFO] [remote-resources:process {execution: default}]
[INFO] [resources:resources]
[INFO] Using default encoding to copy filtered resources.
[INFO] [compiler:compile]
[INFO] Compiling 8 source files to /home/continuum/continuum-1.1/apps/continuum/webapp/WEB-INF/working-directory/31/target/classes
[INFO] Preparing javadoc:aggregate
[INFO] ------------------------------------------------------------------------
[INFO] Building Apache Directory Studio Plugin
[INFO] ------------------------------------------------------------------------
[INFO] No goals needed for project - skipping
[INFO] Preparing javadoc:test-javadoc
[INFO] [plugin:descriptor]
[INFO] Using 2 extractors.
[INFO] Applying extractor for language: java
[INFO] Extractor for language: java found 6 mojo descriptors.
[INFO] Applying extractor for language: bsh
[INFO] Extractor for language: bsh found 0 mojo descriptors.
[INFO] [remote-resources:process {execution: default}]
[INFO] [resources:resources]
[INFO] Using default encoding to copy filtered resources.
[INFO] [compiler:compile]
[INFO] Nothing to compile - all classes are up to date
[INFO] Preparing plugin:report
[INFO] [plugin:descriptor]
[INFO] Using 2 extractors.
[INFO] Applying extractor for language: java
[INFO] Extractor for language: java found 6 mojo descriptors.
[INFO] Applying extractor for language: bsh
[INFO] Extractor for language: bsh found 0 mojo descriptors.
[INFO] [remote-resources:process {execution: default}]
[INFO] [resources:resources]
[INFO] Using default encoding to copy filtered resources.
[INFO] [compiler:compile]
[INFO] Nothing to compile - all classes are up to date
[INFO] Preparing surefire-report:report
[INFO] [plugin:descriptor]
[INFO] Using 2 extractors.
[INFO] Applying extractor for language: java
[INFO] Extractor for language: java found 6 mojo descriptors.
[INFO] Applying extractor for language: bsh
[INFO] Extractor for language: bsh found 0 mojo descriptors.
[INFO] [remote-resources:process {execution: default}]
[INFO] [resources:resources]
[INFO] Using default encoding to copy filtered resources.
[INFO] [compiler:compile]
[INFO] Nothing to compile - all classes are up to date
[INFO] [resources:testResources]
[INFO] Using default encoding to copy filtered resources.
[INFO] [compiler:testCompile]
[INFO] Compiling 6 source files to /home/continuum/continuum-1.1/apps/continuum/webapp/WEB-INF/working-directory/31/target/test-classes
[INFO] [surefire:test]
[INFO] Surefire report directory: /home/continuum/continuum-1.1/apps/continuum/webapp/WEB-INF/working-directory/31/target/surefire-reports

-------------------------------------------------------
 T E S T S
-------------------------------------------------------
Running org.apache.directory.studio.maven.plugins.StudioUnpackPrefixedMojoTest
[INFO] Unpacking /tmp/DefaultExtensionManagerTest.31221.dir/org/eclipse/core/jobs/3.3.1-R33x_v20070709/jobs-3.3.1-R33x_v20070709.jar to
                 /home/continuum/continuum-1.1/apps/continuum/webapp/WEB-INF/working-directory/31/target/test-classes/unpack-plugins/org.eclipse.core.jobs_3.3.1.R33x_v20070709
[INFO] Unpacking /tmp/DefaultExtensionManagerTest.31221.dir/org/eclipse/core/commands/3.3.0-I20070605-0010/commands-3.3.0-I20070605-0010.jar to
                 /home/continuum/continuum-1.1/apps/continuum/webapp/WEB-INF/working-directory/31/target/test-classes/unpack-plugins/org.eclipse.core.commands_3.3.0.I20070605_0010
Tests run: 1, Failures: 0, Errors: 0, Skipped: 0, Time elapsed: 0.772 sec
Running org.apache.directory.studio.maven.plugins.StudioCleanMojoTest
[INFO] Deleting target/test-classes/unit/basic-clean-test/maven-eclipse.xml
[INFO] Deleting target/test-classes/unit/basic-clean-test/.externalToolBuilders
[INFO] Deleting target/test-classes/unit/basic-clean-test/lib
[ERROR] 
java.lang.NullPointerException
	at org.apache.directory.studio.maven.plugins.StudioCleanMojo.execute(StudioCleanMojo.java:48)
	at org.apache.directory.studio.maven.plugins.StudioCleanMojoTest.testBasicCleanException(StudioCleanMojoTest.java:94)
	at sun.reflect.NativeMethodAccessorImpl.invoke0(Native Method)
	at sun.reflect.NativeMethodAccessorImpl.invoke(NativeMethodAccessorImpl.java:39)
	at sun.reflect.DelegatingMethodAccessorImpl.invoke(DelegatingMethodAccessorImpl.java:25)
	at java.lang.reflect.Method.invoke(Method.java:597)
	at junit.framework.TestCase.runTest(TestCase.java:154)
	at junit.framework.TestCase.runBare(TestCase.java:127)
	at junit.framework.TestResult$1.protect(TestResult.java:106)
	at junit.framework.TestResult.runProtected(TestResult.java:124)
	at junit.framework.TestResult.run(TestResult.java:109)
	at junit.framework.TestCase.run(TestCase.java:118)
	at junit.framework.TestSuite.runTest(TestSuite.java:208)
	at junit.framework.TestSuite.run(TestSuite.java:203)
	at sun.reflect.NativeMethodAccessorImpl.invoke0(Native Method)
	at sun.reflect.NativeMethodAccessorImpl.invoke(NativeMethodAccessorImpl.java:39)
	at sun.reflect.DelegatingMethodAccessorImpl.invoke(DelegatingMethodAccessorImpl.java:25)
	at java.lang.reflect.Method.invoke(Method.java:597)
	at org.apache.maven.surefire.junit.JUnitTestSet.execute(JUnitTestSet.java:213)
	at org.apache.maven.surefire.suite.AbstractDirectoryTestSuite.executeTestSet(AbstractDirectoryTestSuite.java:140)
	at org.apache.maven.surefire.suite.AbstractDirectoryTestSuite.execute(AbstractDirectoryTestSuite.java:127)
	at org.apache.maven.surefire.Surefire.run(Surefire.java:177)
	at sun.reflect.NativeMethodAccessorImpl.invoke0(Native Method)
	at sun.reflect.NativeMethodAccessorImpl.invoke(NativeMethodAccessorImpl.java:39)
	at sun.reflect.DelegatingMethodAccessorImpl.invoke(DelegatingMethodAccessorImpl.java:25)
	at java.lang.reflect.Method.invoke(Method.java:597)
	at org.apache.maven.surefire.booter.SurefireBooter.runSuitesInProcess(SurefireBooter.java:345)
	at org.apache.maven.surefire.booter.SurefireBooter.main(SurefireBooter.java:1009)
Tests run: 2, Failures: 0, Errors: 0, Skipped: 0, Time elapsed: 0.194 sec
Running org.apache.directory.studio.maven.plugins.StudioCopyEclipseDependencyMojoTest
[INFO] Copying artifact jobs to
               /home/continuum/continuum-1.1/apps/continuum/webapp/WEB-INF/working-directory/31/target/test-classes/copy-plugins/org.eclipse.core.jobs_3.3.1.R33x_v20070709.jar
[INFO] Copying artifact commands to
               /home/continuum/continuum-1.1/apps/continuum/webapp/WEB-INF/working-directory/31/target/test-classes/copy-plugins/org.eclipse.core.commands_3.3.0.I20070605_0010.jar
Tests run: 1, Failures: 0, Errors: 0, Skipped: 0, Time elapsed: 0.136 sec

Results :

Tests run: 4, Failures: 0, Errors: 0, Skipped: 0

[INFO] Preparing surefire-report:report-only
[INFO] No goals needed for project - skipping
[INFO] Preparing cobertura:cobertura
[INFO] [plugin:descriptor]
[INFO] Using 2 extractors.
[INFO] Applying extractor for language: java
[INFO] Extractor for language: java found 6 mojo descriptors.
[INFO] Applying extractor for language: bsh
[INFO] Extractor for language: bsh found 0 mojo descriptors.
[INFO] [remote-resources:process {execution: default}]
[INFO] [resources:resources]
[INFO] Using default encoding to copy filtered resources.
[INFO] [compiler:compile]
[INFO] Nothing to compile - all classes are up to date
[INFO] [cobertura:instrument]
[INFO] Cobertura 1.9 - GNU GPL License (NO WARRANTY) - See COPYRIGHT file
Instrumenting 9 files to /home/continuum/continuum-1.1/apps/continuum/webapp/WEB-INF/working-directory/31/target/generated-classes/cobertura
Cobertura: Saved information on 9 classes.
Instrument time: 282ms

[INFO] Instrumentation was successful.
[INFO] [resources:testResources]
[INFO] Using default encoding to copy filtered resources.
[INFO] [compiler:testCompile]
[INFO] Nothing to compile - all classes are up to date
[INFO] [surefire:test]
[INFO] Surefire report directory: /home/continuum/continuum-1.1/apps/continuum/webapp/WEB-INF/working-directory/31/target/surefire-reports

-------------------------------------------------------
 T E S T S
-------------------------------------------------------
Running org.apache.directory.studio.maven.plugins.StudioUnpackPrefixedMojoTest
[INFO] Unpacking /tmp/DefaultExtensionManagerTest.58180.dir/org/eclipse/core/jobs/3.3.1-R33x_v20070709/jobs-3.3.1-R33x_v20070709.jar to
                 /home/continuum/continuum-1.1/apps/continuum/webapp/WEB-INF/working-directory/31/target/test-classes/unpack-plugins/org.eclipse.core.jobs_3.3.1.R33x_v20070709
[INFO] Unpacking /tmp/DefaultExtensionManagerTest.58180.dir/org/eclipse/core/commands/3.3.0-I20070605-0010/commands-3.3.0-I20070605-0010.jar to
                 /home/continuum/continuum-1.1/apps/continuum/webapp/WEB-INF/working-directory/31/target/test-classes/unpack-plugins/org.eclipse.core.commands_3.3.0.I20070605_0010
Tests run: 1, Failures: 0, Errors: 0, Skipped: 0, Time elapsed: 0.931 sec
Running org.apache.directory.studio.maven.plugins.StudioCleanMojoTest
[INFO] Deleting target/test-classes/unit/basic-clean-test/maven-eclipse.xml
[INFO] Deleting target/test-classes/unit/basic-clean-test/.externalToolBuilders
[INFO] Deleting target/test-classes/unit/basic-clean-test/lib
[ERROR] 
java.lang.NullPointerException
	at org.apache.directory.studio.maven.plugins.StudioCleanMojo.execute(StudioCleanMojo.java:48)
	at org.apache.directory.studio.maven.plugins.StudioCleanMojoTest.testBasicCleanException(StudioCleanMojoTest.java:94)
	at sun.reflect.NativeMethodAccessorImpl.invoke0(Native Method)
	at sun.reflect.NativeMethodAccessorImpl.invoke(NativeMethodAccessorImpl.java:39)
	at sun.reflect.DelegatingMethodAccessorImpl.invoke(DelegatingMethodAccessorImpl.java:25)
	at java.lang.reflect.Method.invoke(Method.java:597)
	at junit.framework.TestCase.runTest(TestCase.java:154)
	at junit.framework.TestCase.runBare(TestCase.java:127)
	at junit.framework.TestResult$1.protect(TestResult.java:106)
	at junit.framework.TestResult.runProtected(TestResult.java:124)
	at junit.framework.TestResult.run(TestResult.java:109)
	at junit.framework.TestCase.run(TestCase.java:118)
	at junit.framework.TestSuite.runTest(TestSuite.java:208)
	at junit.framework.TestSuite.run(TestSuite.java:203)
	at sun.reflect.NativeMethodAccessorImpl.invoke0(Native Method)
	at sun.reflect.NativeMethodAccessorImpl.invoke(NativeMethodAccessorImpl.java:39)
	at sun.reflect.DelegatingMethodAccessorImpl.invoke(DelegatingMethodAccessorImpl.java:25)
	at java.lang.reflect.Method.invoke(Method.java:597)
	at org.apache.maven.surefire.junit.JUnitTestSet.execute(JUnitTestSet.java:213)
	at org.apache.maven.surefire.suite.AbstractDirectoryTestSuite.executeTestSet(AbstractDirectoryTestSuite.java:140)
	at org.apache.maven.surefire.suite.AbstractDirectoryTestSuite.execute(AbstractDirectoryTestSuite.java:127)
	at org.apache.maven.surefire.Surefire.run(Surefire.java:177)
	at sun.reflect.NativeMethodAccessorImpl.invoke0(Native Method)
	at sun.reflect.NativeMethodAccessorImpl.invoke(NativeMethodAccessorImpl.java:39)
	at sun.reflect.DelegatingMethodAccessorImpl.invoke(DelegatingMethodAccessorImpl.java:25)
	at java.lang.reflect.Method.invoke(Method.java:597)
	at org.apache.maven.surefire.booter.SurefireBooter.runSuitesInProcess(SurefireBooter.java:345)
	at org.apache.maven.surefire.booter.SurefireBooter.main(SurefireBooter.java:1009)
Tests run: 2, Failures: 0, Errors: 0, Skipped: 0, Time elapsed: 0.21 sec
Running org.apache.directory.studio.maven.plugins.StudioCopyEclipseDependencyMojoTest
[INFO] Copying artifact jobs to
               /home/continuum/continuum-1.1/apps/continuum/webapp/WEB-INF/working-directory/31/target/test-classes/copy-plugins/org.eclipse.core.jobs_3.3.1.R33x_v20070709.jar
[INFO] Copying artifact commands to
               /home/continuum/continuum-1.1/apps/continuum/webapp/WEB-INF/working-directory/31/target/test-classes/copy-plugins/org.eclipse.core.commands_3.3.0.I20070605_0010.jar
Tests run: 1, Failures: 0, Errors: 0, Skipped: 0, Time elapsed: 0.113 sec

Results :

Tests run: 4, Failures: 0, Errors: 0, Skipped: 0

Cobertura: Loaded information on 9 classes.
Cobertura: Saved information on 9 classes.
[INFO] [site:site]
[INFO] Unable to load parent project from a relative path: Could not find the model file '/home/continuum/continuum-1.1/apps/continuum/webapp/WEB-INF/working-directory/pom.xml'. for project unknown
[INFO] Parent project loaded from repository.
[INFO] Parent project loaded from repository.
[INFO] artifact org.apache.maven.skins:maven-default-skin: checking for updates from central
[INFO] Skipped "About" report, file "index.html" already exists for the English version.
[INFO] Skipped "Surefire Report" report, file "surefire-report.html" already exists for the English version.
[INFO] Generating "Project Team" report.
[INFO] Generating "PMD Report" report.
[INFO] Generating "Dependencies" report.
[WARNING] The repository url 'http://snapshots.maven.codehaus.org/maven2' is invalid - Repository 'snapshots' will be blacklisted.
[INFO] Generating "Mailing Lists" report.
[INFO] Generating "Source Repository" report.
[INFO] Generating "Tag List" report.
[INFO] Generating "Test JavaDocs" report.
[WARNING] Source files encoding has not been set, using platform encoding UTF-8, i.e. build is platform dependent!
Loading source files for package org.apache.directory.studio.maven.plugins...
Loading source files for package org.apache.directory.studio.maven.plugins.stubs...
Constructing Javadoc information...
Standard Doclet version 1.6.0_06
Building tree for all the packages and classes...
Generating /home/continuum/continuum-1.1/apps/continuum/webapp/WEB-INF/working-directory/31/target/site/testapidocs/org/apache/directory/studio/maven/plugins//StudioCleanMojoTest.html...
Generating /home/continuum/continuum-1.1/apps/continuum/webapp/WEB-INF/working-directory/31/target/site/testapidocs/org/apache/directory/studio/maven/plugins//StudioCopyEclipseDependencyMojoTest.html...
Generating /home/continuum/continuum-1.1/apps/continuum/webapp/WEB-INF/working-directory/31/target/site/testapidocs/org/apache/directory/studio/maven/plugins//StudioUnpackPrefixedMojoTest.html...
Generating /home/continuum/continuum-1.1/apps/continuum/webapp/WEB-INF/working-directory/31/target/site/testapidocs/org/apache/directory/studio/maven/plugins/stubs//StudioCleanProjectStub.html...
Generating /home/continuum/continuum-1.1/apps/continuum/webapp/WEB-INF/working-directory/31/target/site/testapidocs/org/apache/directory/studio/maven/plugins/stubs//StudioCopyEclipseDependencyProjectStub.html...
Generating /home/continuum/continuum-1.1/apps/continuum/webapp/WEB-INF/working-directory/31/target/site/testapidocs/org/apache/directory/studio/maven/plugins/stubs//StudioUnpackPrefixedProjectStub.html...
Generating /home/continuum/continuum-1.1/apps/continuum/webapp/WEB-INF/working-directory/31/target/site/testapidocs/overview-frame.html...
Generating /home/continuum/continuum-1.1/apps/continuum/webapp/WEB-INF/working-directory/31/target/site/testapidocs/org/apache/directory/studio/maven/plugins//package-frame.html...
Generating /home/continuum/continuum-1.1/apps/continuum/webapp/WEB-INF/working-directory/31/target/site/testapidocs/org/apache/directory/studio/maven/plugins//package-summary.html...
Generating /home/continuum/continuum-1.1/apps/continuum/webapp/WEB-INF/working-directory/31/target/site/testapidocs/org/apache/directory/studio/maven/plugins//package-tree.html...
Generating /home/continuum/continuum-1.1/apps/continuum/webapp/WEB-INF/working-directory/31/target/site/testapidocs/org/apache/directory/studio/maven/plugins/stubs//package-frame.html...
Generating /home/continuum/continuum-1.1/apps/continuum/webapp/WEB-INF/working-directory/31/target/site/testapidocs/org/apache/directory/studio/maven/plugins/stubs//package-summary.html...
Generating /home/continuum/continuum-1.1/apps/continuum/webapp/WEB-INF/working-directory/31/target/site/testapidocs/org/apache/directory/studio/maven/plugins/stubs//package-tree.html...
Generating /home/continuum/continuum-1.1/apps/continuum/webapp/WEB-INF/working-directory/31/target/site/testapidocs/constant-values.html...
Generating /home/continuum/continuum-1.1/apps/continuum/webapp/WEB-INF/working-directory/31/target/site/testapidocs/org/apache/directory/studio/maven/plugins//class-use/StudioCleanMojoTest.html...
Generating /home/continuum/continuum-1.1/apps/continuum/webapp/WEB-INF/working-directory/31/target/site/testapidocs/org/apache/directory/studio/maven/plugins//class-use/StudioUnpackPrefixedMojoTest.html...
Generating /home/continuum/continuum-1.1/apps/continuum/webapp/WEB-INF/working-directory/31/target/site/testapidocs/org/apache/directory/studio/maven/plugins//class-use/StudioCopyEclipseDependencyMojoTest.html...
Generating /home/continuum/continuum-1.1/apps/continuum/webapp/WEB-INF/working-directory/31/target/site/testapidocs/org/apache/directory/studio/maven/plugins/stubs//class-use/StudioCleanProjectStub.html...
Generating /home/continuum/continuum-1.1/apps/continuum/webapp/WEB-INF/working-directory/31/target/site/testapidocs/org/apache/directory/studio/maven/plugins/stubs//class-use/StudioUnpackPrefixedProjectStub.html...
Generating /home/continuum/continuum-1.1/apps/continuum/webapp/WEB-INF/working-directory/31/target/site/testapidocs/org/apache/directory/studio/maven/plugins/stubs//class-use/StudioCopyEclipseDependencyProjectStub.html...
Generating /home/continuum/continuum-1.1/apps/continuum/webapp/WEB-INF/working-directory/31/target/site/testapidocs/org/apache/directory/studio/maven/plugins//package-use.html...
Generating /home/continuum/continuum-1.1/apps/continuum/webapp/WEB-INF/working-directory/31/target/site/testapidocs/org/apache/directory/studio/maven/plugins/stubs//package-use.html...
Building index for all the packages and classes...
Generating /home/continuum/continuum-1.1/apps/continuum/webapp/WEB-INF/working-directory/31/target/site/testapidocs/overview-tree.html...
Generating /home/continuum/continuum-1.1/apps/continuum/webapp/WEB-INF/working-directory/31/target/site/testapidocs/index-all.html...
Generating /home/continuum/continuum-1.1/apps/continuum/webapp/WEB-INF/working-directory/31/target/site/testapidocs/deprecated-list.html...
Building index for all classes...
Generating /home/continuum/continuum-1.1/apps/continuum/webapp/WEB-INF/working-directory/31/target/site/testapidocs/allclasses-frame.html...
Generating /home/continuum/continuum-1.1/apps/continuum/webapp/WEB-INF/working-directory/31/target/site/testapidocs/allclasses-noframe.html...
Generating /home/continuum/continuum-1.1/apps/continuum/webapp/WEB-INF/working-directory/31/target/site/testapidocs/index.html...
Generating /home/continuum/continuum-1.1/apps/continuum/webapp/WEB-INF/working-directory/31/target/site/testapidocs/overview-summary.html...
Generating /home/continuum/continuum-1.1/apps/continuum/webapp/WEB-INF/working-directory/31/target/site/testapidocs/help-doc.html...
Generating /home/continuum/continuum-1.1/apps/continuum/webapp/WEB-INF/working-directory/31/target/site/testapidocs/stylesheet.css...
[INFO] Generating "JavaDocs" report.
[WARNING] Source files encoding has not been set, using platform encoding UTF-8, i.e. build is platform dependent!
Loading source files for package org.apache.directory.studio.maven.plugins...
Constructing Javadoc information...
Standard Doclet version 1.6.0_06
Building tree for all the packages and classes...
Generating /home/continuum/continuum-1.1/apps/continuum/webapp/WEB-INF/working-directory/31/target/site/apidocs/org/apache/directory/studio/maven/plugins//AbstractStudioMojo.html...
Generating /home/continuum/continuum-1.1/apps/continuum/webapp/WEB-INF/working-directory/31/target/site/apidocs/org/apache/directory/studio/maven/plugins//ArtifactItem.html...
Generating /home/continuum/continuum-1.1/apps/continuum/webapp/WEB-INF/working-directory/31/target/site/apidocs/org/apache/directory/studio/maven/plugins//StudioCleanMojo.html...
Generating /home/continuum/continuum-1.1/apps/continuum/webapp/WEB-INF/working-directory/31/target/site/apidocs/org/apache/directory/studio/maven/plugins//StudioCopyEclipseDependencyMojo.html...
Generating /home/continuum/continuum-1.1/apps/continuum/webapp/WEB-INF/working-directory/31/target/site/apidocs/org/apache/directory/studio/maven/plugins//StudioEclipseMojo.html...
Generating /home/continuum/continuum-1.1/apps/continuum/webapp/WEB-INF/working-directory/31/target/site/apidocs/org/apache/directory/studio/maven/plugins//StudioPrepareJarPackageMojo.html...
Generating /home/continuum/continuum-1.1/apps/continuum/webapp/WEB-INF/working-directory/31/target/site/apidocs/org/apache/directory/studio/maven/plugins//StudioReplaceFileInJarMojo.html...
Generating /home/continuum/continuum-1.1/apps/continuum/webapp/WEB-INF/working-directory/31/target/site/apidocs/org/apache/directory/studio/maven/plugins//StudioUnpackPrefixedMojo.html...
Generating /home/continuum/continuum-1.1/apps/continuum/webapp/WEB-INF/working-directory/31/target/site/apidocs/org/apache/directory/studio/maven/plugins//package-frame.html...
Generating /home/continuum/continuum-1.1/apps/continuum/webapp/WEB-INF/working-directory/31/target/site/apidocs/org/apache/directory/studio/maven/plugins//package-summary.html...
Generating /home/continuum/continuum-1.1/apps/continuum/webapp/WEB-INF/working-directory/31/target/site/apidocs/org/apache/directory/studio/maven/plugins//package-tree.html...
Generating /home/continuum/continuum-1.1/apps/continuum/webapp/WEB-INF/working-directory/31/target/site/apidocs/constant-values.html...
Generating /home/continuum/continuum-1.1/apps/continuum/webapp/WEB-INF/working-directory/31/target/site/apidocs/org/apache/directory/studio/maven/plugins//class-use/StudioPrepareJarPackageMojo.html...
Generating /home/continuum/continuum-1.1/apps/continuum/webapp/WEB-INF/working-directory/31/target/site/apidocs/org/apache/directory/studio/maven/plugins//class-use/AbstractStudioMojo.html...
Generating /home/continuum/continuum-1.1/apps/continuum/webapp/WEB-INF/working-directory/31/target/site/apidocs/org/apache/directory/studio/maven/plugins//class-use/StudioCopyEclipseDependencyMojo.html...
Generating /home/continuum/continuum-1.1/apps/continuum/webapp/WEB-INF/working-directory/31/target/site/apidocs/org/apache/directory/studio/maven/plugins//class-use/ArtifactItem.html...
Generating /home/continuum/continuum-1.1/apps/continuum/webapp/WEB-INF/working-directory/31/target/site/apidocs/org/apache/directory/studio/maven/plugins//class-use/StudioReplaceFileInJarMojo.html...
Generating /home/continuum/continuum-1.1/apps/continuum/webapp/WEB-INF/working-directory/31/target/site/apidocs/org/apache/directory/studio/maven/plugins//class-use/StudioEclipseMojo.html...
Generating /home/continuum/continuum-1.1/apps/continuum/webapp/WEB-INF/working-directory/31/target/site/apidocs/org/apache/directory/studio/maven/plugins//class-use/StudioCleanMojo.html...
Generating /home/continuum/continuum-1.1/apps/continuum/webapp/WEB-INF/working-directory/31/target/site/apidocs/org/apache/directory/studio/maven/plugins//class-use/StudioUnpackPrefixedMojo.html...
Generating /home/continuum/continuum-1.1/apps/continuum/webapp/WEB-INF/working-directory/31/target/site/apidocs/org/apache/directory/studio/maven/plugins//package-use.html...
Building index for all the packages and classes...
Generating /home/continuum/continuum-1.1/apps/continuum/webapp/WEB-INF/working-directory/31/target/site/apidocs/overview-tree.html...
Generating /home/continuum/continuum-1.1/apps/continuum/webapp/WEB-INF/working-directory/31/target/site/apidocs/index-all.html...
Generating /home/continuum/continuum-1.1/apps/continuum/webapp/WEB-INF/working-directory/31/target/site/apidocs/deprecated-list.html...
Building index for all classes...
Generating /home/continuum/continuum-1.1/apps/continuum/webapp/WEB-INF/working-directory/31/target/site/apidocs/allclasses-frame.html...
Generating /home/continuum/continuum-1.1/apps/continuum/webapp/WEB-INF/working-directory/31/target/site/apidocs/allclasses-noframe.html...
Generating /home/continuum/continuum-1.1/apps/continuum/webapp/WEB-INF/working-directory/31/target/site/apidocs/index.html...
Generating /home/continuum/continuum-1.1/apps/continuum/webapp/WEB-INF/working-directory/31/target/site/apidocs/help-doc.html...
Generating /home/continuum/continuum-1.1/apps/continuum/webapp/WEB-INF/working-directory/31/target/site/apidocs/stylesheet.css...
71 warnings
[WARNING] Javadoc Warnings
[WARNING] /home/continuum/continuum-1.1/apps/continuum/webapp/WEB-INF/working-directory/31/src/main/java/org/apache/directory/studio/maven/plugins/AbstractStudioMojo.java:415: warning - @return tag has no arguments.
[WARNING] /home/continuum/continuum-1.1/apps/continuum/webapp/WEB-INF/working-directory/31/src/main/java/org/apache/directory/studio/maven/plugins/AbstractStudioMojo.java:390: warning - @return tag has no arguments.
[WARNING] /home/continuum/continuum-1.1/apps/continuum/webapp/WEB-INF/working-directory/31/src/main/java/org/apache/directory/studio/maven/plugins/AbstractStudioMojo.java:66: warning - @parameter is an unknown tag.
[WARNING] /home/continuum/continuum-1.1/apps/continuum/webapp/WEB-INF/working-directory/31/src/main/java/org/apache/directory/studio/maven/plugins/AbstractStudioMojo.java:66: warning - @required is an unknown tag.
[WARNING] /home/continuum/continuum-1.1/apps/continuum/webapp/WEB-INF/working-directory/31/src/main/java/org/apache/directory/studio/maven/plugins/AbstractStudioMojo.java:66: warning - @readonly is an unknown tag.
[WARNING] /home/continuum/continuum-1.1/apps/continuum/webapp/WEB-INF/working-directory/31/src/main/java/org/apache/directory/studio/maven/plugins/AbstractStudioMojo.java:75: warning - @parameter is an unknown tag.
[WARNING] /home/continuum/continuum-1.1/apps/continuum/webapp/WEB-INF/working-directory/31/src/main/java/org/apache/directory/studio/maven/plugins/AbstractStudioMojo.java:75: warning - @required is an unknown tag.
[WARNING] /home/continuum/continuum-1.1/apps/continuum/webapp/WEB-INF/working-directory/31/src/main/java/org/apache/directory/studio/maven/plugins/AbstractStudioMojo.java:75: warning - @readonly is an unknown tag.
[WARNING] /home/continuum/continuum-1.1/apps/continuum/webapp/WEB-INF/working-directory/31/src/main/java/org/apache/directory/studio/maven/plugins/AbstractStudioMojo.java:84: warning - @parameter is an unknown tag.
[WARNING] /home/continuum/continuum-1.1/apps/continuum/webapp/WEB-INF/working-directory/31/src/main/java/org/apache/directory/studio/maven/plugins/AbstractStudioMojo.java:84: warning - @required is an unknown tag.
[WARNING] /home/continuum/continuum-1.1/apps/continuum/webapp/WEB-INF/working-directory/31/src/main/java/org/apache/directory/studio/maven/plugins/AbstractStudioMojo.java:84: warning - @readonly is an unknown tag.
[WARNING] /home/continuum/continuum-1.1/apps/continuum/webapp/WEB-INF/working-directory/31/src/main/java/org/apache/directory/studio/maven/plugins/AbstractStudioMojo.java:93: warning - @parameter is an unknown tag.
[WARNING] /home/continuum/continuum-1.1/apps/continuum/webapp/WEB-INF/working-directory/31/src/main/java/org/apache/directory/studio/maven/plugins/AbstractStudioMojo.java:93: warning - @required is an unknown tag.
[WARNING] /home/continuum/continuum-1.1/apps/continuum/webapp/WEB-INF/working-directory/31/src/main/java/org/apache/directory/studio/maven/plugins/AbstractStudioMojo.java:93: warning - @readonly is an unknown tag.
[WARNING] /home/continuum/continuum-1.1/apps/continuum/webapp/WEB-INF/working-directory/31/src/main/java/org/apache/directory/studio/maven/plugins/AbstractStudioMojo.java:101: warning - @parameter is an unknown tag.
[WARNING] /home/continuum/continuum-1.1/apps/continuum/webapp/WEB-INF/working-directory/31/src/main/java/org/apache/directory/studio/maven/plugins/AbstractStudioMojo.java:101: warning - @required is an unknown tag.
[WARNING] /home/continuum/continuum-1.1/apps/continuum/webapp/WEB-INF/working-directory/31/src/main/java/org/apache/directory/studio/maven/plugins/AbstractStudioMojo.java:110: warning - @parameter is an unknown tag.
[WARNING] /home/continuum/continuum-1.1/apps/continuum/webapp/WEB-INF/working-directory/31/src/main/java/org/apache/directory/studio/maven/plugins/AbstractStudioMojo.java:110: warning - @required is an unknown tag.
[WARNING] /home/continuum/continuum-1.1/apps/continuum/webapp/WEB-INF/working-directory/31/src/main/java/org/apache/directory/studio/maven/plugins/AbstractStudioMojo.java:110: warning - @readonly is an unknown tag.
[WARNING] /home/continuum/continuum-1.1/apps/continuum/webapp/WEB-INF/working-directory/31/src/main/java/org/apache/directory/studio/maven/plugins/AbstractStudioMojo.java:119: warning - @component is an unknown tag.
[WARNING] /home/continuum/continuum-1.1/apps/continuum/webapp/WEB-INF/working-directory/31/src/main/java/org/apache/directory/studio/maven/plugins/AbstractStudioMojo.java:119: warning - @required is an unknown tag.
[WARNING] /home/continuum/continuum-1.1/apps/continuum/webapp/WEB-INF/working-directory/31/src/main/java/org/apache/directory/studio/maven/plugins/AbstractStudioMojo.java:119: warning - @readonly is an unknown tag.
[WARNING] /home/continuum/continuum-1.1/apps/continuum/webapp/WEB-INF/working-directory/31/src/main/java/org/apache/directory/studio/maven/plugins/AbstractStudioMojo.java:127: warning - @component is an unknown tag.
[WARNING] /home/continuum/continuum-1.1/apps/continuum/webapp/WEB-INF/working-directory/31/src/main/java/org/apache/directory/studio/maven/plugins/AbstractStudioMojo.java:127: warning - @required is an unknown tag.
[WARNING] /home/continuum/continuum-1.1/apps/continuum/webapp/WEB-INF/working-directory/31/src/main/java/org/apache/directory/studio/maven/plugins/AbstractStudioMojo.java:127: warning - @readonly is an unknown tag.
[WARNING] /home/continuum/continuum-1.1/apps/continuum/webapp/WEB-INF/working-directory/31/src/main/java/org/apache/directory/studio/maven/plugins/AbstractStudioMojo.java:136: warning - @parameter is an unknown tag.
[WARNING] /home/continuum/continuum-1.1/apps/continuum/webapp/WEB-INF/working-directory/31/src/main/java/org/apache/directory/studio/maven/plugins/AbstractStudioMojo.java:136: warning - @readonly is an unknown tag.
[WARNING] /home/continuum/continuum-1.1/apps/continuum/webapp/WEB-INF/working-directory/31/src/main/java/org/apache/directory/studio/maven/plugins/AbstractStudioMojo.java:136: warning - @required is an unknown tag.
[WARNING] /home/continuum/continuum-1.1/apps/continuum/webapp/WEB-INF/working-directory/31/src/main/java/org/apache/directory/studio/maven/plugins/AbstractStudioMojo.java:145: warning - @parameter is an unknown tag.
[WARNING] /home/continuum/continuum-1.1/apps/continuum/webapp/WEB-INF/working-directory/31/src/main/java/org/apache/directory/studio/maven/plugins/AbstractStudioMojo.java:145: warning - @readonly is an unknown tag.
[WARNING] /home/continuum/continuum-1.1/apps/continuum/webapp/WEB-INF/working-directory/31/src/main/java/org/apache/directory/studio/maven/plugins/AbstractStudioMojo.java:145: warning - @required is an unknown tag.
[WARNING] /home/continuum/continuum-1.1/apps/continuum/webapp/WEB-INF/working-directory/31/src/main/java/org/apache/directory/studio/maven/plugins/AbstractStudioMojo.java:154: warning - @parameter is an unknown tag.
[WARNING] /home/continuum/continuum-1.1/apps/continuum/webapp/WEB-INF/working-directory/31/src/main/java/org/apache/directory/studio/maven/plugins/AbstractStudioMojo.java:154: warning - @readonly is an unknown tag.
[WARNING] /home/continuum/continuum-1.1/apps/continuum/webapp/WEB-INF/working-directory/31/src/main/java/org/apache/directory/studio/maven/plugins/AbstractStudioMojo.java:154: warning - @required is an unknown tag.
[WARNING] /home/continuum/continuum-1.1/apps/continuum/webapp/WEB-INF/working-directory/31/src/main/java/org/apache/directory/studio/maven/plugins/AbstractStudioMojo.java:164: warning - @optional is an unknown tag.
[WARNING] /home/continuum/continuum-1.1/apps/continuum/webapp/WEB-INF/working-directory/31/src/main/java/org/apache/directory/studio/maven/plugins/AbstractStudioMojo.java:164: warning - @parameter is an unknown tag.
[WARNING] /home/continuum/continuum-1.1/apps/continuum/webapp/WEB-INF/working-directory/31/src/main/java/org/apache/directory/studio/maven/plugins/AbstractStudioMojo.java:578: warning - @param argument "libraryPath" is not a parameter name.
[WARNING] /home/continuum/continuum-1.1/apps/continuum/webapp/WEB-INF/working-directory/31/src/main/java/org/apache/directory/studio/maven/plugins/ArtifactItem.java:122: warning - @param argument "artifactId" is not a parameter name.
[WARNING] /home/continuum/continuum-1.1/apps/continuum/webapp/WEB-INF/working-directory/31/src/main/java/org/apache/directory/studio/maven/plugins/StudioCleanMojo.java:38: warning - @goal is an unknown tag.
[WARNING] /home/continuum/continuum-1.1/apps/continuum/webapp/WEB-INF/working-directory/31/src/main/java/org/apache/directory/studio/maven/plugins/StudioCleanMojo.java:38: warning - @execute is an unknown tag.
[WARNING] /home/continuum/continuum-1.1/apps/continuum/webapp/WEB-INF/working-directory/31/src/main/java/org/apache/directory/studio/maven/plugins/StudioCleanMojo.java:38: warning - @description is an unknown tag.
[WARNING] /home/continuum/continuum-1.1/apps/continuum/webapp/WEB-INF/working-directory/31/src/main/java/org/apache/directory/studio/maven/plugins/StudioCleanMojo.java:38: warning - @requiresProject is an unknown tag.
[WARNING] /home/continuum/continuum-1.1/apps/continuum/webapp/WEB-INF/working-directory/31/src/main/java/org/apache/directory/studio/maven/plugins/StudioCopyEclipseDependencyMojo.java:47: warning - @goal is an unknown tag.
[WARNING] /home/continuum/continuum-1.1/apps/continuum/webapp/WEB-INF/working-directory/31/src/main/java/org/apache/directory/studio/maven/plugins/StudioCopyEclipseDependencyMojo.java:47: warning - @description is an unknown tag.
[WARNING] /home/continuum/continuum-1.1/apps/continuum/webapp/WEB-INF/working-directory/31/src/main/java/org/apache/directory/studio/maven/plugins/StudioCopyEclipseDependencyMojo.java:47: warning - @requiresProject is an unknown tag.
[WARNING] /home/continuum/continuum-1.1/apps/continuum/webapp/WEB-INF/working-directory/31/src/main/java/org/apache/directory/studio/maven/plugins/StudioCopyEclipseDependencyMojo.java:47: warning - @requiresDependencyResolution is an unknown tag.
[WARNING] /home/continuum/continuum-1.1/apps/continuum/webapp/WEB-INF/working-directory/31/src/main/java/org/apache/directory/studio/maven/plugins/StudioCopyEclipseDependencyMojo.java:58: warning - @parameter is an unknown tag.
[WARNING] /home/continuum/continuum-1.1/apps/continuum/webapp/WEB-INF/working-directory/31/src/main/java/org/apache/directory/studio/maven/plugins/StudioCopyEclipseDependencyMojo.java:58: warning - @required is an unknown tag.
[WARNING] /home/continuum/continuum-1.1/apps/continuum/webapp/WEB-INF/working-directory/31/src/main/java/org/apache/directory/studio/maven/plugins/StudioEclipseMojo.java:68: warning - @goal is an unknown tag.
[WARNING] /home/continuum/continuum-1.1/apps/continuum/webapp/WEB-INF/working-directory/31/src/main/java/org/apache/directory/studio/maven/plugins/StudioEclipseMojo.java:68: warning - @execute is an unknown tag.
[WARNING] /home/continuum/continuum-1.1/apps/continuum/webapp/WEB-INF/working-directory/31/src/main/java/org/apache/directory/studio/maven/plugins/StudioEclipseMojo.java:68: warning - @description is an unknown tag.
[WARNING] /home/continuum/continuum-1.1/apps/continuum/webapp/WEB-INF/working-directory/31/src/main/java/org/apache/directory/studio/maven/plugins/StudioEclipseMojo.java:68: warning - @requiresProject is an unknown tag.
[WARNING] /home/continuum/continuum-1.1/apps/continuum/webapp/WEB-INF/working-directory/31/src/main/java/org/apache/directory/studio/maven/plugins/StudioEclipseMojo.java:68: warning - @requiresDependencyResolution is an unknown tag.
[WARNING] /home/continuum/continuum-1.1/apps/continuum/webapp/WEB-INF/working-directory/31/src/main/java/org/apache/directory/studio/maven/plugins/StudioPrepareJarPackageMojo.java:46: warning - @goal is an unknown tag.
[WARNING] /home/continuum/continuum-1.1/apps/continuum/webapp/WEB-INF/working-directory/31/src/main/java/org/apache/directory/studio/maven/plugins/StudioPrepareJarPackageMojo.java:46: warning - @phase is an unknown tag.
[WARNING] /home/continuum/continuum-1.1/apps/continuum/webapp/WEB-INF/working-directory/31/src/main/java/org/apache/directory/studio/maven/plugins/StudioPrepareJarPackageMojo.java:46: warning - @aggregate is an unknown tag.
[WARNING] /home/continuum/continuum-1.1/apps/continuum/webapp/WEB-INF/working-directory/31/src/main/java/org/apache/directory/studio/maven/plugins/StudioPrepareJarPackageMojo.java:46: warning - @description is an unknown tag.
[WARNING] /home/continuum/continuum-1.1/apps/continuum/webapp/WEB-INF/working-directory/31/src/main/java/org/apache/directory/studio/maven/plugins/StudioPrepareJarPackageMojo.java:46: warning - @requiresProject is an unknown tag.
[WARNING] /home/continuum/continuum-1.1/apps/continuum/webapp/WEB-INF/working-directory/31/src/main/java/org/apache/directory/studio/maven/plugins/StudioPrepareJarPackageMojo.java:46: warning - @requiresDependencyResolution is an unknown tag.
[WARNING] /home/continuum/continuum-1.1/apps/continuum/webapp/WEB-INF/working-directory/31/src/main/java/org/apache/directory/studio/maven/plugins/StudioReplaceFileInJarMojo.java:44: warning - @goal is an unknown tag.
[WARNING] /home/continuum/continuum-1.1/apps/continuum/webapp/WEB-INF/working-directory/31/src/main/java/org/apache/directory/studio/maven/plugins/StudioReplaceFileInJarMojo.java:44: warning - @description is an unknown tag.
[WARNING] /home/continuum/continuum-1.1/apps/continuum/webapp/WEB-INF/working-directory/31/src/main/java/org/apache/directory/studio/maven/plugins/StudioReplaceFileInJarMojo.java:44: warning - @requiresProject is an unknown tag.
[WARNING] /home/continuum/continuum-1.1/apps/continuum/webapp/WEB-INF/working-directory/31/src/main/java/org/apache/directory/studio/maven/plugins/StudioReplaceFileInJarMojo.java:44: warning - @requiresDependencyResolution is an unknown tag.
[WARNING] /home/continuum/continuum-1.1/apps/continuum/webapp/WEB-INF/working-directory/31/src/main/java/org/apache/directory/studio/maven/plugins/StudioReplaceFileInJarMojo.java:55: warning - @parameter is an unknown tag.
[WARNING] /home/continuum/continuum-1.1/apps/continuum/webapp/WEB-INF/working-directory/31/src/main/java/org/apache/directory/studio/maven/plugins/StudioReplaceFileInJarMojo.java:55: warning - @required is an unknown tag.
[WARNING] /home/continuum/continuum-1.1/apps/continuum/webapp/WEB-INF/working-directory/31/src/main/java/org/apache/directory/studio/maven/plugins/StudioUnpackPrefixedMojo.java:44: warning - @goal is an unknown tag.
[WARNING] /home/continuum/continuum-1.1/apps/continuum/webapp/WEB-INF/working-directory/31/src/main/java/org/apache/directory/studio/maven/plugins/StudioUnpackPrefixedMojo.java:44: warning - @description is an unknown tag.
[WARNING] /home/continuum/continuum-1.1/apps/continuum/webapp/WEB-INF/working-directory/31/src/main/java/org/apache/directory/studio/maven/plugins/StudioUnpackPrefixedMojo.java:44: warning - @requiresProject is an unknown tag.
[WARNING] /home/continuum/continuum-1.1/apps/continuum/webapp/WEB-INF/working-directory/31/src/main/java/org/apache/directory/studio/maven/plugins/StudioUnpackPrefixedMojo.java:44: warning - @requiresDependencyResolution is an unknown tag.
[WARNING] /home/continuum/continuum-1.1/apps/continuum/webapp/WEB-INF/working-directory/31/src/main/java/org/apache/directory/studio/maven/plugins/StudioUnpackPrefixedMojo.java:55: warning - @parameter is an unknown tag.
[WARNING] /home/continuum/continuum-1.1/apps/continuum/webapp/WEB-INF/working-directory/31/src/main/java/org/apache/directory/studio/maven/plugins/StudioUnpackPrefixedMojo.java:55: warning - @required is an unknown tag.
[INFO] Generating "CPD Report" report.
[INFO] Generating "Plugin Documentation" report.
[INFO] Using 2 extractors.
[INFO] Applying extractor for language: java
[INFO] Extractor for language: java found 6 mojo descriptors.
[INFO] Applying extractor for language: bsh
[INFO] Extractor for language: bsh found 0 mojo descriptors.
[INFO] Generating "RAT Report" report.
[INFO] Generating "Issue Tracking" report.
[INFO] Generating "Surefire Report" report.
[INFO] Generating "Test Source Xref" report.
[INFO] Generating "Cobertura Test Coverage" report.
[INFO] Cobertura 1.9 - GNU GPL License (NO WARRANTY) - See COPYRIGHT file
Cobertura: Loaded information on 9 classes.
Report time: 382ms

[INFO] Cobertura Report generation was successful.
[INFO] Generating "Project License" report.
[INFO] Generating "Source Xref" report.
[INFO] [site:deploy]
scpexe://vm094.oxylos.org/var/www/html/projects/studio-plugin/ - Session: Opened  
Using private key: /home/continuum/.ssh/id_dsa
Executing command: /bin/sh -c ssh -i /home/continuum/.ssh/id_dsa -o 'BatchMode yes' continuum@vm094.oxylos.org 'mkdir -p /var/www/html/projects/studio-plugin/.'


Using private key: /home/continuum/.ssh/id_dsa
Executing command: /bin/sh -c ssh -i /home/continuum/.ssh/id_dsa -o 'BatchMode yes' continuum@vm094.oxylos.org 'mkdir -p /var/www/html/projects/studio-plugin//.
'


Uploading: ./wagon59971.zip to scpexe://vm094.oxylos.org/var/www/html/projects/studio-plugin/

Using private key: /home/continuum/.ssh/id_dsa
Executing command: /bin/sh -c cd /tmp && scp -i /home/continuum/.ssh/id_dsa -o 'BatchMode yes' wagon59971.zip continuum@vm094.oxylos.org:/var/www/html/projects/studio-plugin//./wagon59971.zip
###############################################################################Using private key: /home/continuum/.ssh/id_dsa
Executing command: /bin/sh -c ssh -i /home/continuum/.ssh/id_dsa -o 'BatchMode yes' continuum@vm094.oxylos.org 'chmod -f 644 /var/www/html/projects/studio-plugin//./wagon59971.zip
'



Transfer finished. 320094 bytes copied in 0.844 seconds
Using private key: /home/continuum/.ssh/id_dsa
Executing command: /bin/sh -c ssh -i /home/continuum/.ssh/id_dsa -o 'BatchMode yes' continuum@vm094.oxylos.org 'cd /var/www/html/projects/studio-plugin/.; unzip -o wagon59971.zip; rm -f wagon59971.zip'
Archive:  wagon59971.zip
  inflating: css/maven-base.css      
  inflating: css/print.css           
  inflating: css/site.css            
  inflating: css/maven-theme.css     
  inflating: index.html              
  inflating: pmd.xml                 
  inflating: copy-eclipse-artifact-mojo.html  
  inflating: surefire-report.html    
  inflating: project-reports.html    
  inflating: apidocs/options         
  inflating: apidocs/package-list    
  inflating: apidocs/overview-tree.html  
  inflating: apidocs/index.html      
  inflating: apidocs/constant-values.html  
  inflating: apidocs/allclasses-frame.html  
  inflating: apidocs/org/apache/directory/studio/maven/plugins/package-use.html  
  inflating: apidocs/org/apache/directory/studio/maven/plugins/StudioUnpackPrefixedMojo.html  
  inflating: apidocs/org/apache/directory/studio/maven/plugins/package-frame.html  
  inflating: apidocs/org/apache/directory/studio/maven/plugins/ArtifactItem.html  
  inflating: apidocs/org/apache/directory/studio/maven/plugins/StudioPrepareJarPackageMojo.html  
  inflating: apidocs/org/apache/directory/studio/maven/plugins/package-summary.html  
  inflating: apidocs/org/apache/directory/studio/maven/plugins/StudioCopyEclipseDependencyMojo.html  
  inflating: apidocs/org/apache/directory/studio/maven/plugins/StudioCleanMojo.html  
  inflating: apidocs/org/apache/directory/studio/maven/plugins/class-use/StudioUnpackPrefixedMojo.html  
  inflating: apidocs/org/apache/directory/studio/maven/plugins/class-use/ArtifactItem.html  
  inflating: apidocs/org/apache/directory/studio/maven/plugins/class-use/StudioPrepareJarPackageMojo.html  
  inflating: apidocs/org/apache/directory/studio/maven/plugins/class-use/StudioCopyEclipseDependencyMojo.html  
  inflating: apidocs/org/apache/directory/studio/maven/plugins/class-use/StudioCleanMojo.html  
  inflating: apidocs/org/apache/directory/studio/maven/plugins/class-use/AbstractStudioMojo.html  
  inflating: apidocs/org/apache/directory/studio/maven/plugins/class-use/StudioEclipseMojo.html  
  inflating: apidocs/org/apache/directory/studio/maven/plugins/class-use/StudioReplaceFileInJarMojo.html  
  inflating: apidocs/org/apache/directory/studio/maven/plugins/package-tree.html  
  inflating: apidocs/org/apache/directory/studio/maven/plugins/AbstractStudioMojo.html  
  inflating: apidocs/org/apache/directory/studio/maven/plugins/StudioEclipseMojo.html  
  inflating: apidocs/org/apache/directory/studio/maven/plugins/StudioReplaceFileInJarMojo.html  
  inflating: apidocs/index-all.html  
  inflating: apidocs/allclasses-noframe.html  
  inflating: apidocs/stylesheet.css  
  inflating: apidocs/deprecated-list.html  
  inflating: apidocs/packages        
  inflating: apidocs/resources/inherit.gif  
  inflating: apidocs/help-doc.html   
  inflating: faq.html                
  inflating: mail-lists.html         
  inflating: cpd.html                
  inflating: plugin-info.html        
  inflating: rat-report.html         
  inflating: cobertura/css/tooltip.css  
  inflating: cobertura/css/sortabletable.css  
  inflating: cobertura/css/source-viewer.css  
  inflating: cobertura/css/help.css  
  inflating: cobertura/css/main.css  
  inflating: cobertura/index.html    
  inflating: cobertura/help.html     
  inflating: cobertura/org.apache.directory.studio.maven.plugins.StudioEclipseMojo.html  
  inflating: cobertura/org.apache.directory.studio.maven.plugins.StudioCopyEclipseDependencyMojo.html  
  inflating: cobertura/org.apache.directory.studio.maven.plugins.AbstractStudioMojo.html  
  inflating: cobertura/frame-sourcefiles-org.apache.directory.studio.maven.plugins.html  
  inflating: cobertura/frame-sourcefiles.html  
  inflating: cobertura/org.apache.directory.studio.maven.plugins.StudioPrepareJarPackageMojo.html  
  inflating: cobertura/org.apache.directory.studio.maven.plugins.StudioCleanMojo.html  
  inflating: cobertura/frame-summary-org.apache.directory.studio.maven.plugins.html  
  inflating: cobertura/js/popup.js   
  inflating: cobertura/js/customsorttypes.js  
  inflating: cobertura/js/sortabletable.js  
  inflating: cobertura/js/stringbuilder.js  
  inflating: cobertura/org.apache.directory.studio.maven.plugins.StudioReplaceFileInJarMojo.html  
  inflating: cobertura/org.apache.directory.studio.maven.plugins.StudioUnpackPrefixedMojo.html  
  inflating: cobertura/frame-packages.html  
  inflating: cobertura/images/blank.png  
  inflating: cobertura/images/upsimple.png  
  inflating: cobertura/images/downsimple.png  
  inflating: cobertura/frame-summary.html  
  inflating: cobertura/org.apache.directory.studio.maven.plugins.ArtifactItem.html  
  inflating: team-list.html          
  inflating: clean-mojo.html         
  inflating: prepare-jar-package-mojo.html  
  inflating: xref/index.html         
  inflating: xref/allclasses-frame.html  
  inflating: xref/org/apache/directory/studio/maven/plugins/StudioUnpackPrefixedMojo.html  
  inflating: xref/org/apache/directory/studio/maven/plugins/package-frame.html  
  inflating: xref/org/apache/directory/studio/maven/plugins/ArtifactItem.html  
  inflating: xref/org/apache/directory/studio/maven/plugins/StudioPrepareJarPackageMojo.html  
  inflating: xref/org/apache/directory/studio/maven/plugins/package-summary.html  
  inflating: xref/org/apache/directory/studio/maven/plugins/StudioCopyEclipseDependencyMojo.html  
  inflating: xref/org/apache/directory/studio/maven/plugins/StudioCleanMojo.html  
  inflating: xref/org/apache/directory/studio/maven/plugins/AbstractStudioMojo.html  
  inflating: xref/org/apache/directory/studio/maven/plugins/StudioEclipseMojo.html  
  inflating: xref/org/apache/directory/studio/maven/plugins/StudioReplaceFileInJarMojo.html  
  inflating: xref/overview-summary.html  
  inflating: xref/overview-frame.html  
  inflating: xref/stylesheet.css     
  inflating: issue-tracking.html     
  inflating: license.html            
  inflating: eclipse-mojo.html       
  inflating: xref-test/index.html    
  inflating: xref-test/allclasses-frame.html  
  inflating: xref-test/org/apache/directory/studio/maven/plugins/StudioUnpackPrefixedMojoTest.html  
  inflating: xref-test/org/apache/directory/studio/maven/plugins/package-frame.html  
  inflating: xref-test/org/apache/directory/studio/maven/plugins/package-summary.html  
  inflating: xref-test/org/apache/directory/studio/maven/plugins/StudioCopyEclipseDependencyMojoTest.html  
  inflating: xref-test/org/apache/directory/studio/maven/plugins/stubs/package-frame.html  
  inflating: xref-test/org/apache/directory/studio/maven/plugins/stubs/package-summary.html  
  inflating: xref-test/org/apache/directory/studio/maven/plugins/stubs/StudioCopyEclipseDependencyProjectStub.html  
  inflating: xref-test/org/apache/directory/studio/maven/plugins/stubs/StudioUnpackPrefixedProjectStub.html  
  inflating: xref-test/org/apache/directory/studio/maven/plugins/stubs/StudioCleanProjectStub.html  
  inflating: xref-test/org/apache/directory/studio/maven/plugins/StudioCleanMojoTest.html  
  inflating: xref-test/overview-summary.html  
  inflating: xref-test/overview-frame.html  
  inflating: xref-test/stylesheet.css  
  inflating: cpd.xml                 
  inflating: dependencies.html       
  inflating: unpack-with-artifactid-prefix-mojo.html  
  inflating: source-repository.html  
  inflating: testapidocs/options     
  inflating: testapidocs/package-list  
  inflating: testapidocs/overview-tree.html  
  inflating: testapidocs/index.html  
  inflating: testapidocs/constant-values.html  
  inflating: testapidocs/allclasses-frame.html  
  inflating: testapidocs/org/apache/directory/studio/maven/plugins/StudioUnpackPrefixedMojoTest.html  
  inflating: testapidocs/org/apache/directory/studio/maven/plugins/package-use.html  
  inflating: testapidocs/org/apache/directory/studio/maven/plugins/package-frame.html  
  inflating: testapidocs/org/apache/directory/studio/maven/plugins/package-summary.html  
  inflating: testapidocs/org/apache/directory/studio/maven/plugins/StudioCopyEclipseDependencyMojoTest.html  
  inflating: testapidocs/org/apache/directory/studio/maven/plugins/class-use/StudioUnpackPrefixedMojoTest.html  
  inflating: testapidocs/org/apache/directory/studio/maven/plugins/class-use/StudioCopyEclipseDependencyMojoTest.html  
  inflating: testapidocs/org/apache/directory/studio/maven/plugins/class-use/StudioCleanMojoTest.html  
  inflating: testapidocs/org/apache/directory/studio/maven/plugins/package-tree.html  
  inflating: testapidocs/org/apache/directory/studio/maven/plugins/stubs/package-use.html  
  inflating: testapidocs/org/apache/directory/studio/maven/plugins/stubs/package-frame.html  
  inflating: testapidocs/org/apache/directory/studio/maven/plugins/stubs/package-summary.html  
  inflating: testapidocs/org/apache/directory/studio/maven/plugins/stubs/StudioCopyEclipseDependencyProjectStub.html  
  inflating: testapidocs/org/apache/directory/studio/maven/plugins/stubs/class-use/StudioCopyEclipseDependencyProjectStub.html  
  inflating: testapidocs/org/apache/directory/studio/maven/plugins/stubs/class-use/StudioUnpackPrefixedProjectStub.html  
  inflating: testapidocs/org/apache/directory/studio/maven/plugins/stubs/class-use/StudioCleanProjectStub.html  
  inflating: testapidocs/org/apache/directory/studio/maven/plugins/stubs/StudioUnpackPrefixedProjectStub.html  
  inflating: testapidocs/org/apache/directory/studio/maven/plugins/stubs/package-tree.html  
  inflating: testapidocs/org/apache/directory/studio/maven/plugins/stubs/StudioCleanProjectStub.html  
  inflating: testapidocs/org/apache/directory/studio/maven/plugins/StudioCleanMojoTest.html  
  inflating: testapidocs/index-all.html  
  inflating: testapidocs/allclasses-noframe.html  
  inflating: testapidocs/overview-summary.html  
  inflating: testapidocs/overview-frame.html  
  inflating: testapidocs/stylesheet.css  
  inflating: testapidocs/deprecated-list.html  
  inflating: testapidocs/packages    
  inflating: testapidocs/resources/inherit.gif  
  inflating: testapidocs/help-doc.html  
  inflating: examples/unpack-with-artifactid-prefix.html  
  inflating: examples/replace-file-in-eclipse-artifact.html  
  inflating: examples/prepare-jar-package.html  
  inflating: examples/copy-eclipse-artifact.html  
  inflating: taglist.html            
  inflating: replace-file-in-eclipse-artifact-mojo.html  
  inflating: usage.html              
  inflating: pmd.html                
  inflating: project-info.html       
  inflating: images/icon_info_sml.gif  
  inflating: images/icon_error_sml.gif  
  inflating: images/icon_warning_sml.gif  
  inflating: images/expanded.gif     
  inflating: images/collapsed.gif    
  inflating: images/logos/build-by-maven-white.png  
  inflating: images/logos/build-by-maven-black.png  
  inflating: images/logos/maven-feather.png  
  inflating: images/icon_success_sml.gif  
  inflating: images/close.gif        
  inflating: images/external.png     
  inflating: images/newwindow.png    


Using private key: /home/continuum/.ssh/id_dsa
Executing command: /bin/sh -c ssh -i /home/continuum/.ssh/id_dsa -o 'BatchMode yes' continuum@vm094.oxylos.org 'chmod -Rf g+w,a+rX /var/www/html/projects/studio-plugin/'


scpexe://vm094.oxylos.org/var/www/html/projects/studio-plugin/ - Session: Disconnecting  
scpexe://vm094.oxylos.org/var/www/html/projects/studio-plugin/ - Session: Disconnected
[INFO] ------------------------------------------------------------------------
[INFO] BUILD SUCCESSFUL
[INFO] ------------------------------------------------------------------------
[INFO] Total time: 52 seconds
[INFO] Finished at: Sat Sep 20 20:01:03 EDT 2008
[INFO] Final Memory: 66M/508M
[INFO] ------------------------------------------------------------------------

****************************************************************************



Mime
View raw message