directory-notifications mailing list archives

Site index · List index
Message view « Date » · « Thread »
Top « Date » · « Thread »
From Continuum VMBuild Server <contin...@vm094.oxylos.org>
Subject [continuum] BUILD FAILURE: Apache Directory Studio - Apache Directory Studio - Build Def: Build and deployment of studio snapshot distributions
Date Fri, 29 Aug 2008 15:33:27 GMT
Online report : http://vm094.oxylos.org/continuum/buildResult.action?buildId=1908&projectId=23

Build statistics:
  State: Failed
  Previous State: Failed
  Started at: Fri 29 Aug 2008 11:32:48 -0400
  Finished at: Fri 29 Aug 2008 11:33:24 -0400
  Total time: 35s
  Build Trigger: Schedule
  Build Number: 115
  Exit code: 1
  Building machine hostname: vm094.oxylos.org
  Operating system : Linux(unknown)
  Java Home version : 
          java version "1.6.0_06"
          Java(TM) SE Runtime Environment (build 1.6.0_06-b02)
          Java HotSpot(TM) Client VM (build 10.0-b22, mixed mode, sharing)
        
  Builder version :
          Maven version: 2.0.9
          Java version: 1.6.0_06
          OS name: "linux" version: "2.6.18-53.1.14.el5" arch: "i386" Family: "unix"
    
****************************************************************************
SCM Changes:
****************************************************************************
Changed: felixk @ Fri 29 Aug 2008 11:08:37 -0400
Comment: update parent pom version to get rat reports
Files changed:
  /directory/studio/trunk/pom.xml ( 690286 )

Changed: pamarcelot @ Fri 29 Aug 2008 11:10:19 -0400
Comment: Added Apache header.
Files changed:
  /directory/studio/trunk/ldapbrowser-core/src/main/java/org/apache/directory/studio/ldapbrowser/core/jobs/StudioBrowserJob.java
( 690287 )

Changed: pamarcelot @ Fri 29 Aug 2008 11:12:49 -0400
Comment: Added Apache header.
Files changed:
  /directory/studio/trunk/valueeditors/plugin.xml ( 690288 )

****************************************************************************
Dependencies Changes:
****************************************************************************
No dependencies changed


****************************************************************************
Build Defintion:
****************************************************************************
POM filename: pom.xml
Goals: clean deploy   
Arguments: -Plinux-x86,linux-x86_64,linux-ppc,macosx,win32 --batch-mode -DaltDeploymentRepository=id::default::scpexe://vm094.oxylos.org/var/www/html/mirror-maven2/
Build Fresh: false
Always Build: false
Default Build Definition: true
Schedule: EVERY_30_MINUTES
Description: Build and deployment of studio snapshot distributions

****************************************************************************
Test Summary:
****************************************************************************
Tests: 100
Failures: 0
Total time: 0.354


****************************************************************************
Output:
****************************************************************************
[INFO] Scanning for projects...
[INFO] Reactor build order: 
[INFO]   Apache Directory Studio
[INFO]   Apache Directory Studio Repository
[INFO]   Apache Directory Studio DSML Parser
[INFO]   Apache Directory Studio Jars
[INFO]   Apache Directory Studio LDIF Parser
[INFO]   Apache Directory Studio Connection Core
[INFO]   Apache Directory Studio LDAP Browser Core
[INFO]   Apache Directory Studio Connection UI
[INFO]   Apache Directory Studio LDAP Browser Common
[INFO]   Apache Directory Studio Value Editors
[INFO]   Apache Directory Studio ACI Item Editor
[INFO]   Apache Directory Studio Schema Editor
[INFO]   Apache Directory Studio Schema Editor Feature
[INFO]   Apache Directory Studio Schema Editor Help
[INFO]   Apache Directory Studio RCP
[INFO]   Apache Directory Studio RCP Feature
[INFO]   Apache Directory Studio RCP Help
[INFO]   Apache Directory Studio LDIF Editor
[INFO]   Apache Directory Studio LDIF Editor Feature
[INFO]   Apache Directory Studio LDIF Editor Help
[INFO]   Apache Directory Studio LDAP Browser UI
[INFO]   Apache Directory Studio LDAP Browser Feature
[INFO]   Apache Directory Studio LDAP Browser Help
[INFO]   Apache Directory Studio Apache DS Configuration
[INFO]   Apache Directory Studio Apache DS Configuration Feature
[INFO]   Apache Directory Studio Apache DS Configuration Help
[INFO]   Apache Directory Studio Apache DS Launcher
[INFO]   Apache Directory Studio Apache DS
[INFO]   Apache Directory Studio Apache DS Help
[INFO]   Apache Directory Studio Apache DS Feature
[INFO]   Apache Directory Studio Core Integration Tests
[INFO]   Apache Directory Studio UI Integration Tests
[INFO]   Apache Directory Studio Update Site
[INFO]   Apache Directory Studio Build
[INFO] ------------------------------------------------------------------------
[INFO] Building Apache Directory Studio
[INFO]    task-segment: [clean, deploy]
[INFO] ------------------------------------------------------------------------
[INFO] [clean:clean]
[INFO] Deleting directory /home/continuum/continuum-1.1/apps/continuum/webapp/WEB-INF/working-directory/23/target
[INFO] Setting property: classpath.resource.loader.class => 'org.codehaus.plexus.velocity.ContextClassLoaderResourceLoader'.
[INFO] Setting property: velocimacro.messages.on => 'false'.
[INFO] Setting property: resource.loader => 'classpath'.
[INFO] Setting property: resource.manager.logwhenfound => 'false'.
[INFO] [remote-resources:process {execution: default}]
[INFO] [site:attach-descriptor]
[INFO] [tools:verify-legal-files {execution: verify-legal-files}]
[INFO] [install:install]
[INFO] Installing /home/continuum/continuum-1.1/apps/continuum/webapp/WEB-INF/working-directory/23/pom.xml
to /home/continuum/.m2/repository/org/apache/directory/studio/parent/1.3.0.SNAPSHOT/parent-1.3.0.SNAPSHOT.pom
[INFO] [deploy:deploy]
altDeploymentRepository = id::default::scpexe://vm094.oxylos.org/var/www/html/mirror-maven2/
[INFO] Using alternate deployment repository id::default::scpexe://vm094.oxylos.org/var/www/html/mirror-maven2/
[INFO] Retrieving previous build number from id
Uploading: scpexe://vm094.oxylos.org/var/www/html/mirror-maven2//org/apache/directory/studio/parent/1.3.0.SNAPSHOT/parent-1.3.0.SNAPSHOT.pom
[INFO] Retrieving previous metadata from id
[INFO] Uploading repository metadata for: 'artifact org.apache.directory.studio:parent'
[INFO] Retrieving previous metadata from id
[INFO] Uploading repository metadata for: 'snapshot org.apache.directory.studio:parent:1.3.0.SNAPSHOT'
[INFO] ------------------------------------------------------------------------
[INFO] Building Apache Directory Studio Repository
[INFO]    task-segment: [clean, deploy]
[INFO] ------------------------------------------------------------------------
[INFO] [clean:clean]
[INFO] Deleting directory /home/continuum/continuum-1.1/apps/continuum/webapp/WEB-INF/working-directory/23/repository/target
[INFO] [remote-resources:process {execution: default}]
[INFO] [site:attach-descriptor]
[INFO] [tools:verify-legal-files {execution: verify-legal-files}]
[INFO] [install:install]
[INFO] Installing /home/continuum/continuum-1.1/apps/continuum/webapp/WEB-INF/working-directory/23/repository/pom.xml
to /home/continuum/.m2/repository/org/apache/directory/studio/repository/1.3.0.SNAPSHOT/repository-1.3.0.SNAPSHOT.pom
[INFO] [deploy:deploy]
altDeploymentRepository = id::default::scpexe://vm094.oxylos.org/var/www/html/mirror-maven2/
[INFO] Using alternate deployment repository id::default::scpexe://vm094.oxylos.org/var/www/html/mirror-maven2/
[INFO] Retrieving previous build number from id
Uploading: scpexe://vm094.oxylos.org/var/www/html/mirror-maven2//org/apache/directory/studio/repository/1.3.0.SNAPSHOT/repository-1.3.0.SNAPSHOT.pom
[INFO] Retrieving previous metadata from id
[INFO] Uploading repository metadata for: 'artifact org.apache.directory.studio:repository'
[INFO] Retrieving previous metadata from id
[INFO] Uploading repository metadata for: 'snapshot org.apache.directory.studio:repository:1.3.0.SNAPSHOT'
[INFO] ------------------------------------------------------------------------
[INFO] Building Apache Directory Studio DSML Parser
[INFO]    task-segment: [clean, deploy]
[INFO] ------------------------------------------------------------------------
[INFO] [clean:clean]
[INFO] Deleting directory /home/continuum/continuum-1.1/apps/continuum/webapp/WEB-INF/working-directory/23/studio-dsml-parser/target
[INFO] [remote-resources:process {execution: default}]
[INFO] [resources:resources]
[INFO] Using default encoding to copy filtered resources.
[INFO] [compiler:compile]
[INFO] Compiling 49 source files to /home/continuum/continuum-1.1/apps/continuum/webapp/WEB-INF/working-directory/23/studio-dsml-parser/target/classes
[INFO] ------------------------------------------------------------------------
[ERROR] BUILD FAILURE
[INFO] ------------------------------------------------------------------------
[INFO] Compilation failure

/home/continuum/continuum-1.1/apps/continuum/webapp/WEB-INF/working-directory/23/studio-dsml-parser/src/main/java/org/apache/directory/studio/dsmlv2/request/SearchRequestDsml.java:[159,53]
incompatible types
found   : java.util.List<org.apache.directory.shared.ldap.entry.EntryAttribute>
required: javax.naming.directory.Attributes

/home/continuum/continuum-1.1/apps/continuum/webapp/WEB-INF/working-directory/23/studio-dsml-parser/src/main/java/org/apache/directory/studio/dsmlv2/request/AddRequestDsml.java:[90,39]
cannot find symbol
symbol  : method getAttributes()
location: class org.apache.directory.shared.ldap.codec.add.AddRequest

/home/continuum/continuum-1.1/apps/continuum/webapp/WEB-INF/working-directory/23/studio-dsml-parser/src/main/java/org/apache/directory/studio/dsmlv2/request/AddRequestDsml.java:[142,35]
cannot find symbol
symbol  : method initAttributes()
location: class org.apache.directory.shared.ldap.codec.add.AddRequest

/home/continuum/continuum-1.1/apps/continuum/webapp/WEB-INF/working-directory/23/studio-dsml-parser/src/main/java/org/apache/directory/studio/dsmlv2/request/AddRequestDsml.java:[153,42]
cannot find symbol
symbol  : method getAttributes()
location: class org.apache.directory.shared.ldap.codec.add.AddRequest

/home/continuum/continuum-1.1/apps/continuum/webapp/WEB-INF/working-directory/23/studio-dsml-parser/src/main/java/org/apache/directory/studio/dsmlv2/request/AddRequestDsml.java:[186,51]
incompatible types
found   : org.apache.directory.shared.ldap.entry.Entry
required: org.apache.directory.shared.ldap.name.LdapDN

/home/continuum/continuum-1.1/apps/continuum/webapp/WEB-INF/working-directory/23/studio-dsml-parser/src/main/java/org/apache/directory/studio/dsmlv2/request/AddRequestDsml.java:[197,35]
cannot find symbol
symbol  : method setEntry(org.apache.directory.shared.ldap.name.LdapDN)
location: class org.apache.directory.shared.ldap.codec.add.AddRequest

/home/continuum/continuum-1.1/apps/continuum/webapp/WEB-INF/working-directory/23/studio-dsml-parser/src/main/java/org/apache/directory/studio/dsmlv2/request/Dsmlv2Grammar.java:[1182,22]
cannot find symbol
symbol  : method initAttributes()
location: class org.apache.directory.shared.ldap.codec.add.AddRequest

/home/continuum/continuum-1.1/apps/continuum/webapp/WEB-INF/working-directory/23/studio-dsml-parser/src/main/java/org/apache/directory/studio/dsmlv2/request/Dsmlv2Grammar.java:[1207,30]
cannot find symbol
symbol  : method setEntry(org.apache.directory.shared.ldap.name.LdapDN)
location: class org.apache.directory.shared.ldap.codec.add.AddRequest

/home/continuum/continuum-1.1/apps/continuum/webapp/WEB-INF/working-directory/23/studio-dsml-parser/src/main/java/org/apache/directory/studio/dsmlv2/reponse/SearchResultEntryDsml.java:[85,49]
cannot find symbol
symbol  : method getPartialAttributeList()
location: class org.apache.directory.shared.ldap.codec.search.SearchResultEntry

/home/continuum/continuum-1.1/apps/continuum/webapp/WEB-INF/working-directory/23/studio-dsml-parser/src/main/java/org/apache/directory/studio/dsmlv2/reponse/SearchResultEntryDsml.java:[161,49]
cannot find symbol
symbol  : method getPartialAttributeList()
location: class org.apache.directory.shared.ldap.codec.search.SearchResultEntry

/home/continuum/continuum-1.1/apps/continuum/webapp/WEB-INF/working-directory/23/studio-dsml-parser/src/main/java/org/apache/directory/studio/dsmlv2/reponse/SearchResultEntryDsml.java:[170,42]
cannot find symbol
symbol  : method setPartialAttributeList(javax.naming.directory.Attributes)
location: class org.apache.directory.shared.ldap.codec.search.SearchResultEntry


[INFO] ------------------------------------------------------------------------
[INFO] For more information, run Maven with the -e switch
[INFO] ------------------------------------------------------------------------
[INFO] Total time: 34 seconds
[INFO] Finished at: Fri Aug 29 11:33:24 EDT 2008
[INFO] Final Memory: 38M/508M
[INFO] ------------------------------------------------------------------------

****************************************************************************



Mime
View raw message