directory-notifications mailing list archives

Site index · List index
Message view « Date » · « Thread »
Top « Date » · « Thread »
From Continuum VMBuild Server <contin...@vm094.oxylos.org>
Subject [continuum] BUILD FAILURE: Apache Directory Studio - Apache Directory Studio - Build Def: Build and deployment of studio snapshot distributions
Date Sat, 26 Apr 2008 07:03:23 GMT
Online report : http://vm094.oxylos.org/continuum/buildResult.action?buildId=464&projectId=23

Build statistics:
  State: Failed
  Previous State: Error
  Started at: Sat 26 Apr 2008 03:03:19 -0400
  Finished at: Sat 26 Apr 2008 03:03:21 -0400
  Total time: 1s
  Build Trigger: Schedule
  Build Number: 19
  Exit code: 1
  Building machine hostname: vm094.oxylos.org
  Operating system : Linux(unknown)
  Java Home version : 
          java version "1.6.0_03"
          Java(TM) SE Runtime Environment (build 1.6.0_03-b05)
          Java HotSpot(TM) Client VM (build 1.6.0_03-b05, mixed mode, sharing)
        
  Builder version :
          Maven version: 2.0.9
          Java version: 1.6.0_03
          OS name: "linux" version: "2.6.18-53.1.14.el5" arch: "i386" Family: "unix"
    
****************************************************************************
SCM Changes:
****************************************************************************
No files changed

****************************************************************************
Dependencies Changes:
****************************************************************************
No dependencies changed


****************************************************************************
Build Defintion:
****************************************************************************
POM filename: pom.xml
Goals: clean deploy   
Arguments: -Plinux-x86,linux-x86_64,linux-ppc,macosx,win32 --batch-mode
Build Fresh: false
Always Build: false
Default Build Definition: true
Schedule: HOURLY
Description: Build and deployment of studio snapshot distributions

****************************************************************************
Test Summary:
****************************************************************************
Tests: 560
Failures: 0
Total time: 1.6080002


****************************************************************************
Output:
****************************************************************************
[INFO] Scanning for projects...
[INFO] ------------------------------------------------------------------------
[ERROR] FATAL ERROR
[INFO] ------------------------------------------------------------------------
[INFO] Error building POM (may not be this project's POM).


Project ID: org.apache.directory.studio:parent:pom:1.2.0.SNAPSHOT

Reason: Cannot find parent: org.apache.directory.project:project for project: org.apache.directory.studio:parent:pom:1.2.0.SNAPSHOT
for project org.apache.directory.studio:parent:pom:1.2.0.SNAPSHOT


[INFO] ------------------------------------------------------------------------
[INFO] Trace
org.apache.maven.reactor.MavenExecutionException: Cannot find parent: org.apache.directory.project:project
for project: org.apache.directory.studio:parent:pom:1.2.0.SNAPSHOT for project org.apache.directory.studio:parent:pom:1.2.0.SNAPSHOT
	at org.apache.maven.DefaultMaven.getProjects(DefaultMaven.java:378)
	at org.apache.maven.DefaultMaven.doExecute(DefaultMaven.java:292)
	at org.apache.maven.DefaultMaven.execute(DefaultMaven.java:129)
	at org.apache.maven.cli.MavenCli.main(MavenCli.java:287)
	at sun.reflect.NativeMethodAccessorImpl.invoke0(Native Method)
	at sun.reflect.NativeMethodAccessorImpl.invoke(NativeMethodAccessorImpl.java:39)
	at sun.reflect.DelegatingMethodAccessorImpl.invoke(DelegatingMethodAccessorImpl.java:25)
	at java.lang.reflect.Method.invoke(Method.java:597)
	at org.codehaus.classworlds.Launcher.launchEnhanced(Launcher.java:315)
	at org.codehaus.classworlds.Launcher.launch(Launcher.java:255)
	at org.codehaus.classworlds.Launcher.mainWithExitCode(Launcher.java:430)
	at org.codehaus.classworlds.Launcher.main(Launcher.java:375)
Caused by: org.apache.maven.project.ProjectBuildingException: Cannot find parent: org.apache.directory.project:project
for project: org.apache.directory.studio:parent:pom:1.2.0.SNAPSHOT for project org.apache.directory.studio:parent:pom:1.2.0.SNAPSHOT
	at org.apache.maven.project.DefaultMavenProjectBuilder.assembleLineage(DefaultMavenProjectBuilder.java:1370)
	at org.apache.maven.project.DefaultMavenProjectBuilder.buildInternal(DefaultMavenProjectBuilder.java:821)
	at org.apache.maven.project.DefaultMavenProjectBuilder.buildFromSourceFileInternal(DefaultMavenProjectBuilder.java:506)
	at org.apache.maven.project.DefaultMavenProjectBuilder.build(DefaultMavenProjectBuilder.java:198)
	at org.apache.maven.DefaultMaven.getProject(DefaultMaven.java:583)
	at org.apache.maven.DefaultMaven.collectProjects(DefaultMaven.java:461)
	at org.apache.maven.DefaultMaven.getProjects(DefaultMaven.java:365)
	... 11 more
Caused by: org.apache.maven.project.ProjectBuildingException: Error getting POM for 'org.apache.directory.project:project'
from the repository: Error transferring file
  org.apache.directory.project:project:pom:10-SNAPSHOT

from the specified remote repositories:
  apache.directory.snapshot.repo (http://vm094.oxylos.org/mirror-maven2/),
  central (http://repo1.maven.org/maven2)
 for project org.apache.directory.project:project
	at org.apache.maven.project.DefaultMavenProjectBuilder.findModelFromRepository(DefaultMavenProjectBuilder.java:590)
	at org.apache.maven.project.DefaultMavenProjectBuilder.assembleLineage(DefaultMavenProjectBuilder.java:1366)
	... 17 more
Caused by: org.apache.maven.artifact.resolver.ArtifactResolutionException: Error transferring
file
  org.apache.directory.project:project:pom:10-SNAPSHOT

from the specified remote repositories:
  apache.directory.snapshot.repo (http://vm094.oxylos.org/mirror-maven2/),
  central (http://repo1.maven.org/maven2)

	at org.apache.maven.artifact.resolver.DefaultArtifactResolver.resolve(DefaultArtifactResolver.java:217)
	at org.apache.maven.artifact.resolver.DefaultArtifactResolver.resolve(DefaultArtifactResolver.java:74)
	at org.apache.maven.project.DefaultMavenProjectBuilder.findModelFromRepository(DefaultMavenProjectBuilder.java:556)
	... 18 more
Caused by: org.apache.maven.wagon.TransferFailedException: Error transferring file
	at org.apache.maven.wagon.providers.http.LightweightHttpWagon.fillInputData(LightweightHttpWagon.java:104)
	at org.apache.maven.wagon.StreamWagon.getIfNewer(StreamWagon.java:94)
	at org.apache.maven.artifact.manager.DefaultWagonManager.getRemoteFile(DefaultWagonManager.java:454)
	at org.apache.maven.artifact.manager.DefaultWagonManager.getArtifact(DefaultWagonManager.java:354)
	at org.apache.maven.artifact.resolver.DefaultArtifactResolver.resolve(DefaultArtifactResolver.java:196)
	... 20 more
Caused by: java.net.ConnectException: Connection refused
	at java.net.PlainSocketImpl.socketConnect(Native Method)
	at java.net.PlainSocketImpl.doConnect(PlainSocketImpl.java:333)
	at java.net.PlainSocketImpl.connectToAddress(PlainSocketImpl.java:195)
	at java.net.PlainSocketImpl.connect(PlainSocketImpl.java:182)
	at java.net.Socket.connect(Socket.java:519)
	at java.net.Socket.connect(Socket.java:469)
	at sun.net.NetworkClient.doConnect(NetworkClient.java:157)
	at sun.net.www.http.HttpClient.openServer(HttpClient.java:394)
	at sun.net.www.http.HttpClient.openServer(HttpClient.java:529)
	at sun.net.www.http.HttpClient.<init>(HttpClient.java:233)
	at sun.net.www.http.HttpClient.New(HttpClient.java:306)
	at sun.net.www.http.HttpClient.New(HttpClient.java:323)
	at sun.net.www.protocol.http.HttpURLConnection.getNewHttpClient(HttpURLConnection.java:788)
	at sun.net.www.protocol.http.HttpURLConnection.plainConnect(HttpURLConnection.java:729)
	at sun.net.www.protocol.http.HttpURLConnection.connect(HttpURLConnection.java:654)
	at sun.net.www.protocol.http.HttpURLConnection.getInputStream(HttpURLConnection.java:977)
	at org.apache.maven.wagon.providers.http.LightweightHttpWagon.fillInputData(LightweightHttpWagon.java:83)
	... 24 more
[INFO] ------------------------------------------------------------------------
[INFO] Total time: < 1 second
[INFO] Finished at: Sat Apr 26 03:03:20 EDT 2008
[INFO] Final Memory: 1M/254M
[INFO] ------------------------------------------------------------------------

****************************************************************************



Mime
View raw message