directory-notifications mailing list archives

Site index · List index
Message view « Date » · « Thread »
Top « Date » · « Thread »
From Continuum VMBuild Server <contin...@vm094.oxylos.org>
Subject [continuum] BUILD FAILURE: Default Project Group - Triplesec - Build Def: default maven2 buildDefinition integration
Date Mon, 31 Mar 2008 03:01:43 GMT
Online report : http://vm094.oxylos.org/continuum/buildResult.action?buildId=298&projectId=11

Build statistics:
  State: Failed
  Previous State: Failed
  Started at: Sun 30 Mar 2008 23:00:25 -0400
  Finished at: Sun 30 Mar 2008 23:01:38 -0400
  Total time: 1m 12s
  Build Trigger: Schedule
  Build Number: 0
  Exit code: 1
  Building machine hostname: vm094.oxylos.com
  Operating system : Linux(unknown)
  Java Home version : 
          java version "1.6.0_03"
          Java(TM) SE Runtime Environment (build 1.6.0_03-b05)
          Java HotSpot(TM) Client VM (build 1.6.0_03-b05, mixed mode, sharing)
        
  Builder version :
          Maven version: 2.0.8
          Java version: 1.6.0_03
          OS name: "linux" version: "2.6.18-53.1.14.el5" arch: "i386" Family: "unix"
    
****************************************************************************
SCM Changes:
****************************************************************************
Changed: no author @ no date
Comment: no comment
Files changed:
  pom.xml ( no revision )

****************************************************************************
Dependencies Changes:
****************************************************************************
No dependencies changed


****************************************************************************
Build Defintion:
****************************************************************************
POM filename: pom.xml
Goals: clean deploy   
Arguments: --batch-mode
Build Fresh: false
Always Build: false
Default Build Definition: true
Schedule: HOURLY
Description: default maven2 buildDefinition integration

****************************************************************************
Test Summary:
****************************************************************************
Tests: 0
Failures: 0
Total time: 0.0


****************************************************************************
Output:
****************************************************************************
[INFO] Scanning for projects...
[INFO] snapshot org.apache.directory.project:project:10-SNAPSHOT: checking for updates from
java.net
[INFO] Reactor build order: 
[INFO]   Triplesec
[INFO]   TripleSec Changelog Subsystem
[INFO]   Triplesec Configuration API
[INFO]   Triplesec Profile API
[INFO]   Triplesec Test Profiles
[INFO]   Triplesec Crypto API
[INFO]   Triplesec OTP API
[INFO]   Triplesec Guardian Authorization API
[INFO]   Triplesec JAAS Login Module
[INFO]   Triplesec Store
[INFO]   Triplesec SAM Verifier
[INFO]   Triplesec Configuration IO Utilities
[INFO]   Triplesec SMS API
[INFO]   Triplesec Main
[INFO]   Triplesec Integration Testing
[INFO]   Triplesec Server Tools
[INFO]   Triplesec Admin API
[INFO]   Triplesec Guardian LDAP Driver
[INFO]   Triplesec Guardian LDIF Driver
[INFO]   Triplesec Utilities for Hauskeys Midlet
[INFO]   Triplesec Wicket Tools
[INFO]   Triplesec Webapp for Root
[INFO]   Triplesec Webapp for User Registration (Wicket Based)
[INFO]   Triplesec Webapp for Activation of Accounts
[INFO]   Triplesec Webapp Demo (Wicket Based)
[INFO]   Triplesec Webapp Servlet Demo
[INFO]   Triplesec Webapp Admin (Wicket Based)
[INFO]   Triplesec Webapp for Server Configuration
[INFO]   Triplesec Webapp for Changelog Service
[INFO]   Triplesec Admin App (Swing Based)
[INFO]   Triplesec Swing Demo Application
[INFO] ------------------------------------------------------------------------
[INFO] Building Triplesec
[INFO]    task-segment: [clean, deploy]
[INFO] ------------------------------------------------------------------------
[INFO] [clean:clean]
[INFO] Deleting directory /home/continuum/continuum-1.1/apps/continuum/webapp/WEB-INF/working-directory/11/target
[INFO] Deleting directory /home/continuum/continuum-1.1/apps/continuum/webapp/WEB-INF/working-directory/11/target/classes
[INFO] Deleting directory /home/continuum/continuum-1.1/apps/continuum/webapp/WEB-INF/working-directory/11/target/test-classes
[INFO] artifact org.apache.maven.plugins:maven-deploy-plugin: checking for updates from apache.directory.plugins
[INFO] Setting property: classpath.resource.loader.class => 'org.codehaus.plexus.velocity.ContextClassLoaderResourceLoader'.
[INFO] Setting property: velocimacro.messages.on => 'false'.
[INFO] Setting property: resource.loader => 'classpath'.
[INFO] Setting property: resource.manager.logwhenfound => 'false'.
[INFO] [remote-resources:process {execution: default}]
[INFO] [site:attach-descriptor]
[WARNING] Unable to load parent project from repository: Could not find the model file '/home/continuum/continuum-1.1/apps/continuum/webapp/WEB-INF/working-directory/11/../pom.xml'.
for project unknown
[INFO] [tools:verify-legal-files {execution: verify-legal-files}]
[INFO] [install:install]
[INFO] Installing /home/continuum/continuum-1.1/apps/continuum/webapp/WEB-INF/working-directory/11/pom.xml
to /home/continuum/.m2/repository/org/apache/directory/triplesec/triplesec-parent/1.0-SNAPSHOT/triplesec-parent-1.0-SNAPSHOT.pom
[INFO] [deploy:deploy]
altDeploymentRepository = null
[INFO] Retrieving previous build number from apache.directory.snapshot.repo
Uploading: scpexe://vm094.oxylos.org/var/www/html/mirror-maven2/org/apache/directory/triplesec/triplesec-parent/1.0-SNAPSHOT/triplesec-parent-1.0-SNAPSHOT.pom
[INFO] Retrieving previous metadata from apache.directory.snapshot.repo
[INFO] Uploading repository metadata for: 'snapshot org.apache.directory.triplesec:triplesec-parent:1.0-SNAPSHOT'
[INFO] Retrieving previous metadata from apache.directory.snapshot.repo
[INFO] Uploading site descriptor for triplesec-parent 1.0-SNAPSHOT site.xml
[INFO] Retrieving previous metadata from apache.directory.snapshot.repo
[INFO] Uploading repository metadata for: 'artifact org.apache.directory.triplesec:triplesec-parent'
[INFO] ------------------------------------------------------------------------
[INFO] Building TripleSec Changelog Subsystem
[INFO]    task-segment: [clean, deploy]
[INFO] ------------------------------------------------------------------------
[INFO] [clean:clean]
[INFO] Deleting directory /home/continuum/continuum-1.1/apps/continuum/webapp/WEB-INF/working-directory/11/changelog/target
[INFO] Deleting directory /home/continuum/continuum-1.1/apps/continuum/webapp/WEB-INF/working-directory/11/changelog/target/classes
[INFO] Deleting directory /home/continuum/continuum-1.1/apps/continuum/webapp/WEB-INF/working-directory/11/changelog/target/test-classes
[INFO] artifact org.apache.maven.plugins:maven-resources-plugin: checking for updates from
apache.directory.plugins
[INFO] snapshot org.apache.directory.server:apacheds-core:1.5.2-SNAPSHOT: checking for updates
from java.net
[INFO] snapshot org.apache.directory.server:apacheds-core:1.5.2-SNAPSHOT: checking for updates
from apache.snapshots
[INFO] snapshot org.apache.directory.server:apacheds-parent:1.5.2-SNAPSHOT: checking for updates
from java.net
[INFO] snapshot org.apache.directory.server:apacheds-parent:1.5.2-SNAPSHOT: checking for updates
from apache.snapshots
[INFO] snapshot org.apache.directory.shared:shared-ldap:0.9.9-SNAPSHOT: checking for updates
from java.net
[INFO] snapshot org.apache.directory.shared:shared-ldap:0.9.9-SNAPSHOT: checking for updates
from apache.snapshots
[INFO] snapshot org.apache.directory.shared:shared-parent:0.9.9-SNAPSHOT: checking for updates
from java.net
[INFO] snapshot org.apache.directory.shared:shared-parent:0.9.9-SNAPSHOT: checking for updates
from apache.snapshots
[INFO] snapshot org.apache.directory.shared:shared-asn1:0.9.9-SNAPSHOT: checking for updates
from java.net
[INFO] snapshot org.apache.directory.shared:shared-asn1:0.9.9-SNAPSHOT: checking for updates
from apache.snapshots
[INFO] snapshot org.apache.directory.shared:shared-ldap-constants:0.9.9-SNAPSHOT: checking
for updates from java.net
[INFO] snapshot org.apache.directory.shared:shared-ldap-constants:0.9.9-SNAPSHOT: checking
for updates from apache.snapshots
Downloading: https://maven-repository.dev.java.net/nonav/repository/antlr/poms/antlr-2.7.6.pom
Downloading: http://repo1.maven.org/maven2/antlr/antlr/2.7.6/antlr-2.7.6.pom
230b downloaded
[INFO] snapshot org.apache.directory.server:apacheds-schema-bootstrap:1.5.2-SNAPSHOT: checking
for updates from java.net
[INFO] snapshot org.apache.directory.server:apacheds-schema-bootstrap:1.5.2-SNAPSHOT: checking
for updates from apache.snapshots
[INFO] snapshot org.apache.directory.server:apacheds-schema-registries:1.5.2-SNAPSHOT: checking
for updates from java.net
[INFO] snapshot org.apache.directory.server:apacheds-schema-registries:1.5.2-SNAPSHOT: checking
for updates from apache.snapshots
[INFO] snapshot org.apache.directory.server:apacheds-core-shared:1.5.2-SNAPSHOT: checking
for updates from java.net
[INFO] snapshot org.apache.directory.server:apacheds-core-shared:1.5.2-SNAPSHOT: checking
for updates from apache.snapshots
[INFO] snapshot org.apache.directory.server:apacheds-core-constants:1.5.2-SNAPSHOT: checking
for updates from java.net
[INFO] snapshot org.apache.directory.server:apacheds-core-constants:1.5.2-SNAPSHOT: checking
for updates from apache.snapshots
[INFO] snapshot org.apache.directory.server:apacheds-core-entry:1.5.2-SNAPSHOT: checking for
updates from java.net
[INFO] snapshot org.apache.directory.server:apacheds-core-entry:1.5.2-SNAPSHOT: checking for
updates from apache.snapshots
[INFO] snapshot org.apache.directory.server:apacheds-utils:1.5.2-SNAPSHOT: checking for updates
from java.net
[INFO] snapshot org.apache.directory.server:apacheds-utils:1.5.2-SNAPSHOT: checking for updates
from apache.snapshots
[INFO] snapshot org.apache.directory.server:apacheds-jdbm-store:1.5.2-SNAPSHOT: checking for
updates from java.net
[INFO] snapshot org.apache.directory.server:apacheds-jdbm-store:1.5.2-SNAPSHOT: checking for
updates from apache.snapshots
[INFO] snapshot org.apache.directory.server:apacheds-btree-base:1.5.2-SNAPSHOT: checking for
updates from java.net
[INFO] snapshot org.apache.directory.server:apacheds-btree-base:1.5.2-SNAPSHOT: checking for
updates from apache.snapshots
[INFO] snapshot org.apache.directory.server:apacheds-bootstrap-extract:1.5.2-SNAPSHOT: checking
for updates from java.net
[INFO] snapshot org.apache.directory.server:apacheds-bootstrap-extract:1.5.2-SNAPSHOT: checking
for updates from apache.snapshots
[INFO] snapshot org.apache.directory.server:apacheds-server-jndi:1.5.2-SNAPSHOT: checking
for updates from java.net
[INFO] snapshot org.apache.directory.server:apacheds-server-jndi:1.5.2-SNAPSHOT: checking
for updates from apache.snapshots
[INFO] snapshot org.apache.directory.server:apacheds-protocol-ldap:1.5.2-SNAPSHOT: checking
for updates from java.net
[INFO] snapshot org.apache.directory.server:apacheds-protocol-ldap:1.5.2-SNAPSHOT: checking
for updates from apache.snapshots
[INFO] snapshot org.apache.directory.shared:shared-asn1-codec:0.9.9-SNAPSHOT: checking for
updates from java.net
[INFO] snapshot org.apache.directory.shared:shared-asn1-codec:0.9.9-SNAPSHOT: checking for
updates from apache.snapshots
[INFO] snapshot org.apache.directory.server:apacheds-kerberos-shared:1.5.2-SNAPSHOT: checking
for updates from java.net
[INFO] snapshot org.apache.directory.server:apacheds-kerberos-shared:1.5.2-SNAPSHOT: checking
for updates from apache.snapshots
[INFO] snapshot org.apache.directory.server:apacheds-protocol-shared:1.5.2-SNAPSHOT: checking
for updates from java.net
[INFO] snapshot org.apache.directory.server:apacheds-protocol-shared:1.5.2-SNAPSHOT: checking
for updates from apache.snapshots
[INFO] snapshot org.apache.directory.server:apacheds-bootstrap-partition:1.5.2-SNAPSHOT: checking
for updates from java.net
[INFO] snapshot org.apache.directory.server:apacheds-bootstrap-partition:1.5.2-SNAPSHOT: checking
for updates from apache.snapshots
[INFO] snapshot org.apache.directory.server:apacheds-schema-extras:1.5.2-SNAPSHOT: checking
for updates from java.net
[INFO] snapshot org.apache.directory.server:apacheds-schema-extras:1.5.2-SNAPSHOT: checking
for updates from apache.snapshots
1071K downloaded
91K downloaded
15K downloaded
Downloading: https://maven-repository.dev.java.net/nonav/repository/antlr/jars/antlr-2.7.6.jar
Downloading: http://repo1.maven.org/maven2/antlr/antlr/2.7.6/antlr-2.7.6.jar
433K downloaded
12K downloaded
[INFO] [remote-resources:process {execution: default}]
[INFO] [resources:resources]
[INFO] Using default encoding to copy filtered resources.
[INFO] [compiler:compile]
[INFO] Compiling 12 source files to /home/continuum/continuum-1.1/apps/continuum/webapp/WEB-INF/working-directory/11/changelog/target/classes
[INFO] ------------------------------------------------------------------------
[ERROR] BUILD FAILURE
[INFO] ------------------------------------------------------------------------
[INFO] Compilation failure

/home/continuum/continuum-1.1/apps/continuum/webapp/WEB-INF/working-directory/11/changelog/src/main/java/org/apache/directory/triplesec/changelog/beta/interceptor/ChangelogService.java:[37,39]
cannot find symbol
symbol  : class DirectoryServiceConfiguration
location: package org.apache.directory.server.core

/home/continuum/continuum-1.1/apps/continuum/webapp/WEB-INF/working-directory/11/changelog/src/main/java/org/apache/directory/triplesec/changelog/beta/interceptor/ChangelogService.java:[38,53]
cannot find symbol
symbol  : class InterceptorConfiguration
location: package org.apache.directory.server.core.configuration

/home/continuum/continuum-1.1/apps/continuum/webapp/WEB-INF/working-directory/11/changelog/src/main/java/org/apache/directory/triplesec/changelog/beta/interceptor/ChangelogService.java:[43,46]
cannot find symbol
symbol  : class AttributeTypeRegistry
location: package org.apache.directory.server.core.schema

/home/continuum/continuum-1.1/apps/continuum/webapp/WEB-INF/working-directory/11/changelog/src/main/java/org/apache/directory/triplesec/changelog/beta/interceptor/ChangelogService.java:[89,12]
cannot find symbol
symbol  : class AttributeTypeRegistry
location: class org.apache.directory.triplesec.changelog.beta.interceptor.ChangelogService

/home/continuum/continuum-1.1/apps/continuum/webapp/WEB-INF/working-directory/11/changelog/src/main/java/org/apache/directory/triplesec/changelog/beta/interceptor/ChangelogService.java:[105,22]
cannot find symbol
symbol  : class DirectoryServiceConfiguration
location: class org.apache.directory.triplesec.changelog.beta.interceptor.ChangelogService

/home/continuum/continuum-1.1/apps/continuum/webapp/WEB-INF/working-directory/11/changelog/src/main/java/org/apache/directory/triplesec/changelog/beta/interceptor/ChangelogService.java:[105,62]
cannot find symbol
symbol  : class InterceptorConfiguration
location: class org.apache.directory.triplesec.changelog.beta.interceptor.ChangelogService

/home/continuum/continuum-1.1/apps/continuum/webapp/WEB-INF/working-directory/11/changelog/src/main/java/org/apache/directory/triplesec/changelog/beta/support/AttributeUtils.java:[31,46]
cannot find symbol
symbol  : class AttributeTypeRegistry
location: package org.apache.directory.server.core.schema

/home/continuum/continuum-1.1/apps/continuum/webapp/WEB-INF/working-directory/11/changelog/src/main/java/org/apache/directory/triplesec/changelog/beta/support/AttributeUtils.java:[38,79]
cannot find symbol
symbol  : class AttributeTypeRegistry
location: class org.apache.directory.triplesec.changelog.beta.support.AttributeUtils

/home/continuum/continuum-1.1/apps/continuum/webapp/WEB-INF/working-directory/11/changelog/src/main/java/org/apache/directory/triplesec/changelog/beta/support/AttributeUtils.java:[53,78]
cannot find symbol
symbol  : class AttributeTypeRegistry
location: class org.apache.directory.triplesec.changelog.beta.support.AttributeUtils

/home/continuum/continuum-1.1/apps/continuum/webapp/WEB-INF/working-directory/11/changelog/src/main/java/org/apache/directory/triplesec/changelog/beta/interceptor/ChangelogService.java:[223,12]
add(org.apache.directory.server.core.interceptor.context.AddOperationContext) in org.apache.directory.server.core.interceptor.NextInterceptor
cannot be applied to (org.apache.directory.shared.ldap.name.LdapDN,javax.naming.directory.Attributes)

/home/continuum/continuum-1.1/apps/continuum/webapp/WEB-INF/working-directory/11/changelog/src/main/java/org/apache/directory/triplesec/changelog/beta/interceptor/ChangelogService.java:[244,12]
delete(org.apache.directory.server.core.interceptor.context.DeleteOperationContext) in org.apache.directory.server.core.interceptor.NextInterceptor
cannot be applied to (org.apache.directory.shared.ldap.name.LdapDN)

/home/continuum/continuum-1.1/apps/continuum/webapp/WEB-INF/working-directory/11/changelog/src/main/java/org/apache/directory/triplesec/changelog/beta/interceptor/ChangelogService.java:[274,12]
modify(org.apache.directory.server.core.interceptor.context.ModifyOperationContext) in org.apache.directory.server.core.interceptor.NextInterceptor
cannot be applied to (org.apache.directory.shared.ldap.name.LdapDN,int,javax.naming.directory.Attributes)

/home/continuum/continuum-1.1/apps/continuum/webapp/WEB-INF/working-directory/11/changelog/src/main/java/org/apache/directory/triplesec/changelog/beta/interceptor/ChangelogService.java:[298,12]
modify(org.apache.directory.server.core.interceptor.context.ModifyOperationContext) in org.apache.directory.server.core.interceptor.NextInterceptor
cannot be applied to (org.apache.directory.shared.ldap.name.LdapDN,org.apache.directory.shared.ldap.message.ModificationItemImpl[])

/home/continuum/continuum-1.1/apps/continuum/webapp/WEB-INF/working-directory/11/changelog/src/main/java/org/apache/directory/triplesec/changelog/beta/interceptor/ChangelogService.java:[325,12]
cannot find symbol
symbol  : method modifyRn(org.apache.directory.shared.ldap.name.LdapDN,java.lang.String,boolean)
location: interface org.apache.directory.server.core.interceptor.NextInterceptor

/home/continuum/continuum-1.1/apps/continuum/webapp/WEB-INF/working-directory/11/changelog/src/main/java/org/apache/directory/triplesec/changelog/beta/interceptor/ChangelogService.java:[353,12]
move(org.apache.directory.server.core.interceptor.context.MoveOperationContext) in org.apache.directory.server.core.interceptor.NextInterceptor
cannot be applied to (org.apache.directory.shared.ldap.name.LdapDN,org.apache.directory.shared.ldap.name.LdapDN,java.lang.String,boolean)

/home/continuum/continuum-1.1/apps/continuum/webapp/WEB-INF/working-directory/11/changelog/src/main/java/org/apache/directory/triplesec/changelog/beta/interceptor/ChangelogService.java:[381,12]
move(org.apache.directory.server.core.interceptor.context.MoveOperationContext) in org.apache.directory.server.core.interceptor.NextInterceptor
cannot be applied to (org.apache.directory.shared.ldap.name.LdapDN,org.apache.directory.shared.ldap.name.LdapDN)

/home/continuum/continuum-1.1/apps/continuum/webapp/WEB-INF/working-directory/11/changelog/src/main/java/org/apache/directory/triplesec/changelog/beta/interceptor/ChangelogService.java:[388,37]
cannot find symbol
symbol  : method getRdn(java.lang.String)
location: class org.apache.directory.shared.ldap.util.NamespaceTools


[INFO] ------------------------------------------------------------------------
[INFO] For more information, run Maven with the -e switch
[INFO] ------------------------------------------------------------------------
[INFO] Total time: 1 minute 12 seconds
[INFO] Finished at: Sun Mar 30 23:01:37 EDT 2008
[INFO] Final Memory: 25M/254M
[INFO] ------------------------------------------------------------------------

****************************************************************************



Mime
View raw message