directory-dev mailing list archives

Site index · List index
Message view « Date » · « Thread »
Top « Date » · « Thread »
From Brian Burch <br...@pingtoo.com>
Subject Re: [VOTE] Apache DS 2.0.0-M24 release
Date Mon, 05 Jun 2017 12:37:34 GMT
On 04/06/17 05:31, Emmanuel Lecharny wrote:
> Hi,
> 
> This is mainly a maintenance release, and it's needed to be able to 
> release Studio with many fixes related to the server itself. The main 
> fixes are related to SyntaxCheckers, which are now immutable, and the 
> switch to LDAP 1.0.0 which fixes a critical SSL issue. Otherwise, the 
> 'repair' command has been fixed, and a thread leak has been fixed.
> 
> 
> Here are the fixed issues :
> 
> 
> Bugs :
> ------
> 
>   * [DIRSERVER-2190 
> <https://issues.apache.org/jira/browse/DIRSERVER-2190>] - there is 
> thread leak when did following operations: ADD,DELETE,MODIFY,MOVE,RENAME
> * [DIRSERVER-2173 
> <https://issues.apache.org/jira/browse/DIRSERVER-2173>] - Linux binary 
> installation fails because RUN_AS_GROUP not used in chown commands
> * [DIRSERVER-2121 
> <https://issues.apache.org/jira/browse/DIRSERVER-2121>] - ApacheDS fails 
> * * [DIRSERVER-2072 
> <https://issues.apache.org/jira/browse/DIRSERVER-2072>] - to start after 
> upgrading to 2.0.0-M21
> Documentation For Kerberos Configuration Needs To Be Updated
> 
> 
> 
> Improvements :
> --------------
> 
>    * [DIRSERVER-2186 
> <https://issues.apache.org/jira/browse/DIRSERVER-2186>] - Fix repair command
> 
> 
> 
> 
> Here are the associated links :
> 
> ApacheDS 2.0.0-M24
> ------------------
> - SVN tag :
> 
> http://svn.apache.org/viewvc?rev=1797497&view=rev
> 
> 
> 
> https://svn.apache.org/repos/asf/directory/apacheds/tags/2.0.0-M24/
> 
> - Nexus repository:
> https://repository.apache.org/content/repositories/orgapachedirectory-1235/
> 
> - Distribution packages and sources :
> https://dist.apache.org/repos/dist/dev/directory/apacheds/2.0.0-M24/

Oh dear, here I go again! Is this the same problem I had with the API 
release?

At revision 1797631.

Running org.apache.directory.dsml.engine.Dsmlv2EngineIT
Tests run: 2, Failures: 0, Errors: 0, Skipped: 0, Time elapsed: 11.247 
sec - in org.apache.directory.dsml.engine.Dsmlv2EngineIT
Running org.apache.directory.IndexIT
Tests run: 2, Failures: 0, Errors: 0, Skipped: 1, Time elapsed: 0.162 
sec - in org.apache.directory.IndexIT
Running org.apache.directory.server.operations.modify.IllegalModificationIT
Tests run: 2, Failures: 0, Errors: 0, Skipped: 0, Time elapsed: 11.136 
sec - in org.apache.directory.server.operations.modify.IllegalModificationIT
Running org.apache.directory.server.operations.modify.ModifyReplaceIT
Tests run: 8, Failures: 0, Errors: 0, Skipped: 0, Time elapsed: 13.775 
sec - in org.apache.directory.server.operations.modify.ModifyReplaceIT
Running 
org.apache.directory.server.operations.modify.ModifyMultipleChangesIT
Tests run: 2, Failures: 0, Errors: 0, Skipped: 0, Time elapsed: 15.994 
sec - in 
org.apache.directory.server.operations.modify.ModifyMultipleChangesIT
Running org.apache.directory.server.operations.modify.ModifyReferralIT
Tests run: 4, Failures: 0, Errors: 0, Skipped: 0, Time elapsed: 11.585 
sec - in org.apache.directory.server.operations.modify.ModifyReferralIT
Running org.apache.directory.server.operations.modify.ModifyRemoveIT
Tests run: 16, Failures: 0, Errors: 0, Skipped: 0, Time elapsed: 37.473 
sec - in org.apache.directory.server.operations.modify.ModifyRemoveIT
Running org.apache.directory.server.operations.modify.ModifyAddIT
Tests run: 18, Failures: 0, Errors: 0, Skipped: 0, Time elapsed: 29.257 
sec - in org.apache.directory.server.operations.modify.ModifyAddIT
Running org.apache.directory.server.operations.add.AddAliasIT
Tests run: 3, Failures: 0, Errors: 0, Skipped: 0, Time elapsed: 25.318 
sec - in org.apache.directory.server.operations.add.AddAliasIT
Running org.apache.directory.server.operations.add.AddIT
Tests run: 33, Failures: 0, Errors: 0, Skipped: 0, Time elapsed: 93.555 
sec - in org.apache.directory.server.operations.add.AddIT
Running 
org.apache.directory.server.operations.add.AddingEntriesWithSpecialCharactersInRDNIT
Tests run: 9, Failures: 0, Errors: 0, Skipped: 0, Time elapsed: 36.34 
sec - in 
org.apache.directory.server.operations.add.AddingEntriesWithSpecialCharactersInRDNIT
Running org.apache.directory.server.operations.compare.CompareIT
Tests run: 7, Failures: 0, Errors: 0, Skipped: 0, Time elapsed: 14.147 
sec - in org.apache.directory.server.operations.compare.CompareIT
Running org.apache.directory.server.operations.compare.MatchingRuleCompareIT
Tests run: 2, Failures: 0, Errors: 0, Skipped: 0, Time elapsed: 12.869 
sec - in 
org.apache.directory.server.operations.compare.MatchingRuleCompareIT
Running org.apache.directory.server.operations.modifydn.DIRSERVER_1974_IT
Tests run: 2, Failures: 0, Errors: 0, Skipped: 1, Time elapsed: 29.946 
sec - in org.apache.directory.server.operations.modifydn.DIRSERVER_1974_IT
Running org.apache.directory.server.operations.modifydn.ModifyDnReferralIT
Tests run: 7, Failures: 0, Errors: 0, Skipped: 0, Time elapsed: 14.973 
sec - in org.apache.directory.server.operations.modifydn.ModifyDnReferralIT
Running org.apache.directory.server.operations.modifydn.MoveIT
Tests run: 4, Failures: 0, Errors: 0, Skipped: 0, Time elapsed: 17.094 
sec - in org.apache.directory.server.operations.modifydn.MoveIT
Running org.apache.directory.server.operations.modifydn.ModifyRdnIT
Tests run: 20, Failures: 0, Errors: 0, Skipped: 2, Time elapsed: 54.061 
sec - in org.apache.directory.server.operations.modifydn.ModifyRdnIT
Running org.apache.directory.server.operations.delete.DeleteAliasIT
Tests run: 2, Failures: 0, Errors: 0, Skipped: 0, Time elapsed: 15.713 
sec - in org.apache.directory.server.operations.delete.DeleteAliasIT
Running org.apache.directory.server.operations.delete.DeleteIT
Tests run: 9, Failures: 0, Errors: 0, Skipped: 0, Time elapsed: 46.33 
sec - in org.apache.directory.server.operations.delete.DeleteIT
Running org.apache.directory.server.operations.search.NegationSearchIT
Tests run: 2, Failures: 0, Errors: 0, Skipped: 0, Time elapsed: 14.23 
sec - in org.apache.directory.server.operations.search.NegationSearchIT
Running org.apache.directory.server.operations.search.SortedSearchIT
Tests run: 6, Failures: 0, Errors: 0, Skipped: 0, Time elapsed: 91.469 
sec - in org.apache.directory.server.operations.search.SortedSearchIT
Running 
org.apache.directory.server.operations.search.IndexedNegationSearchIT
Tests run: 3, Failures: 0, Errors: 0, Skipped: 0, Time elapsed: 14.524 
sec - in 
org.apache.directory.server.operations.search.IndexedNegationSearchIT
Running 
org.apache.directory.server.operations.search.ReferralSearchMoveAndRenameIT
Tests run: 1, Failures: 0, Errors: 0, Skipped: 0, Time elapsed: 16.429 
sec - in 
org.apache.directory.server.operations.search.ReferralSearchMoveAndRenameIT
Running org.apache.directory.server.operations.search.ReferralSearchIT
Tests run: 7, Failures: 0, Errors: 0, Skipped: 0, Time elapsed: 35.777 
sec - in org.apache.directory.server.operations.search.ReferralSearchIT
Running org.apache.directory.server.operations.search.PagedSearchIT
Tests run: 37, Failures: 0, Errors: 0, Skipped: 0, Time elapsed: 15.982 
sec - in org.apache.directory.server.operations.search.PagedSearchIT
Running 
org.apache.directory.server.operations.search.ReferralSearchNoRevertIT
Tests run: 1, Failures: 0, Errors: 0, Skipped: 0, Time elapsed: 20.581 
sec - in 
org.apache.directory.server.operations.search.ReferralSearchNoRevertIT
Running org.apache.directory.server.operations.search.SearchLimitsIT
Tests run: 15, Failures: 0, Errors: 0, Skipped: 0, Time elapsed: 18.83 
sec - in org.apache.directory.server.operations.search.SearchLimitsIT
Running org.apache.directory.server.operations.search.SchemaSearchIT
Tests run: 5, Failures: 0, Errors: 0, Skipped: 0, Time elapsed: 10.5 sec 
- in org.apache.directory.server.operations.search.SchemaSearchIT
Running org.apache.directory.server.operations.search.PersistentSearchIT
Tests run: 10, Failures: 0, Errors: 0, Skipped: 0, Time elapsed: 33.99 
sec - in org.apache.directory.server.operations.search.PersistentSearchIT
Running org.apache.directory.server.operations.search.SearchIT
Tests run: 46, Failures: 0, Errors: 0, Skipped: 3, Time elapsed: 196.982 
sec - in org.apache.directory.server.operations.search.SearchIT
Running org.apache.directory.server.operations.bind.SaslBindIT
Tests run: 17, Failures: 0, Errors: 0, Skipped: 4, Time elapsed: 32.213 
sec - in org.apache.directory.server.operations.bind.SaslBindIT
Running org.apache.directory.server.operations.bind.SimpleBindIT
Tests run: 10, Failures: 0, Errors: 0, Skipped: 0, Time elapsed: 9.484 
sec - in org.apache.directory.server.operations.bind.SimpleBindIT
Running org.apache.directory.server.operations.bind.DelegatedAuthOverSslIT
Tests run: 1, Failures: 0, Errors: 0, Skipped: 0, Time elapsed: 19.428 
sec - in org.apache.directory.server.operations.bind.DelegatedAuthOverSslIT
Running org.apache.directory.server.operations.bind.BindIT
Tests run: 5, Failures: 0, Errors: 0, Skipped: 0, Time elapsed: 10.606 
sec - in org.apache.directory.server.operations.bind.BindIT
Running org.apache.directory.server.operations.bind.DelegatedAuthIT
Tests run: 2, Failures: 0, Errors: 0, Skipped: 0, Time elapsed: 35.035 
sec - in org.apache.directory.server.operations.bind.DelegatedAuthIT
Running org.apache.directory.server.operations.bind.DelegatedAuthOverTlsIT
Tests run: 1, Failures: 0, Errors: 0, Skipped: 0, Time elapsed: 26.323 
sec - in org.apache.directory.server.operations.bind.DelegatedAuthOverTlsIT
Running org.apache.directory.server.operations.bind.MiscBindIT
Tests run: 6, Failures: 0, Errors: 0, Skipped: 0, Time elapsed: 24.589 
sec - in org.apache.directory.server.operations.bind.MiscBindIT
Running org.apache.directory.server.operations.lookup.LookupIT
Tests run: 3, Failures: 0, Errors: 0, Skipped: 0, Time elapsed: 10.186 
sec - in org.apache.directory.server.operations.lookup.LookupIT
Running org.apache.directory.server.operations.extended.PwdModifyIT
Tests run: 9, Failures: 0, Errors: 0, Skipped: 0, Time elapsed: 27.507 
sec - in org.apache.directory.server.operations.extended.PwdModifyIT
Running org.apache.directory.server.operations.extended.StoredProcedureIT
Tests run: 2, Failures: 0, Errors: 0, Skipped: 2, Time elapsed: 11.619 
sec - in org.apache.directory.server.operations.extended.StoredProcedureIT
Running org.apache.directory.server.operations.extended.WhoAmIIT
Tests run: 1, Failures: 0, Errors: 0, Skipped: 0, Time elapsed: 11.297 
sec - in org.apache.directory.server.operations.extended.WhoAmIIT
Running org.apache.directory.server.operations.extended.ExtendedIT
Tests run: 1, Failures: 0, Errors: 0, Skipped: 0, Time elapsed: 11.762 
sec - in org.apache.directory.server.operations.extended.ExtendedIT
Running org.apache.directory.server.operations.ldapsdk.CompareIT
Tests run: 7, Failures: 0, Errors: 0, Skipped: 0, Time elapsed: 12.503 
sec - in org.apache.directory.server.operations.ldapsdk.CompareIT
Running org.apache.directory.server.operations.ldapsdk.IllegalModificationIT
Tests run: 2, Failures: 0, Errors: 0, Skipped: 0, Time elapsed: 11.743 
sec - in 
org.apache.directory.server.operations.ldapsdk.IllegalModificationIT
Running org.apache.directory.server.operations.ldapsdk.ModifyDnReferralIT
Tests run: 7, Failures: 0, Errors: 0, Skipped: 0, Time elapsed: 15.087 
sec - in org.apache.directory.server.operations.ldapsdk.ModifyDnReferralIT
Running org.apache.directory.server.operations.ldapsdk.BindIT
Tests run: 5, Failures: 0, Errors: 0, Skipped: 0, Time elapsed: 13.288 
sec - in org.apache.directory.server.operations.ldapsdk.BindIT
Running org.apache.directory.server.operations.ldapsdk.AddIT
Tests run: 30, Failures: 0, Errors: 0, Skipped: 0, Time elapsed: 100.58 
sec - in org.apache.directory.server.operations.ldapsdk.AddIT
Running org.apache.directory.server.operations.ldapsdk.DeleteIT
Tests run: 8, Failures: 0, Errors: 0, Skipped: 0, Time elapsed: 14.819 
sec - in org.apache.directory.server.operations.ldapsdk.DeleteIT
Running org.apache.directory.server.operations.ldapsdk.ModifyReferralIT
Tests run: 4, Failures: 0, Errors: 0, Skipped: 0, Time elapsed: 12.452 
sec - in org.apache.directory.server.operations.ldapsdk.ModifyReferralIT
Running org.apache.directory.server.ppolicy.PasswordPolicyIT
Tests run: 24, Failures: 0, Errors: 0, Skipped: 2, Time elapsed: 105.793 
sec - in org.apache.directory.server.ppolicy.PasswordPolicyIT
Running org.apache.directory.server.schema.SchemaIT
Tests run: 3, Failures: 0, Errors: 0, Skipped: 0, Time elapsed: 36.9 sec 
- in org.apache.directory.server.schema.SchemaIT
Running org.apache.directory.server.schema.MavibotSchemaIT
Tests run: 3, Failures: 0, Errors: 0, Skipped: 0, Time elapsed: 39.201 
sec - in org.apache.directory.server.schema.MavibotSchemaIT
Running org.apache.directory.server.ssl.LdapsIT
Tests run: 1, Failures: 0, Errors: 0, Skipped: 0, Time elapsed: 16.758 
sec - in org.apache.directory.server.ssl.LdapsIT
Running org.apache.directory.server.ssl.StartTlsIT
Tests run: 1, Failures: 0, Errors: 0, Skipped: 0, Time elapsed: 9.553 
sec - in org.apache.directory.server.ssl.StartTlsIT
Running org.apache.directory.server.ssl.StartTlsUpdateCertificateIT
Tests run: 1, Failures: 0, Errors: 0, Skipped: 0, Time elapsed: 11.363 
sec - in org.apache.directory.server.ssl.StartTlsUpdateCertificateIT
Running org.apache.directory.server.ssl.StartTlsConfidentialityIT
Tests run: 1, Failures: 0, Errors: 0, Skipped: 0, Time elapsed: 14.432 
sec - in org.apache.directory.server.ssl.StartTlsConfidentialityIT
Running org.apache.directory.server.ssl.LdapsUpdateCertificateIT
Tests run: 1, Failures: 0, Errors: 0, Skipped: 0, Time elapsed: 10.506 
sec - in org.apache.directory.server.ssl.LdapsUpdateCertificateIT
Running org.apache.directory.server.kerberos.PasswordPolicyServiceIT
Tests run: 1, Failures: 0, Errors: 0, Skipped: 1, Time elapsed: 0 sec - 
in org.apache.directory.server.kerberos.PasswordPolicyServiceIT
Running org.apache.directory.server.kerberos.KeyDerivationServiceIT
Tests run: 4, Failures: 0, Errors: 0, Skipped: 0, Time elapsed: 32.237 
sec - in org.apache.directory.server.kerberos.KeyDerivationServiceIT
Running org.apache.directory.server.replication.StaleEventLogDetectionIT
Tests run: 1, Failures: 0, Errors: 0, Skipped: 0, Time elapsed: 34.532 
sec - in org.apache.directory.server.replication.StaleEventLogDetectionIT
Running org.apache.directory.server.replication.ClientServerReplicationIT
Tests run: 5, Failures: 0, Errors: 0, Skipped: 1, Time elapsed: 84.141 
sec - in org.apache.directory.server.replication.ClientServerReplicationIT
Running org.apache.directory.server.replication.ClientInitialRefreshIT

Results :

Tests run: 452, Failures: 0, Errors: 0, Skipped: 17

[INFO] 
------------------------------------------------------------------------
[INFO] Reactor Summary:
[INFO]
[INFO] ApacheDS ........................................... SUCCESS [ 
1.435 s]
[INFO] ApacheDS I18n ...................................... SUCCESS [ 
1.137 s]
[INFO] ApacheDS Core Constants ............................ SUCCESS [ 
0.275 s]
[INFO] ApacheDS Core API .................................. SUCCESS [ 
4.407 s]
[INFO] ApacheDS Core Shared ............................... SUCCESS [ 
0.833 s]
[INFO] ApacheDS Interceptors .............................. SUCCESS [ 
0.068 s]
[INFO] ApacheDS AdministrativePoint Interceptor ........... SUCCESS [ 
0.832 s]
[INFO] ApacheDS Authentication Interceptor ................ SUCCESS [ 
1.810 s]
[INFO] ApacheDS Interceptor to increment numeric attributes SUCCESS [ 
0.550 s]
[INFO] ApacheDS Authorization Interceptor ................. SUCCESS [ 
3.008 s]
[INFO] ApacheDS ChangeLog Interceptor ..................... SUCCESS [ 
1.682 s]
[INFO] ApacheDS Collective Attribute Interceptor .......... SUCCESS [ 
0.493 s]
[INFO] ApacheDS Event Interceptor ......................... SUCCESS [ 
0.490 s]
[INFO] ApacheDS Exception Interceptor ..................... SUCCESS [ 
0.460 s]
[INFO] ApacheDS Journal Interceptor ....................... SUCCESS [ 
0.525 s]
[INFO] ApacheDS Normalization Interceptor ................. SUCCESS [ 
1.516 s]
[INFO] ApacheDS Operational Attribute Interceptor ......... SUCCESS [ 
0.484 s]
[INFO] ApacheDS Referral Interceptor ...................... SUCCESS [ 
0.516 s]
[INFO] ApacheDS Schema Interceptor ........................ SUCCESS [ 
1.808 s]
[INFO] ApacheDS Subtree Interceptor ....................... SUCCESS [ 
2.017 s]
[INFO] ApacheDS Triggers Interceptor ...................... SUCCESS [ 
0.645 s]
[INFO] ApacheDS Core ...................................... SUCCESS [ 
2.403 s]
[INFO] ApacheDS Core AVL .................................. SUCCESS [ 
3.135 s]
[INFO] ApacheDS Generalized (X) DBM Partition ............. SUCCESS [ 
4.300 s]
[INFO] ApacheDS LDIF Partition ............................ SUCCESS [ 
9.525 s]
[INFO] ApacheDS JDBM Partition ............................ SUCCESS [ 
49.763 s]
[INFO] ApacheDS Mavibot Partition ......................... SUCCESS [ 
4.658 s]
[INFO] ApacheDS Core Annotations .......................... SUCCESS [ 
55.781 s]
[INFO] ApacheDS Core JNDI ................................. SUCCESS [ 
1.352 s]
[INFO] ApacheDS Protocol Kerberos Codec ................... SUCCESS [ 
7.616 s]
[INFO] ApacheDS Interceptors for Kerberos ................. SUCCESS [ 
0.758 s]
[INFO] ApacheDS Protocol Dhcp ............................. SUCCESS [ 
1.134 s]
[INFO] ApacheDS Protocol Shared ........................... SUCCESS [ 
0.500 s]
[INFO] ApacheDS Protocol Dns .............................. SUCCESS [ 
1.881 s]
[INFO] ApacheDS Protocol Kerberos ......................... SUCCESS [ 
2.269 s]
[INFO] ApacheDS Protocol Ldap ............................. SUCCESS 
[01:17 min]
[INFO] ApacheDS Protocol Ntp .............................. SUCCESS [ 
1.181 s]
[INFO] Apacheds Server Annotations ........................ SUCCESS 
[01:04 min]
[INFO] ApacheDS Server Config ............................. SUCCESS [ 
3.408 s]
[INFO] ApacheDS Server JNDI ............................... SUCCESS [ 
1.308 s]
[INFO] ApacheDS Test Framework ............................ SUCCESS 
[02:30 min]
[INFO] ApacheDS All ....................................... SUCCESS [ 
2.984 s]
[INFO] ApacheDS Logger Interceptor ........................ SUCCESS [ 
0.433 s]
[INFO] ApacheDS Password Hashing Interceptor .............. SUCCESS [ 
0.514 s]
[INFO] ApacheDS Core Integration .......................... SUCCESS [ 
01:10 h]
[INFO] ApacheDS Protocol Kerberos Test .................... SUCCESS 
[01:22 min]
[INFO] ApacheDS Server Integration ........................ FAILURE 
[30:01 min]
[INFO] ApacheDS DirectoryService-WebApp bridge ............ SKIPPED
[INFO] ApacheDS Jetty HTTP Server Integration ............. SKIPPED
[INFO] ApacheDS Service Builder ........................... SKIPPED
[INFO] Apache Directory LDAP Client API test .............. SKIPPED
[INFO] kerberos-client .................................... SKIPPED
[INFO] ApacheDS Service ................................... SKIPPED
[INFO] ApacheDS Wrapper ................................... SKIPPED
[INFO] ApacheDS Installers Maven Plugin ................... SKIPPED
[INFO] ApacheDS Installers ................................ SKIPPED
[INFO] 
------------------------------------------------------------------------
[INFO] BUILD FAILURE
[INFO] 
------------------------------------------------------------------------
[INFO] Total time: 01:49 h
[INFO] Finished at: 2017-06-05T20:40:52+10:00
[INFO] Final Memory: 119M/2168M
[INFO] 
------------------------------------------------------------------------
[ERROR] Failed to execute goal 
org.apache.maven.plugins:maven-surefire-plugin:2.19.1:test 
(default-test) on project apacheds-server-integ: There was a timeout or 
other error in the fork -> [Help 1]

Do you want me to provide more detail or just stop testing???

Sorry!

Brian

> [ ] +1 : release ApacheDS 2.0.0-M24
> [ ] ┬▒ 0 : I don't care
> [ ] -1 : No, don't release ApacheDS 2.0.0-M24
> 
> --
> Regards,
> Cordialement,
> Emmanuel L├ęcharny
> www.iktek.com <http://www.iktek.com>


Mime
View raw message