directory-dev mailing list archives

Site index · List index
Message view « Date » · « Thread »
Top « Date » · « Thread »
From Brian Burch <br...@pingtoo.com>
Subject Re: [VOTE] Apache DS 2.0.0-M24 release
Date Tue, 06 Jun 2017 05:14:29 GMT
On 06/06/17 00:42, Emmanuel Lécharny wrote:
> 
> 
> Le 05/06/2017 à 14:37, Brian Burch a écrit :
>> On 04/06/17 05:31, Emmanuel Lecharny wrote:
>>> Hi,
>> Results :
>>
>> Tests run: 452, Failures: 0, Errors: 0, Skipped: 17
>>
>> [INFO]
>> ------------------------------------------------------------------------
>> [INFO] Reactor Summary:
>> [INFO]
> ...
>> [INFO] ApacheDS Protocol Kerberos Test .................... SUCCESS
>> [01:22 min]
>> [INFO] ApacheDS Server Integration ........................ FAILURE
>> [30:01 min]
>> [INFO] ApacheDS DirectoryService-WebApp bridge ............ SKIPPED
>> [INFO] ApacheDS Jetty HTTP Server Integration ............. SKIPPED
>> [INFO] ApacheDS Service Builder ........................... SKIPPED
>> [INFO] Apache Directory LDAP Client API test .............. SKIPPED
>> [INFO] kerberos-client .................................... SKIPPED
>> [INFO] ApacheDS Service ................................... SKIPPED
>> [INFO] ApacheDS Wrapper ................................... SKIPPED
>> [INFO] ApacheDS Installers Maven Plugin ................... SKIPPED
>> [INFO] ApacheDS Installers ................................ SKIPPED
>> [INFO]
>> ------------------------------------------------------------------------
>> [INFO] BUILD FAILURE
>> [INFO]
>> ------------------------------------------------------------------------
>> [INFO] Total time: 01:49 h
>> [INFO] Finished at: 2017-06-05T20:40:52+10:00
>> [INFO] Final Memory: 119M/2168M
>> [INFO]
>> ------------------------------------------------------------------------
>> [ERROR] Failed to execute goal
>> org.apache.maven.plugins:maven-surefire-plugin:2.19.1:test
>> (default-test) on project apacheds-server-integ: There was a timeout
>> or other error in the fork -> [Help 1]
>>
>> Do you want me to provide more detail or just stop testing???
> 
> as you can see the tests are successful, and there is a timeout error,
> because the tests lasted more than 30 mins...
> 
> This is another Maven bug :/

I presume you mean another surefire bug, or do you mean the same one as 
before?

> What CPU are you running the tests on ? What OS ? Which java version ?
> And are you using a  spinning disk, and if so, how many rpms ?

Long before surefire, I had to hand-craft a multi-thread framework to 
run jUnit one a client/server system. Debugging this kind of race 
condition was a nightmare, so I have a lot of sympathy and understanding.

As I said just after I joined the directory project, my desktop system 
died completely. I have just recently transplanted the disks from the 
old machine into the new one:

The two disks are identical and configured as a linux soft RAID array. 
They are Hitachi HDS721010CLA332s - 1 Tb 7200 rpm.

The cpu is AMB Ryzen 3200 MHz 6-core and 32 Gb memory.

I'm running Ubuntu desktop 17.04 zesty in 64-bit mode, with:

OpenJDK Runtime Environment (build 1.8.0_131-8u131-b11-0ubuntu1.17.04.1-b11)
OpenJDK 64-Bit Server VM (build 25.131-b11, mixed mode)

It isn't super-fast by modern gaming standards, but very fast compared 
to my last machine.

----------------------------

To make matters more depressing, I decided to do a clean checkout of M24 
on my laptop, which is super-slow by comparison. That failed much 
earlier (goal apacheds-core-api - missing dependencies) and I will post 
those details separately when I get back home again in a couple of hours 
from now.

(It isn't too late to fire me from the developers team!! I wanted to 
help, but it doesn't look like I am yet!)





Mime
View raw message