directory-dev mailing list archives

Site index · List index
Message view « Date » · « Thread »
Top « Date » · « Thread »
From Emmanuel Lécharny <elecha...@gmail.com>
Subject Re: [VOTE] Apache DS 2.0.0-M24 release
Date Mon, 05 Jun 2017 14:42:52 GMT


Le 05/06/2017 à 14:37, Brian Burch a écrit :
> On 04/06/17 05:31, Emmanuel Lecharny wrote:
>> Hi,
> Results :
>
> Tests run: 452, Failures: 0, Errors: 0, Skipped: 17
>
> [INFO]
> ------------------------------------------------------------------------
> [INFO] Reactor Summary:
> [INFO]
...
> [INFO] ApacheDS Protocol Kerberos Test .................... SUCCESS
> [01:22 min]
> [INFO] ApacheDS Server Integration ........................ FAILURE
> [30:01 min]
> [INFO] ApacheDS DirectoryService-WebApp bridge ............ SKIPPED
> [INFO] ApacheDS Jetty HTTP Server Integration ............. SKIPPED
> [INFO] ApacheDS Service Builder ........................... SKIPPED
> [INFO] Apache Directory LDAP Client API test .............. SKIPPED
> [INFO] kerberos-client .................................... SKIPPED
> [INFO] ApacheDS Service ................................... SKIPPED
> [INFO] ApacheDS Wrapper ................................... SKIPPED
> [INFO] ApacheDS Installers Maven Plugin ................... SKIPPED
> [INFO] ApacheDS Installers ................................ SKIPPED
> [INFO]
> ------------------------------------------------------------------------
> [INFO] BUILD FAILURE
> [INFO]
> ------------------------------------------------------------------------
> [INFO] Total time: 01:49 h
> [INFO] Finished at: 2017-06-05T20:40:52+10:00
> [INFO] Final Memory: 119M/2168M
> [INFO]
> ------------------------------------------------------------------------
> [ERROR] Failed to execute goal
> org.apache.maven.plugins:maven-surefire-plugin:2.19.1:test
> (default-test) on project apacheds-server-integ: There was a timeout
> or other error in the fork -> [Help 1]
>
> Do you want me to provide more detail or just stop testing???

as you can see the tests are successful, and there is a timeout error,
because the tests lasted more than 30 mins...

This is another Maven bug :/

What CPU are you running the tests on ? What OS ? Which java version ?
And are you using a  spinning disk, and if so, how many rpms ?


-- 

Emmanuel Lecharny

Symas.com
directory.apache.org


Mime
View raw message