directory-dev mailing list archives

Site index · List index
Message view « Date » · « Thread »
Top « Date » · « Thread »
From Shawn McKinney <smckin...@apache.org>
Subject Re: [VOTE] Fortress-Core 1.0-RC40, take 2
Date Thu, 09 Apr 2015 16:56:24 GMT


> On Apr 9, 2015, at 9:57 AM, Emmanuel Lécharny <elecharny@gmail.com> wrote:
> 
> Please cast your votes:
> [ ] +1 Release Fortress Core 1.0.-RC40
> [ ] 0 abstain
> [ ] -1 Do not release Fortress Core 1.0.-RC40

-1

jgrapht 0.9.1 is causing the fortress core regression tests to fail.  We’ll need to revert
to previous version - or - fix the error.  At this point I don’t have a bead on what the
issue is so this might take some time to resolve.


 [startAnt] BUILD FAILED
 [startAnt] 
 [startAnt] [FortressAdmin] 2015-04-09 11:47:25,265 (INFO ) loadGraph initializing USO context
[HOME]
 [startAnt] /home/smckinn/tmp/directory-fortress-core/3/1.0-RC40/ldap/setup/DelegatedAdminManagerLoad.xml:26:
java.lang.IllegalMonitorStateException: attempt to unlock read lock, not locked by current
thread
 [startAnt] 	at java.util.concurrent.locks.ReentrantReadWriteLock$Sync.unmatchedUnlockException(ReentrantReadWriteLock.java:447)
 [startAnt] 	at java.util.concurrent.locks.ReentrantReadWriteLock$Sync.tryReleaseShared(ReentrantReadWriteLock.java:431)
 [startAnt] 	at java.util.concurrent.locks.AbstractQueuedSynchronizer.releaseShared(AbstractQueuedSynchronizer.java:1340)
 [startAnt] 	at java.util.concurrent.locks.ReentrantReadWriteLock$ReadLock.unlock(ReentrantReadWriteLock.java:883)
 [startAnt] 	at org.apache.directory.fortress.core.rbac.UsoUtil.getGraph(UsoUtil.java:284)
 [startAnt] 	at org.apache.directory.fortress.core.rbac.UsoUtil.getChildren(UsoUtil.java:110)
 [startAnt] 	at org.apache.directory.fortress.core.rbac.OrgUnitDAO.getEntityFromLdapEntry(OrgUnitDAO.java:711)
 [startAnt] 	at org.apache.directory.fortress.core.rbac.OrgUnitDAO.findByKey(OrgUnitDAO.java:359)
 [startAnt] 	at org.apache.directory.fortress.core.rbac.OrgUnitP.read(OrgUnitP.java:239)
 [startAnt] 	at org.apache.directory.fortress.core.rbac.AdminRoleP.validate(AdminRoleP.java:399)
 [startAnt] 	at org.apache.directory.fortress.core.rbac.AdminRoleP.add(AdminRoleP.java:138)
 [startAnt] 	at org.apache.directory.fortress.core.rbac.DelAdminMgrImpl.addRole(DelAdminMgrImpl.java:98)
 [startAnt] 	at org.apache.directory.fortress.core.ant.FortressAntTask.addAdminRoles(FortressAntTask.java:2137)
 [startAnt] 	at org.apache.directory.fortress.core.ant.FortressAntTask.execute(FortressAntTask.java:932)
 [startAnt] 	at org.apache.tools.ant.UnknownElement.execute(UnknownElement.java:292)
 [startAnt] 	at sun.reflect.NativeMethodAccessorImpl.invoke0(Native Method)
 [startAnt] 	at sun.reflect.NativeMethodAccessorImpl.invoke(NativeMethodAccessorImpl.java:57)
 [startAnt] 	at sun.reflect.DelegatingMethodAccessorImpl.invoke(DelegatingMethodAccessorImpl.java:43)
 [startAnt] 	at java.lang.reflect.Method.invoke(Method.java:606)
 [startAnt] 	at org.apache.tools.ant.dispatch.DispatchUtils.execute(DispatchUtils.java:106)
 [startAnt] 	at org.apache.tools.ant.Task.perform(Task.java:348)
 [startAnt] 	at org.apache.tools.ant.Target.execute(Target.java:435)
 [startAnt] 	at org.apache.tools.ant.Target.performTasks(Target.java:456)
 [startAnt] 	at org.apache.tools.ant.Project.executeSortedTargets(Project.java:1393)
 [startAnt] 	at org.apache.tools.ant.Project.executeTarget(Project.java:1364)
 [startAnt] 	at org.apache.tools.ant.helper.DefaultExecutor.executeTargets(DefaultExecutor.java:41)
 [startAnt] 	at org.apache.tools.ant.Project.executeTargets(Project.java:1248)
 [startAnt] 	at org.apache.tools.ant.Main.runBuild(Main.java:851)
 [startAnt] 	at org.apache.tools.ant.Main.startAnt(Main.java:235)
 [startAnt] 	at org.apache.tools.ant.launch.Launcher.run(Launcher.java:280)
 [startAnt] 	at org.apache.tools.ant.launch.Launcher.main(Launcher.java:109)
 [startAnt] 
 [startAnt] Total time: 0 seconds
[INFO] ------------------------------------------------------------------------
[INFO] BUILD FAILURE


Shawn
smckinney@apache.org


Mime
View raw message