directory-dev mailing list archives

Site index · List index
Message view « Date » · « Thread »
Top « Date » · « Thread »
From Felix Knecht <fel...@apache.org>
Subject Re: Pb when running server-integ tests
Date Sat, 19 Feb 2011 21:10:27 GMT
On 02/19/2011 07:40 PM, Emmanuel Lecharny wrote:
> Hi guys,
>
> is this just me or anyone else has the same issue when running the
> server-integ tests? It get stuck forever, with a very low CPU being
> used. When I do a kill -3 on the running process, it's usually stuck
> waiting for a response from the server.
>
> Not that the tests aren't executed, but it's mainly waiting forever
> between each test.

That's what I get on trunks:

[INFO] 
------------------------------------------------------------------------
[INFO] BUILD FAILURE
[INFO] 
------------------------------------------------------------------------
[INFO] Total time: 7:48.083s
[INFO] Finished at: Sat Feb 19 21:12:50 CET 2011
[INFO] Final Memory: 579M/1024M
[INFO] 
------------------------------------------------------------------------
[ERROR] Failed to execute goal 
org.apache.maven.plugins:maven-surefire-plugin:2.7.2:test (default-test) 
on project apacheds-server-integ: There are test failures.
[ERROR]
[ERROR] Please refer to 
/home/felix/svn/apache/directory/trunks/apacheds/server-integ/target/surefire-reports 
for the individual test results.
[ERROR] -> [Help 1]
[ERROR]


Mime
View raw message