directory-dev mailing list archives

Site index · List index
Message view « Date » · « Thread »
Top « Date » · « Thread »
From Andrea Gariboldi <andrea.garibo...@gmail.com>
Subject Re: Build fails on trunk ...
Date Tue, 28 Apr 2009 08:48:03 GMT
Build Failed!

But in a different test..

-------------------------------------------------------------------------------
Test set: org.apache.directory.server.ntp.NtpITest
-------------------------------------------------------------------------------
Tests run: 1, Failures: 1, Errors: 0, Skipped: 0, Time elapsed: 0.263 sec
<<< FAILURE!
testNtp(org.apache.directory.server.ntp.NtpITest)  Time elapsed: 0.258 sec
<<< FAILURE!
junit.framework.AssertionFailedError: null
        at junit.framework.Assert.fail(Assert.java:47)
        at junit.framework.Assert.assertTrue(Assert.java:20)
        at junit.framework.Assert.assertTrue(Assert.java:27)
        at
org.apache.directory.server.ntp.NtpITest.testNtp(NtpITest.java:90)
        at sun.reflect.NativeMethodAccessorImpl.invoke0(Native Method)
        at
sun.reflect.NativeMethodAccessorImpl.invoke(NativeMethodAccessorImpl.java:39)
        at
sun.reflect.DelegatingMethodAccessorImpl.invoke(DelegatingMethodAccessorImpl.java:25)
        at java.lang.reflect.Method.invoke(Method.java:597)
        at junit.framework.TestCase.runTest(TestCase.java:168)
        at junit.framework.TestCase.runBare(TestCase.java:134)
        at junit.framework.TestResult$1.protect(TestResult.java:110)
        at junit.framework.TestResult.runProtected(TestResult.java:128)
        at junit.framework.TestResult.run(TestResult.java:113)
        at junit.framework.TestCase.run(TestCase.java:124)
        at junit.framework.TestSuite.runTest(TestSuite.java:232)
        at junit.framework.TestSuite.run(TestSuite.java:227)
        at
org.junit.internal.runners.JUnit38ClassRunner.run(JUnit38ClassRunner.java:81)
        at
org.apache.maven.surefire.junit4.JUnit4TestSet.execute(JUnit4TestSet.java:62)
        at
org.apache.maven.surefire.suite.AbstractDirectoryTestSuite.executeTestSet(AbstractDirectoryTestSuite.java:140)
        at
org.apache.maven.surefire.suite.AbstractDirectoryTestSuite.execute(AbstractDirectoryTestSuite.java:127)
        at org.apache.maven.surefire.Surefire.run(Surefire.java:177)
        at sun.reflect.NativeMethodAccessorImpl.invoke0(Native Method)
        at
sun.reflect.NativeMethodAccessorImpl.invoke(NativeMethodAccessorImpl.java:39)
        at
sun.reflect.DelegatingMethodAccessorImpl.invoke(DelegatingMethodAccessorImpl.java:25)
        at java.lang.reflect.Method.invoke(Method.java:597)
        at
org.apache.maven.surefire.booter.SurefireBooter.runSuitesInProcess(SurefireBooter.java:345)
        at
org.apache.maven.surefire.booter.SurefireBooter.main(SurefireBooter.java:1009)


2009/4/28, Emmanuel Lecharny <elecharny@apache.org>:
>
> Emmanuel Lecharny wrote:
>
>> damnit :/ Something is wrong on my laptop then ...
>>
>>
> Ok, so this morning I did  :
> - removed my ~/.m2/repository
> - checked out the full project (
> https://svn.apache.org/repos/asf/directory/apacheds/trunk-with-dependencies
> )
> - build project (cd project; mvn clean install) using maven 2.1.0 and sun
> java 1.6.0_10
> - build everything with mvn clean install and got the following errors :
>
> ...
> [INFO] Surefire report directory:
> /home/elecharny/apacheds/new-trunk/apacheds/server-integ/target/surefire-reports
>
> -------------------------------------------------------
> T E S T S
> -------------------------------------------------------
> Running org.apache.directory.server.suites.StockServerISuite
> Tests run: 178, Failures: 0, Errors: 0, Skipped: 0, Time elapsed: 41.146
> sec
> Running org.apache.directory.server.operations.modify.ModifyAddIT
> Tests run: 14, Failures: 0, Errors: 0, Skipped: 0, Time elapsed: 1.043 sec
> Running org.apache.directory.server.operations.bind.MiscBindIT
> Tests run: 6, Failures: 0, Errors: 6, Skipped: 0, Time elapsed: 0.842 sec
> <<< FAILURE!
> ...
>
> Tests in error:
>
>  testDisableAnonymousBinds(org.apache.directory.server.operations.bind.MiscBindIT)
>
>  testEnableAnonymousBindsOnRootDSE(org.apache.directory.server.operations.bind.MiscBindIT)
>
>  testAnonymousBindsEnabledBaseSearch(org.apache.directory.server.operations.bind.MiscBindIT)
>  testAdminAccessBug(org.apache.directory.server.operations.bind.MiscBindIT)
>
>  testUserAuthOnMixedCaseSuffix(org.apache.directory.server.operations.bind.MiscBindIT)
>
>  testFailureWithUnsupportedControl(org.apache.directory.server.operations.bind.MiscBindIT)
>
> Tests run: 249, Failures: 0, Errors: 6, Skipped: 0
>
> Here are some of the logs I get :
>
>
> -------------------------------------------------------------------------------
> Test set: org.apache.directory.server.operations.bind.MiscBindIT
>
> -------------------------------------------------------------------------------
> Tests run: 6, Failures: 0, Errors: 6, Skipped: 0, Time elapsed: 0.842 sec
> <<< FAILURE!
> testDisableAnonymousBinds(org.apache.directory.server.operations.bind.MiscBindIT)
>  Time elapsed: 0.002 sec  <<< ERROR!
> org.apache.directory.shared.ldap.exception.LdapNameNotFoundException:
>  Cannot find a partition for
> 0.9.2342.19200300.100.1.25=apache,0.9.2342.19200300.100.1.25=org
>       at
> org.apache.directory.server.core.partition.DefaultPartitionNexus.getPartition(DefaultPartitionNexus.java:1090)
> ...
>
>
> Can someone try to do the exact same manipulation ( it will take around an
> hour)
>
> Many thanks !
>
>  On Mon, Apr 27, 2009 at 5:05 PM, Andrea Gariboldi
>> <andrea.gariboldi@gmail.com> wrote:
>>
>>
>>> Build successfull on Ubuntu...
>>>
>>> Andrea
>>>
>>> 2009/4/27, Emmanuel Lecharny <elecharny@apache.org>:
>>>
>>>
>>>> Hi,
>>>>
>>>> I tried to check out the trunk this afternoon, and to build it from
>>>> scratch after having doomed my repo, with no success. It fails in some
>>>> MiscBind tests (I don't have the exact detail right now, being at my
>>>> client office).
>>>>
>>>> Can someone check the build from a fresh checkout and a fresh repo ?
>>>>
>>>> Thanks !
>>>>
>>>>
>>>> --
>>>> Regards,
>>>> Cordialement,
>>>> Emmanuel L├ęcharny
>>>> www.iktek.com
>>>>
>>>>
>>>
>>>
>>
>>
>>
>>
>>
>
>
> --
> --
> cordialement, regards,
> Emmanuel L├ęcharny
> www.iktek.com
> directory.apache.org
>
>
>

Mime
View raw message