directory-dev mailing list archives

Site index · List index
Message view « Date » · « Thread »
Top « Date » · « Thread »
From Stefan Seelmann <seelm...@apache.org>
Subject Re: ApacheDS 1.5 - Build failure
Date Sun, 15 Mar 2009 00:18:19 GMT
Hi Rahul,

I get the same error, looking...

Kind Regards,
Stefan


rahul.soa schrieb:
> Hello Emmanuel,Dev,
> 
> I have setup the workspace to work on Apache Directory Studio. I have
> also tested the studio plugin in the runtime environment and It works well.
> 
> But still I have errors in the *integration test run* (i.e  mvn
> -Pintegration-core,integration-ui test), I dont really know why this
> error (Java returned: 13) is occuring.
> is it because of Maven or eclipse? I have no idea on this. Help needed.
> 
> below is the error:
> 
> 
> -------------------------------------------------------
>  T E S T S
> -------------------------------------------------------
> There are no tests to run.
> 
> Results :
> 
> Tests run: 0, Failures: 0, Errors: 0, Skipped: 0
> 
> [INFO] [antrun:run {execution: integration-core}]
> [INFO] Executing tasks
>    [delete] Deleting directory
> /root/studio/test-integration-core/target/test-sandbox
>     [mkdir] Created dir:
> /root/studio/test-integration-core/target/test-sandbox
>     [mkdir] Created dir:
> /root/studio/test-integration-core/target/test-sandbox/workspace
>      [copy] Copying 732 files to
> /root/studio/test-integration-core/target/test-sandbox
>      [copy] Copying 30 files to
> /root/studio/test-integration-core/target/test-sandbox/plugins
>      [copy] Copying 1 file to
> /root/studio/test-integration-core/target/test-sandbox/plugins
>      [copy] Copying 379 files to
> /root/studio/test-integration-core/target/test-sandbox/plugins
>      [copy] Copied 51 empty directories to 2 empty directories under
> /root/studio/test-integration-core/target/test-sandbox/plugins
> [INFO]
> ------------------------------------------------------------------------
> [ERROR] BUILD ERROR
> [INFO]
> ------------------------------------------------------------------------
> [INFO] An Ant BuildException has occured: Java returned: 13
> 
> [INFO]
> ------------------------------------------------------------------------
> [INFO] Trace
> org.apache.maven.lifecycle.LifecycleExecutionException: An Ant
> BuildException has occured: Java returned: 13
>     at
> org.apache.maven.lifecycle.DefaultLifecycleExecutor.executeGoals(DefaultLifecycleExecutor.java:583)
>     at
> org.apache.maven.lifecycle.DefaultLifecycleExecutor.executeGoalWithLifecycle(DefaultLifecycleExecutor.java:499)
>     at
> org.apache.maven.lifecycle.DefaultLifecycleExecutor.executeGoal(DefaultLifecycleExecutor.java:478)
>     at
> org.apache.maven.lifecycle.DefaultLifecycleExecutor.executeGoalAndHandleFailures(DefaultLifecycleExecutor.java:330)
>     at
> org.apache.maven.lifecycle.DefaultLifecycleExecutor.executeTaskSegments(DefaultLifecycleExecutor.java:291)
>     at
> org.apache.maven.lifecycle.DefaultLifecycleExecutor.execute(DefaultLifecycleExecutor.java:142)
>     at org.apache.maven.DefaultMaven.doExecute(DefaultMaven.java:336)
>     at org.apache.maven.DefaultMaven.execute(DefaultMaven.java:129)
>     at org.apache.maven.cli.MavenCli.main(MavenCli.java:287)
>     at sun.reflect.NativeMethodAccessorImpl.invoke0(Native Method)
>     at
> sun.reflect.NativeMethodAccessorImpl.invoke(NativeMethodAccessorImpl.java:39)
>     at
> sun.reflect.DelegatingMethodAccessorImpl.invoke(DelegatingMethodAccessorImpl.java:25)
>     at java.lang.reflect.Method.invoke(Method.java:597)
>     at org.codehaus.classworlds.Launcher.launchEnhanced(Launcher.java:315)
>     at org.codehaus.classworlds.Launcher.launch(Launcher.java:255)
>     at org.codehaus.classworlds.Launcher.mainWithExitCode(Launcher.java:430)
>     at org.codehaus.classworlds.Launcher.main(Launcher.java:375)
> Caused by: org.apache.maven.plugin.MojoExecutionException: An Ant
> BuildException has occured: Java returned: 13
>     at
> org.apache.maven.plugin.antrun.AbstractAntMojo.executeTasks(AbstractAntMojo.java:131)
>     at org.apache.maven.plugin.antrun.AntRunMojo.execute(AntRunMojo.java:98)
>     at
> org.apache.maven.plugin.DefaultPluginManager.executeMojo(DefaultPluginManager.java:451)
>     at
> org.apache.maven.lifecycle.DefaultLifecycleExecutor.executeGoals(DefaultLifecycleExecutor.java:558)
>     ... 16 more
> Caused by: Java returned: 13
>     at org.apache.tools.ant.taskdefs.Java.execute(Java.java:108)
>     at org.apache.tools.ant.UnknownElement.execute(UnknownElement.java:288)
>     at sun.reflect.NativeMethodAccessorImpl.invoke0(Native Method)
>     at
> sun.reflect.NativeMethodAccessorImpl.invoke(NativeMethodAccessorImpl.java:39)
>     at
> sun.reflect.DelegatingMethodAccessorImpl.invoke(DelegatingMethodAccessorImpl.java:25)
>     at java.lang.reflect.Method.invoke(Method.java:597)
>     at
> org.apache.tools.ant.dispatch.DispatchUtils.execute(DispatchUtils.java:106)
>     at org.apache.tools.ant.Task.perform(Task.java:348)
>     at org.apache.tools.ant.Target.execute(Target.java:357)
>     at
> org.apache.maven.plugin.antrun.AbstractAntMojo.executeTasks(AbstractAntMojo.java:118)
>     ... 19 more
> [INFO]
> ------------------------------------------------------------------------
> [INFO] Total time: 2 minutes 48 seconds
> [INFO] Finished at: Sun Mar 15 01:17:05 CET 2009
> [INFO] Final Memory: 54M/63M
> [INFO]
> ------------------------------------------------------------------------
> 
> Regards,
> Rahul
> 
> On Frid, Mar 13, 2009 at 11:57 AM, rahul.soa <rahul.soa@googlemail.com
> <mailto:rahul.soa@googlemail.com>> wrote:
> 
> 
> 
>     On Thu, Mar 12, 2009 at 1:37 AM, Emmanuel Lecharny
>     <elecharny@apache.org <mailto:elecharny@apache.org>> wrote:
> 
>         rahul.soa wrote:
> 
>             Hello Stefan,
> 
>             Thanks for your email.
>              
> 
>         Q1 : Does ApacheDirectoryStudio launch well when you download a
>         compiled version ?
> 
>     the same problem was there, screen stuck.
> 
> 
>         Q2 : What about running ./ApacheDirectoryStudio -vm <a path to a
>         JVM/bin>
> 
>         same problem was there with other JVMs too.
> 
> 
>     But I updated my fedora with yum and I am able to launch the Apache
>     Studio with all the JVMs I have. :)
> 
>     Many Thanks to everyone for your help!
> 
>     However, I am not able to run the integration tests successfully...
>     and getting the following error with the *-e  *option.
> 
> 
>     [INFO]
>     ------------------------------------------------------------------------
>     [ERROR] BUILD ERROR
>     [INFO]
>     ------------------------------------------------------------------------
>     [INFO] An Ant BuildException has occured: Java returned: 13
> 
>     [INFO]
>     ------------------------------------------------------------------------
>     [INFO] Trace
>     org.apache.maven.lifecycle.LifecycleExecutionException: An Ant
>     BuildException has occured: Java returned: 13
>         at
>     org.apache.maven.lifecycle.DefaultLifecycleExecutor.executeGoals(DefaultLifecycleExecutor.java:583)
>         at
>     org.apache.maven.lifecycle.DefaultLifecycleExecutor.executeGoalWithLifecycle(DefaultLifecycleExecutor.java:499)
>         at
>     org.apache.maven.lifecycle.DefaultLifecycleExecutor.executeGoal(DefaultLifecycleExecutor.java:478)
>         at
>     org.apache.maven.lifecycle.DefaultLifecycleExecutor.executeGoalAndHandleFailures(DefaultLifecycleExecutor.java:330)
>         at
>     org.apache.maven.lifecycle.DefaultLifecycleExecutor.executeTaskSegments(DefaultLifecycleExecutor.java:291)
>         at
>     org.apache.maven.lifecycle.DefaultLifecycleExecutor.execute(DefaultLifecycleExecutor.java:142)
>         at org.apache.maven.DefaultMaven.doExecute(DefaultMaven.java:336)
>         at org.apache.maven.DefaultMaven.execute(DefaultMaven.java:129)
>         at org.apache.maven.cli.MavenCli.main(MavenCli.java:287)
>         at sun.reflect.NativeMethodAccessorImpl.invoke0(Native Method)
>         at
>     sun.reflect.NativeMethodAccessorImpl.invoke(NativeMethodAccessorImpl.java:39)
>         at
>     sun.reflect.DelegatingMethodAccessorImpl.invoke(DelegatingMethodAccessorImpl.java:25)
>         at java.lang.reflect.Method.invoke(Method.java:597)
>         at
>     org.codehaus.classworlds.Launcher.launchEnhanced(Launcher.java:315)
>         at org.codehaus.classworlds.Launcher.launch(Launcher.java:255)
>         at
>     org.codehaus.classworlds.Launcher.mainWithExitCode(Launcher.java:430)
>         at org.codehaus.classworlds.Launcher.main(Launcher.java:375)
>     Caused by: org.apache.maven.plugin.MojoExecutionException: An Ant
>     BuildException has occured: Java returned: 13
>         at
>     org.apache.maven.plugin.antrun.AbstractAntMojo.executeTasks(AbstractAntMojo.java:131)
>         at
>     org.apache.maven.plugin.antrun.AntRunMojo.execute(AntRunMojo.java:98)
>         at
>     org.apache.maven.plugin.DefaultPluginManager.executeMojo(DefaultPluginManager.java:451)
>         at
>     org.apache.maven.lifecycle.DefaultLifecycleExecutor.executeGoals(DefaultLifecycleExecutor.java:558)
>         ... 16 more
>     Caused by: Java returned: 13
>         at org.apache.tools.ant.taskdefs.Java.execute(Java.java:108)
>         at
>     org.apache.tools.ant.UnknownElement.execute(UnknownElement.java:288)
>         at sun.reflect.NativeMethodAccessorImpl.invoke0(Native Method)
>         at
>     sun.reflect.NativeMethodAccessorImpl.invoke(NativeMethodAccessorImpl.java:39)
>         at
>     sun.reflect.DelegatingMethodAccessorImpl.invoke(DelegatingMethodAccessorImpl.java:25)
>         at java.lang.reflect.Method.invoke(Method.java:597)
>         at
>     org.apache.tools.ant.dispatch.DispatchUtils.execute(DispatchUtils.java:106)
>         at org.apache.tools.ant.Task.perform(Task.java:348)
>         at org.apache.tools.ant.Target.execute(Target.java:357)
>         at
>     org.apache.maven.plugin.antrun.AbstractAntMojo.executeTasks(AbstractAntMojo.java:118)
>         ... 19 more
>     [INFO]
>     ------------------------------------------------------------------------
>     [INFO] Total time: 3 minutes 25 seconds
>     [INFO] Finished at: Fri Mar 13 12:33:25 CET 2009
>     [INFO] Final Memory: 54M/63M
>     [INFO]
>     ------------------------------------------------------------------------
> 
> 
> 
>     Can you please help me in this?
>     Best Regards,
>     Rahul
> 
> 
>         -- 
>         --
>         cordialement, regards,
>         Emmanuel L├ęcharny
>         www.iktek.com <http://www.iktek.com>
>         directory.apache.org <http://directory.apache.org>
> 
> 
> 
> 


Mime
View raw message