directory-dev mailing list archives

Site index · List index
Message view « Date » · « Thread »
Top « Date » · « Thread »
From Emmanuel Lecharny <elecha...@gmail.com>
Subject BB status
Date Wed, 23 Jul 2008 00:50:41 GMT
Hi,

after long hours of debugging sessions, a handfull of bugs fixed, we are 
closing the gap between a broken branch and a compiling branch...

However, we still have 62 failures and errors. Out of which 28 errors 
are due to Referrals (plain normal, as we didn't injected the code to 
handle those guys), and more problematics are the 27/27 failing tests in 
searchITest. My personnal guess is that we are trying to create entries 
with a RDN wicthout having the associated attribute in the entry. Easy 
to fix.

My personal guess is that we should have a BB branch compiling and 
passing integration tests by the end of this week. We will then be able 
to move back the branch into trunk and to kill the branch !

Here they are the current errors :

[INFO] Surefire report directory: 
/home/elecharny/apacheds/1.5.4/apacheds/server-unit/target/surefire-reports

-------------------------------------------------------
 T E S T S
-------------------------------------------------------
Running org.apache.directory.server.KeyDerivationServiceITest
Tests run: 4, Failures: 0, Errors: 0, Skipped: 0, Time elapsed: 12.184 sec
Running org.apache.directory.server.ModifyRemoveTest
Tests run: 15, Failures: 0, Errors: 0, Skipped: 0, Time elapsed: 20.222 sec
Running org.apache.directory.server.UnknownExtendedOperationTest
Tests run: 1, Failures: 0, Errors: 0, Skipped: 0, Time elapsed: 4.481 sec
Running org.apache.directory.server.CascadeControlITest
Tests run: 1, Failures: 0, Errors: 0, Skipped: 0, Time elapsed: 4.203 sec
Running org.apache.directory.server.operations.bind.SimpleBindITest
Tests run: 7, Failures: 0, Errors: 0, Skipped: 0, Time elapsed: 14.224 sec
Running org.apache.directory.server.MiscTest
Tests run: 8, Failures: 0, Errors: 0, Skipped: 0, Time elapsed: 13.527 sec
Running org.apache.directory.server.IllegalLDAPVersionBindITest
Tests run: 1, Failures: 0, Errors: 0, Skipped: 0, Time elapsed: 5.758 sec
Running org.apache.directory.server.DelITest
Delta = 6901
Tests run: 2, Failures: 0, Errors: 0, Skipped: 0, Time elapsed: 6.956 sec
Running org.apache.directory.server.IllegalModificationITest
Tests run: 2, Failures: 0, Errors: 0, Skipped: 0, Time elapsed: 6.167 sec
Running org.apache.directory.server.NegationOperatorITest
Tests run: 4, Failures: 0, Errors: 0, Skipped: 0, Time elapsed: 8.178 sec
Running org.apache.directory.server.AddITest
Tests run: 11, Failures: 0, Errors: 0, Skipped: 0, Time elapsed: 19.375 sec
Running org.apache.directory.server.ReferralITest
Tests run: 8, Failures: 4, Errors: 2, Skipped: 0, Time elapsed: 13.804 
sec <<< FAILURE!
Running org.apache.directory.server.ReferralTest
Tests run: 22, Failures: 8, Errors: 14, Skipped: 0, Time elapsed: 28.956 
sec <<< FAILURE!
Running org.apache.directory.server.DIRSERVER951ITest
Tests run: 1, Failures: 0, Errors: 0, Skipped: 0, Time elapsed: 5.543 sec
Running org.apache.directory.server.ModifyRdnTest
Tests run: 20, Failures: 1, Errors: 0, Skipped: 0, Time elapsed: 30.795 
sec <<< FAILURE!
Running org.apache.directory.server.BadDnTest
Tests run: 2, Failures: 0, Errors: 0, Skipped: 0, Time elapsed: 6.712 sec
Running org.apache.directory.server.DeleteIllegalDNITest
Tests run: 1, Failures: 0, Errors: 0, Skipped: 0, Time elapsed: 4.942 sec
Running org.apache.directory.server.jndi.ServerContextFactoryTest
Tests run: 2, Failures: 0, Errors: 0, Skipped: 0, Time elapsed: 7.933 sec
Running org.apache.directory.server.SchemaSearchITest
Tests run: 3, Failures: 0, Errors: 0, Skipped: 0, Time elapsed: 7.497 sec
Running org.apache.directory.server.ssl.LdapsITest
Tests run: 1, Failures: 0, Errors: 0, Skipped: 0, Time elapsed: 4.699 sec
Running org.apache.directory.server.ssl.ConfidentialityRequiredITest
Tests run: 1, Failures: 0, Errors: 1, Skipped: 0, Time elapsed: 4.636 
sec <<< FAILURE!
Running 
org.apache.directory.server.AddingEntriesWithSpecialCharactersInRDNTest
Tests run: 6, Failures: 0, Errors: 0, Skipped: 0, Time elapsed: 11.144 sec
Running org.apache.directory.server.ModifyAddTest
Tests run: 15, Failures: 0, Errors: 0, Skipped: 0, Time elapsed: 21.232 sec
Running org.apache.directory.server.SaslBindITest
Tests run: 5, Failures: 3, Errors: 0, Skipped: 0, Time elapsed: 12.469 
sec <<< FAILURE!
Running org.apache.directory.server.BinarySearchTest
Tests run: 1, Failures: 0, Errors: 0, Skipped: 0, Time elapsed: 3.834 sec
Running org.apache.directory.server.MatchingRuleCompareTest
Tests run: 2, Failures: 0, Errors: 1, Skipped: 0, Time elapsed: 5.527 
sec <<< FAILURE!
Running org.apache.directory.server.SearchITest
Tests run: 27, Failures: 0, Errors: 27, Skipped: 0, Time elapsed: 20.512 
sec <<< FAILURE!
Running org.apache.directory.server.ManyServersITest
Tests run: 1, Failures: 0, Errors: 0, Skipped: 0, Time elapsed: 5.402 sec
Running org.apache.directory.server.PasswordPolicyServiceITest
Tests run: 7, Failures: 0, Errors: 0, Skipped: 0, Time elapsed: 15.615 sec
Running org.apache.directory.server.ssl.StartTlsITest
Tests run: 1, Failures: 0, Errors: 1, Skipped: 0, Time elapsed: 4.123 
sec <<< FAILURE!
Running org.apache.directory.server.ModifyReplaceITest
Tests run: 3, Failures: 0, Errors: 0, Skipped: 0, Time elapsed: 7.248 sec
Running org.apache.directory.server.StoredProcedureExecutionITest
Tests run: 3, Failures: 0, Errors: 0, Skipped: 0, Time elapsed: 7.675 sec

Results :

Failed tests:

Tests in error:

Tests run: 188, Failures: 16, Errors: 46, Skipped: 0

-- 
--
cordialement, regards,
Emmanuel L├ęcharny
www.iktek.com
directory.apache.org



Mime
View raw message