directory-dev mailing list archives

Site index · List index
Message view « Date » · « Thread »
Top « Date » · « Thread »
From "Pierre-Arnaud Marcelot" ...@marcelot.net>
Subject [ApacheDS] Build failure on the BigBang branch
Date Thu, 07 Feb 2008 17:05:53 GMT
Hi,

I have a build failure on the BigBang branch.

Here's the log:
[INFO]
----------------------------------------------------------------------------
[INFO] Building ApacheDS Core
[INFO]    task-segment: [clean, install]
[INFO]
----------------------------------------------------------------------------
[INFO] [clean:clean]
[INFO] Deleting directory
/home/pajbam/Development/Apache/bigbang-with-dependencies/apacheds/core/target
[INFO] Deleting directory
/home/pajbam/Development/Apache/bigbang-with-dependencies/apacheds/core/target/classes
[INFO] Deleting directory
/home/pajbam/Development/Apache/bigbang-with-dependencies/apacheds/core/target/test-classes
[INFO] Deleting directory
/home/pajbam/Development/Apache/bigbang-with-dependencies/apacheds/core/target/site
[INFO] [remote-resources:process {execution: default}]
[INFO] [resources:resources]
[INFO] Using default encoding to copy filtered resources.
[INFO] [compiler:compile]
[INFO] Compiling 204 source files to
/home/pajbam/Development/Apache/bigbang-with-dependencies/apacheds/core/target/classes
[INFO] [resources:testResources]
[INFO] Using default encoding to copy filtered resources.
[INFO] [compiler:testCompile]
[INFO] Compiling 36 source files to
/home/pajbam/Development/Apache/bigbang-with-dependencies/apacheds/core/target/test-classes
[INFO] [surefire:test]
[INFO] Surefire report directory:
/home/pajbam/Development/Apache/bigbang-with-dependencies/apacheds/core/target/surefire-reports

-------------------------------------------------------
 T E S T S
-------------------------------------------------------
Running
org.apache.directory.server.core.authz.support.MaxValueCountFilterTest
Tests run: 4, Failures: 0, Errors: 0, Skipped: 0, Time elapsed: 0.26 sec
Running
org.apache.directory.server.core.authz.support.MostSpecificProtectedItemFilterTest
Tests run: 6, Failures: 0, Errors: 0, Skipped: 0, Time elapsed: 0.016 sec
Running
org.apache.directory.server.core.partition.impl.btree.jdbm.BTreeTupleEnumerationTest
Tests run: 11, Failures: 0, Errors: 0, Skipped: 0, Time elapsed: 0.347 sec
Running org.apache.directory.server.core.changelog.MemoryChangeLogStoreTest
Tests run: 1, Failures: 0, Errors: 0, Skipped: 0, Time elapsed: 0.021 sec
Running org.apache.directory.server.core.interceptor.InterceptorChainTest
Tests run: 6, Failures: 0, Errors: 0, Skipped: 0, Time elapsed: 0.029 sec
Running
org.apache.directory.server.core.authz.support.MostSpecificUserClassFilterTest
Tests run: 6, Failures: 0, Errors: 0, Skipped: 0, Time elapsed: 0.01 sec
Running
org.apache.directory.server.core.schema.bootstrap.BootstrapSchemaLoaderTest
Tests run: 7, Failures: 0, Errors: 0, Skipped: 0, Time elapsed: 0.128 sec
Running org.apache.directory.server.core.sp.StoredProcUtilsTest
Tests run: 1, Failures: 0, Errors: 0, Skipped: 0, Time elapsed: 0.005 sec
Running
org.apache.directory.server.core.authz.support.MicroOperationFilterTest
Tests run: 2, Failures: 0, Errors: 0, Skipped: 0, Time elapsed: 0.007 sec
Running org.apache.directory.server.core.schema.SchemaCheckerTest
Tests run: 6, Failures: 0, Errors: 0, Skipped: 0, Time elapsed: 0.026 sec
Running org.apache.directory.server.core.jndi.LdapJndiPropertiesTest
Tests run: 7, Failures: 0, Errors: 0, Skipped: 0, Time elapsed: 0.019 sec
Running
org.apache.directory.server.core.authz.support.HighestPrecedenceFilterTest
Tests run: 3, Failures: 0, Errors: 0, Skipped: 0, Time elapsed: 0.006 sec
Running org.apache.directory.server.core.authz.support.MaxImmSubFilterTest
Tests run: 5, Failures: 0, Errors: 0, Skipped: 0, Time elapsed: 0.05 sec
Running org.apache.directory.server.core.partition.tree.PartitionTreeTest
[18:04:12] ERROR [org.apache.directory.server.core.partition.tree.BranchNode]
- Overlapping partitions are not allowed
Tests run: 4, Failures: 1, Errors: 0, Skipped: 0, Time elapsed: 0.043 sec
<<< FAILURE!
Running org.apache.directory.server.core.subtree.RefinementEvaluatorTest
Tests run: 6, Failures: 0, Errors: 0, Skipped: 0, Time elapsed: 0.112 sec
Running org.apache.directory.server.core.referral.ReferralLutTest
Tests run: 3, Failures: 0, Errors: 0, Skipped: 0, Time elapsed: 0.005 sec
Running org.apache.directory.server.core.prefs.PreferencesUtilsTest
Tests run: 1, Failures: 0, Errors: 0, Skipped: 0, Time elapsed: 0.005 sec
Running
org.apache.directory.server.core.partition.impl.btree.jdbm.StringSerializerTest
Tests run: 2, Failures: 0, Errors: 0, Skipped: 0, Time elapsed: 0.031 sec
Running
org.apache.directory.server.core.partition.impl.btree.jdbm.JdbmTableDupsTreeSetTest
Tests run: 9, Failures: 0, Errors: 0, Skipped: 0, Time elapsed: 0.423 sec
Running org.apache.directory.server.core.schema.PartitionSchemaLoaderTest
Tests run: 2, Failures: 0, Errors: 0, Skipped: 0, Time elapsed: 0.297 sec
Running org.apache.directory.server.core.schema.SchemaServiceTest
Tests run: 1, Failures: 0, Errors: 0, Skipped: 0, Time elapsed: 0.096 sec
Running org.apache.directory.server.core.subtree.SubtreeEvaluatorTest
Tests run: 7, Failures: 0, Errors: 0, Skipped: 0, Time elapsed: 0.082 sec
Running
org.apache.directory.server.core.authz.support.RelatedProtectedItemFilterTest
Tests run: 11, Failures: 0, Errors: 0, Skipped: 0, Time elapsed: 0.068 sec
Running
org.apache.directory.server.core.authn.SimpleAuthenticatorOneWayEncryptedTest
Tests run: 2, Failures: 0, Errors: 0, Skipped: 0, Time elapsed: 0.157 sec
Running
org.apache.directory.server.core.partition.impl.btree.jdbm.BTreeIteratorTest
Tests run: 4, Failures: 0, Errors: 0, Skipped: 0, Time elapsed: 0.086 sec
Running
org.apache.directory.server.core.partition.impl.btree.jdbm.BTreeEnumerationTest
Tests run: 3, Failures: 0, Errors: 0, Skipped: 0, Time elapsed: 0.067 sec
Running
org.apache.directory.server.core.partition.impl.btree.jdbm.AttributesSerializerTest
Tests run: 1, Failures: 0, Errors: 0, Skipped: 0, Time elapsed: 0.007 sec
Running
org.apache.directory.server.core.partition.impl.btree.jdbm.JdbmTableDupsBTreeTest
Tests run: 9, Failures: 0, Errors: 0, Skipped: 0, Time elapsed: 0.278 sec
Running
org.apache.directory.server.core.authz.support.RestrictedByFilterTest
Tests run: 4, Failures: 0, Errors: 0, Skipped: 0, Time elapsed: 0.029 sec
Running org.apache.directory.server.core.authz.support.OperationScopeTest
Tests run: 2, Failures: 0, Errors: 0, Skipped: 0, Time elapsed: 0.002 sec
Running
org.apache.directory.server.core.partition.impl.btree.jdbm.JdbmTableNoDupsTest
Tests run: 10, Failures: 0, Errors: 0, Skipped: 0, Time elapsed: 0.307 sec
Running org.apache.directory.server.core.subtree.RefinementLeafEvaluatorTest
[18:04:14] ERROR [
org.apache.directory.server.core.entry.AbstractServerAttribute] - The upID
(cn) is not an OID or is different from the AttributeType OID (2.5.4.0)
Tests run: 3, Failures: 0, Errors: 0, Skipped: 0, Time elapsed: 0.035 sec
Running
org.apache.directory.server.core.authz.support.RelatedUserClassFilterTest
Tests run: 7, Failures: 0, Errors: 0, Skipped: 0, Time elapsed: 0.006 sec

Results :

Failed tests:
  testNewPartitionTree2Nodes(
org.apache.directory.server.core.partition.tree.PartitionTreeTest)

Tests run: 156, Failures: 1, Errors: 0, Skipped: 0

[INFO]
------------------------------------------------------------------------
[ERROR] BUILD FAILURE
[INFO]
------------------------------------------------------------------------
[INFO] There are test failures.
[INFO]
------------------------------------------------------------------------
[INFO] For more information, run Maven with the -e switch
[INFO]
------------------------------------------------------------------------
[INFO] Total time: 1 minute 22 seconds
[INFO] Finished at: Thu Feb 07 18:04:14 CET 2008
[INFO] Final Memory: 29M/63M
[INFO]
------------------------------------------------------------------------

Regards,
Pierre-Arnaud

Mime
View raw message