directory-dev mailing list archives

Site index · List index
Message view « Date » · « Thread »
Top « Date » · « Thread »
From bui...@organicelement.com
Subject [BUILD] [FAILED] Build Apache Directory Server::CI Build #243 failed (1732 tests passed, 2 tests failed (no new))
Date Sun, 26 Aug 2007 16:44:55 GMT
Build Apache Directory Server::CI Build #243 failed (1732 tests passed, 2 tests failed (no
new))
Agent: Linux - FC6
Build results: http://builds.organicelement.com/viewLog.html?buildId=578&buildTypeId=bt1

Failed tests (2 tests)
==================================================================
org.apache.directory.server.core.schema.ObjectClassCreateTest.testCreateObjectClassWithInvalidNameAttribute
=================
javax.naming.NamingException: attributeType w/ OID 1.3.6.1.4.1.18060.0.4.0.2.1  not registered!
	at org.apache.directory.server.schema.registries.DefaultAttributeTypeRegistry.lookup(DefaultAttributeTypeRegistry.java:160)
	at org.apache.directory.server.core.schema.MetaObjectClassHandler.&init&(MetaObjectClassHandler.java:72)
	at org.apache.directory.server.core.schema.SchemaManager.&init&(SchemaManager.java:203)
	at org.apache.directory.server.core.DefaultDirectoryService.initialize(DefaultDirectoryService.java:968)
	at org.apache.directory.server.core.DefaultDirectoryService.startup(DefaultDirectoryService.java:254)
	at org.apache.directory.server.core.jndi.AbstractContextFactory.getInitialContext(AbstractContextFactory.java:124)
	at javax.naming.spi.NamingManager.getInitialContext(NamingManager.java:667)
	at javax.naming.InitialContext.getDefaultInitCtx(InitialContext.java:288)
	at javax.naming.InitialContext.init(InitialContext.java:223)
	at javax.naming.ldap.InitialLdapContext.&init&(InitialLdapContext.java:134)
	at org.apache.directory.server.core.unit.AbstractTestCase.setContextRoots(AbstractTestCase.java:296)
	at org.apache.directory.server.core.unit.AbstractTestCase.setContextRoots(AbstractTestCase.java:268)
	at org.apache.directory.server.core.unit.AbstractTestCase.setUp(AbstractTestCase.java:218)
	at junit.framework.TestCase.runBare(TestCase.java:132)
	at junit.framework.TestResult$1.protect(TestResult.java:110)
	at junit.framework.TestResult.runProtected(TestResult.java:128)
	at junit.framework.TestResult.run(TestResult.java:113)
	at junit.framework.TestCase.run(TestCase.java:124)
	at junit.framework.TestSuite.runTest(TestSuite.java:232)
	at junit.framework.TestSuite.run(TestSuite.java:227)
	at org.junit.internal.runners.JUnit38ClassRunner.run(JUnit38ClassRunner.java:81)
	at org.apache.maven.surefire.junit4.JUnit4TestSet.execute(JUnit4TestSet.java:62)
	at org.apache.maven.surefire.suite.AbstractDirectoryTestSuite.executeTestSet(AbstractDirectoryTestSuite.java:138)
	at org.apache.maven.surefire.suite.AbstractDirectoryTestSuite.execute(AbstractDirectoryTestSuite.java:125)
	at org.apache.maven.surefire.Surefire.run(Surefire.java:132)
	at sun.reflect.NativeMethodAccessorImpl.invoke0(Native Method)
	at sun.reflect.NativeMethodAccessorImpl.invoke(NativeMethodAccessorImpl.java:39)
	at sun.reflect.DelegatingMethodAccessorImpl.invoke(DelegatingMethodAccessorImpl.java:25)
	at java.lang.reflect.Method.invoke(Method.java:597)
	at org.apache.maven.surefire.booter.SurefireBooter.runSuitesInProcess(SurefireBooter.java:290)
	at org.apache.maven.surefire.booter.SurefireBooter.main(SurefireBooter.java:818)

org.apache.directory.server.core.schema.ObjectClassCreateTest.testCreateObjectClassWithNoObjectClass
=================
javax.naming.NamingException: attributeType w/ OID 1.3.6.1.4.1.18060.0.4.0.2.1  not registered!
	at org.apache.directory.server.schema.registries.DefaultAttributeTypeRegistry.lookup(DefaultAttributeTypeRegistry.java:160)
	at org.apache.directory.server.core.schema.MetaObjectClassHandler.&init&(MetaObjectClassHandler.java:72)
	at org.apache.directory.server.core.schema.SchemaManager.&init&(SchemaManager.java:203)
	at org.apache.directory.server.core.DefaultDirectoryService.initialize(DefaultDirectoryService.java:968)
	at org.apache.directory.server.core.DefaultDirectoryService.startup(DefaultDirectoryService.java:254)
	at org.apache.directory.server.core.jndi.AbstractContextFactory.getInitialContext(AbstractContextFactory.java:124)
	at javax.naming.spi.NamingManager.getInitialContext(NamingManager.java:667)
	at javax.naming.InitialContext.getDefaultInitCtx(InitialContext.java:288)
	at javax.naming.InitialContext.init(InitialContext.java:223)
	at javax.naming.ldap.InitialLdapContext.&init&(InitialLdapContext.java:134)
	at org.apache.directory.server.core.unit.AbstractTestCase.setContextRoots(AbstractTestCase.java:296)
	at org.apache.directory.server.core.unit.AbstractTestCase.setContextRoots(AbstractTestCase.java:268)
	at org.apache.directory.server.core.unit.AbstractTestCase.setUp(AbstractTestCase.java:218)
	at junit.framework.TestCase.runBare(TestCase.java:132)
	at junit.framework.TestResult$1.protect(TestResult.java:110)
	at junit.framework.TestResult.runProtected(TestResult.java:128)
	at junit.framework.TestResult.run(TestResult.java:113)
	at junit.framework.TestCase.run(TestCase.java:124)
	at junit.framework.TestSuite.runTest(TestSuite.java:232)
	at junit.framework.TestSuite.run(TestSuite.java:227)
	at org.junit.internal.runners.JUnit38ClassRunner.run(JUnit38ClassRunner.java:81)
	at org.apache.maven.surefire.junit4.JUnit4TestSet.execute(JUnit4TestSet.java:62)
	at org.apache.maven.surefire.suite.AbstractDirectoryTestSuite.executeTestSet(AbstractDirectoryTestSuite.java:138)
	at org.apache.maven.surefire.suite.AbstractDirectoryTestSuite.execute(AbstractDirectoryTestSuite.java:125)
	at org.apache.maven.surefire.Surefire.run(Surefire.java:132)
	at sun.reflect.NativeMethodAccessorImpl.invoke0(Native Method)
	at sun.reflect.NativeMethodAccessorImpl.invoke(NativeMethodAccessorImpl.java:39)
	at sun.reflect.DelegatingMethodAccessorImpl.invoke(DelegatingMethodAccessorImpl.java:25)
	at java.lang.reflect.Method.invoke(Method.java:597)
	at org.apache.maven.surefire.booter.SurefireBooter.runSuitesInProcess(SurefireBooter.java:290)
	at org.apache.maven.surefire.booter.SurefireBooter.main(SurefireBooter.java:818)

Changes included (1 change)
====================================================
Change 569836 by akarasulu (1 file):
more at constants

see more information about changed files: http://builds.organicelement.com/viewLog.html?tab=buildChangesDiv&buildId=578&buildTypeId=bt1


============================================================================
Configure email notifications: http://builds.organicelement.com/profile.html?init=1#notifications

Mime
View raw message