directory-dev mailing list archives

Site index · List index
Message view « Date » · « Thread »
Top « Date » · « Thread »
From "Gianmaria Clerici" <gcler...@bridgestream.com>
Subject RE: [ApacheDS] 1.0-RC3 Released
Date Tue, 09 May 2006 19:16:51 GMT

I just got the code from SVN and I tried to do a build but it fails
with this error.
It download the jar file but then it's complaining that it's not the
correct version.

Any idea ?

Thanks

========================================================================
===
+ Error stacktraces are turned on.

[INFO] Scanning for projects...

[INFO] Searching repository for plugin with prefix: 'assembly'.

[INFO]
------------------------------------------------------------------------
----

[INFO] Building ApacheDS Server Main

[INFO]    task-segment: [clean]

[INFO]
------------------------------------------------------------------------
----

[INFO] [clean:clean]

[INFO] Deleting directory
c:\Bridgestream\Apache_Directory\releases\apacheds\1.0-RC3\server-main\t
arget

[INFO] Deleting directory
c:\Bridgestream\Apache_Directory\releases\apacheds\1.0-RC3\server-main\t
arget\classes

[INFO] Deleting directory
c:\Bridgestream\Apache_Directory\releases\apacheds\1.0-RC3\server-main\t
arget\test-classes

[INFO]
------------------------------------------------------------------------
----

[INFO] Building ApacheDS Server Main

[INFO]    task-segment: [assembly:assembly] (aggregator-style)

[INFO]
------------------------------------------------------------------------
----

[INFO] Preparing assembly:assembly

[INFO]
------------------------------------------------------------------------
----

[INFO] Building ApacheDS Server Main

[INFO]
------------------------------------------------------------------------
----

[INFO] [resources:resources]

[INFO] Using default encoding to copy filtered resources.

[WARNING] While downloading springframework:spring-context:1.2.1
  This artifact has been relocated to
org.springframework:spring-context:1.2.1.



[WARNING] While downloading springframework:spring-beans:1.2.1
  This artifact has been relocated to
org.springframework:spring-beans:1.2.1.



[WARNING] While downloading springframework:spring-core:1.2.1
  This artifact has been relocated to
org.springframework:spring-core:1.2.1.



Downloading:
http://cvs.apache.org/maven-snapshot-repository/org/slf4j/nlog4j/1.2.24/
nlog4j-1.2.24.pom

[WARNING] Unable to get resource from repository apache.snapshots
(http://cvs.apache.org/maven-snapshot-repository)

Downloading:
http://m2.safehaus.org/org/slf4j/nlog4j/1.2.24/nlog4j-1.2.24.pom

[WARNING] Unable to get resource from repository safehaus
(http://m2.safehaus.org)

Downloading:
http://repo1.maven.org/maven2/org/slf4j/nlog4j/1.2.24/nlog4j-1.2.24.pom

1/1K
1K downloaded

Downloading:
http://cvs.apache.org/maven-snapshot-repository/org/slf4j/nlog4j/1.2.24/
nlog4j-1.2.24.jar

[WARNING] Unable to get resource from repository apache.snapshots
(http://cvs.apache.org/maven-snapshot-repository)

Downloading:
http://m2.safehaus.org/org/slf4j/nlog4j/1.2.24/nlog4j-1.2.24.jar

[WARNING] Unable to get resource from repository safehaus
(http://m2.safehaus.org)

Downloading:
http://repo1.maven.org/maven2/org/slf4j/nlog4j/1.2.24/nlog4j-1.2.24.jar

2/200K
6/200K
6/200K
7/200K
11/200K
14/200K
15/200K
19/200K
22/200K
26/200K
27/200K
31/200K
32/200K
36/200K
37/200K
41/200K
43/200K
47/200K
47/200K
51/200K
55/200K
59/200K
63/200K
67/200K
71/200K
75/200K
75/200K
79/200K
81/200K
82/200K
83/200K
87/200K
90/200K
91/200K
95/200K
95/200K
99/200K
100/200K
104/200K
105/200K
109/200K
110/200K
111/200K
115/200K
119/200K
123/200K
125/200K
127/200K
131/200K
135/200K
139/200K
143/200K
147/200K
151/200K
155/200K
158/200K
159/200K
163/200K
167/200K
171/200K
175/200K
179/200K
179/200K
183/200K
185/200K
189/200K
190/200K
191/200K
195/200K
197/200K
200/200K
200K downloaded

[INFO] [compiler:compile]

Compiling 2 source files to
c:\Bridgestream\Apache_Directory\releases\apacheds\1.0-RC3\server-main\t
arget\classes

[INFO]
------------------------------------------------------------------------

[ERROR] BUILD FAILURE

[INFO]
------------------------------------------------------------------------

[INFO] Compilation failure

c:\Bridgestream\Apache_Directory\releases\apacheds\1.0-RC3\server-main\s
rc\main\java\org\apache\directory\server\Service.java:[33,-1] cannot
access org.slf4j.Logger

bad class file: C:\Documents and
Settings\gclerici\.m2\repository\org\slf4j\nlog4j\1.2.24\nlog4j-1.2.24.j
ar(org/slf4j/Logger.class)

class file has wrong version 49.0, should be 48.0





[INFO]
------------------------------------------------------------------------

[INFO] Trace

org.apache.maven.BuildFailureException: Compilation failure

	at
org.apache.maven.lifecycle.DefaultLifecycleExecutor.executeGoals(Default
LifecycleExecutor.java:555)

	at
org.apache.maven.lifecycle.DefaultLifecycleExecutor.executeGoalWithLifec
ycle(DefaultLifecycleExecutor.java:475)

	at
org.apache.maven.lifecycle.DefaultLifecycleExecutor.forkProjectLifecycle
(DefaultLifecycleExecutor.java:891)

	at
org.apache.maven.lifecycle.DefaultLifecycleExecutor.forkLifecycle(Defaul
tLifecycleExecutor.java:729)

	at
org.apache.maven.lifecycle.DefaultLifecycleExecutor.executeGoals(Default
LifecycleExecutor.java:505)

	at
org.apache.maven.lifecycle.DefaultLifecycleExecutor.executeStandaloneGoa
l(DefaultLifecycleExecutor.java:488)

	at
org.apache.maven.lifecycle.DefaultLifecycleExecutor.executeGoal(DefaultL
ifecycleExecutor.java:458)

	at
org.apache.maven.lifecycle.DefaultLifecycleExecutor.executeGoalAndHandle
Failures(DefaultLifecycleExecutor.java:306)

	at
org.apache.maven.lifecycle.DefaultLifecycleExecutor.executeTaskSegments(
DefaultLifecycleExecutor.java:219)

	at
org.apache.maven.lifecycle.DefaultLifecycleExecutor.execute(DefaultLifec
ycleExecutor.java:140)

	at
org.apache.maven.DefaultMaven.doExecute(DefaultMaven.java:322)

	at org.apache.maven.DefaultMaven.execute(DefaultMaven.java:115)

	at org.apache.maven.cli.MavenCli.main(MavenCli.java:256)

	at sun.reflect.NativeMethodAccessorImpl.invoke0(Native Method)

	at
sun.reflect.NativeMethodAccessorImpl.invoke(NativeMethodAccessorImpl.jav
a:39)

	at
sun.reflect.DelegatingMethodAccessorImpl.invoke(DelegatingMethodAccessor
Impl.java:25)

	at java.lang.reflect.Method.invoke(Method.java:324)

	at
org.codehaus.classworlds.Launcher.launchEnhanced(Launcher.java:315)

	at org.codehaus.classworlds.Launcher.launch(Launcher.java:255)

	at
org.codehaus.classworlds.Launcher.mainWithExitCode(Launcher.java:430)

	at org.codehaus.classworlds.Launcher.main(Launcher.java:375)

Caused by: org.apache.maven.plugin.CompilationFailureException:
Compilation failure

	at
org.apache.maven.plugin.AbstractCompilerMojo.execute(AbstractCompilerMoj
o.java:505)

	at
org.apache.maven.plugin.CompilerMojo.execute(CompilerMojo.java:111)

	at
org.apache.maven.plugin.DefaultPluginManager.executeMojo(DefaultPluginMa
nager.java:412)

	at
org.apache.maven.lifecycle.DefaultLifecycleExecutor.executeGoals(Default
LifecycleExecutor.java:534)

	... 20 more

[INFO]
------------------------------------------------------------------------

[INFO] Total time: 24 seconds

[INFO] Finished at: Tue May 09 12:14:53 PDT 2006

[INFO] Final Memory: 7M/15M

[INFO]
------------------------------------------------------------------------


-----Original Message-----
From: Alex Karasulu [mailto:aok123@bellsouth.net] 
Sent: Tuesday, May 09, 2006 4:33 AM
To: Apache Directory Developers List
Subject: [ApacheDS] 1.0-RC3 Released

The signed installers are in their usual places:

    http://www.apache.org/dist/directory/apacheds/stable/1.0/1.0-RC3/

These jars should make it to the Apache mirrors shortly.

The jars have been signed and deployed to:

 
http://www.apache.org/dist/maven-repository/org/apache/directory/server/

This should mirror soon to ibiblio.org.

Alex

Mime
View raw message