directory-dev mailing list archives

Site index · List index
Message view « Date » · « Thread »
Top « Date » · « Thread »
From Pierre CHATEL <maili...@chatelp.org>
Subject Re: trying to build maven on MacOS X
Date Sat, 18 Mar 2006 12:03:28 GMT
woops, sorry for the typo, i meant that i was trying to build "Apache  
DS" on OSX.
I guess it's what you get when working  4 hours straight on the same  
issue !! :-)

Sorry about that.

Pierre

On Mar 18, 2006, at 12:59 PM, Pierre CHATEL wrote:

> Hi there,
>
> i'm trying to build maven from source on the last release of OSX  
> (10.4.5). I'm using Java build 1.5.0_05-48 and Maven 2.
> I get this error when running the final tests on  
> org.apache.directory.server.ssl.LdapsTest
>
> -------------------------------------------------------
> T E S T S
> -------------------------------------------------------
> [surefire] Running org.apache.directory.server.ssl.LdapsTest
> [surefire] Tests run: 1, Failures: 0, Errors: 1, Time elapsed:  
> 5.361 sec <<<<<<<< FAILURE !!
> [INFO]  
> ---------------------------------------------------------------------- 
> ------
> [ERROR] BUILD ERROR
> [INFO]  
> ---------------------------------------------------------------------- 
> ------
> [INFO] There are test failures.
> [INFO]  
> ---------------------------------------------------------------------- 
> ------
> [INFO] Trace
> org.apache.maven.lifecycle.LifecycleExecutionException: There are  
> test failures.
>         at  
> org.apache.maven.lifecycle.DefaultLifecycleExecutor.executeGoals 
> (DefaultLifecycleExecutor.java:556)
>         at  
> org.apache.maven.lifecycle.DefaultLifecycleExecutor.executeGoalWithLif 
> ecycle(DefaultLifecycleExecutor.java:472)
>         at  
> org.apache.maven.lifecycle.DefaultLifecycleExecutor.executeGoal 
> (DefaultLifecycleExecutor.java:451)
>         at  
> org.apache.maven.lifecycle.DefaultLifecycleExecutor.executeGoalAndHand 
> leFailures(DefaultLifecycleExecutor.java:303)
>         at  
> org.apache.maven.lifecycle.DefaultLifecycleExecutor.executeTaskSegment 
> s(DefaultLifecycleExecutor.java:270)
>         at  
> org.apache.maven.lifecycle.DefaultLifecycleExecutor.execute 
> (DefaultLifecycleExecutor.java:139)
>         at org.apache.maven.DefaultMaven.doExecute 
> (DefaultMaven.java:322)
>         at org.apache.maven.DefaultMaven.execute(DefaultMaven.java: 
> 115)
>         at org.apache.maven.cli.MavenCli.main(MavenCli.java:249)
>         at sun.reflect.NativeMethodAccessorImpl.invoke0(Native Method)
>         at sun.reflect.NativeMethodAccessorImpl.invoke 
> (NativeMethodAccessorImpl.java:39)
>         at sun.reflect.DelegatingMethodAccessorImpl.invoke 
> (DelegatingMethodAccessorImpl.java:25)
>         at java.lang.reflect.Method.invoke(Method.java:585)
>         at org.codehaus.classworlds.Launcher.launchEnhanced 
> (Launcher.java:315)
>         at org.codehaus.classworlds.Launcher.launch(Launcher.java:255)
>         at org.codehaus.classworlds.Launcher.mainWithExitCode 
> (Launcher.java:430)
>         at org.codehaus.classworlds.Launcher.main(Launcher.java:375)
> Caused by: org.apache.maven.plugin.MojoExecutionException: There  
> are test failures.
>         at org.apache.maven.test.SurefirePlugin.execute 
> (SurefirePlugin.java:386)
>         at org.apache.maven.plugin.DefaultPluginManager.executeMojo 
> (DefaultPluginManager.java:415)
>         at  
> org.apache.maven.lifecycle.DefaultLifecycleExecutor.executeGoals 
> (DefaultLifecycleExecutor.java:531)
>         ... 16 more
> [INFO]  
> ---------------------------------------------------------------------- 
> ------
> [INFO] Total time: 1 minute 12 seconds
> [INFO] Finished at: Sat Mar 18 12:58:00 CET 2006
> [INFO] Final Memory: 13M/26M
> [INFO]  
> ---------------------------------------------------------------------- 
> ------
>
> (I tried the same thing with Windows and Java 1.5 and it ran  
> flawlessly)
>
> Thanks for the help !
>
> Pierre
>


Mime
View raw message