directory-dev mailing list archives

Site index · List index
Message view « Date » · « Thread »
Top « Date » · « Thread »
From "John E. Conlon" <jcon...@verticon.com>
Subject Could not build server-installers
Date Wed, 22 Mar 2006 01:32:20 GMT
After I did a svn update of my apacheds I successfully did a 'mvn
install' in the trunks directory then I attempted to build the
installers from the server-installers directory but the 'mvn install'
failed with the following:

[ERROR] BUILD FAILURE
[INFO]
----------------------------------------------------------------------------
[INFO] Execution of ' mvn site --non-recursive ' resulted in a non-zero
exit value: 1
[INFO]
----------------------------------------------------------------------------
[INFO] Trace
org.apache.maven.BuildFailureException: Execution of ' mvn site --non-
recursive ' resulted in a non-zero exit value: 1
        at
org.apache.maven.lifecycle.DefaultLifecycleExecutor.executeGoals
(DefaultLifecycleExecutor.java:552)
        at
org.apache.maven.lifecycle.DefaultLifecycleExecutor.executeGoalWithLifecycle(DefaultLifecycleExecutor.java:472)
        at
org.apache.maven.lifecycle.DefaultLifecycleExecutor.executeGoal
(DefaultLifecycleExecutor.java:451)
        at
org.apache.maven.lifecycle.DefaultLifecycleExecutor.executeGoalAndHandleFailures(DefaultLifecycleExecutor.java:303)
        at
org.apache.maven.lifecycle.DefaultLifecycleExecutor.executeTaskSegments
(DefaultLifecycleExecutor.java:270)
        at org.apache.maven.lifecycle.DefaultLifecycleExecutor.execute
(DefaultLifecycleExecutor.java:139)
        at org.apache.maven.DefaultMaven.doExecute
(DefaultMaven.java:322)
        at org.apache.maven.DefaultMaven.execute(DefaultMaven.java:115)
        at org.apache.maven.cli.MavenCli.main(MavenCli.java:249)
        at sun.reflect.NativeMethodAccessorImpl.invoke0(Native Method)
        at sun.reflect.NativeMethodAccessorImpl.invoke
(NativeMethodAccessorImpl.java:39)
        at sun.reflect.DelegatingMethodAccessorImpl.invoke
(DelegatingMethodAccessorImpl.java:25)
        at java.lang.reflect.Method.invoke(Method.java:585)
        at org.codehaus.classworlds.Launcher.launchEnhanced
(Launcher.java:315)
        at org.codehaus.classworlds.Launcher.launch(Launcher.java:255)
        at org.codehaus.classworlds.Launcher.mainWithExitCode
(Launcher.java:430)
        at org.codehaus.classworlds.Launcher.main(Launcher.java:375)
Caused by: org.apache.maven.plugin.MojoFailureException: Execution of '
mvn site --non-recursive ' resulted in a non-zero exit value: 1
        at org.apache.directory.daemon.installers.MojoHelperUtils.exec
(MojoHelperUtils.java:238)
        at
org.apache.directory.daemon.installers.ServiceInstallersMojo.generateDocs(ServiceInstallersMojo.java:559)
        at
org.apache.directory.daemon.installers.ServiceInstallersMojo.setupSourcesAndDocs(ServiceInstallersMojo.java:438)
        at
org.apache.directory.daemon.installers.ServiceInstallersMojo.execute
(ServiceInstallersMojo.java:183)
        at org.apache.maven.plugin.DefaultPluginManager.executeMojo
(DefaultPluginManager.java:415)
        at
org.apache.maven.lifecycle.DefaultLifecycleExecutor.executeGoals
(DefaultLifecycleExecutor.java:531)
        ... 16 more

Any ideas?

cheers,

John Conlon


Mime
View raw message