directory-dev mailing list archives

Site index · List index
Message view « Date » · « Thread »
Top « Date » · « Thread »
From Emmanuel Lecharny <elecha...@apache.org>
Subject Re: Build broken
Date Fri, 22 Apr 2005 06:58:03 GMT
Ok, you're close ! (switch to Linux ;-])

Just a bet : the tests are trying to talk to AD, or openldap, or
ADAM ... instead of apacheDS. Alex, any other ideas? It seems that the
server is OK, but the answers are not the expected ones.

I will try on my windows box this evening... (damn! How do you log on
windows? ;)

I also suggest that you switch to jdk 1.4.2_08, for security reasons
(http://secunia.com/advisories/13918/)



On Thu, 2005-04-21 at 20:18 -0400, chris@pegacat.com wrote:
> Morning Folks :-). 
> 
> > Excellent!  Thanks for confirming.  I hope our friend Chris can get things 
> > to build.
> 
> It's getting closer, but it still isn't there I'm afraid :-(.  I followed 
> Emmanuel's idea, and cleaned out the maven cache+repository, and blew away 
> my svn directory and rechecked out everything. 
> 
> However I still get the same build failed on line 217 / Column 9 error as 
> before.  Curiously though, *most* of the tests now run (previously the vast 
> majority failed on error). 
> 
> I'm using java 1.4.2_04, on Windows XP sp2... Any ideas? 
> 
>  --------8<--------------------
> Microsoft Windows XP [Version 5.1.2600]
> (C) Copyright 1985-2001 Microsoft Corp. 
> 
> C:\Documents and Settings\Chris>d: 
> 
> D:\>cd D:\java\apacheDS\svn_head\apacheds\trunk 
> 
> D:\java\apacheDS\svn_head\apacheds\trunk>maven multiproject:install
> __  __
> |  \/  |__ _Apache__ ___
> | |\/| / _` \ V / -_) ' \  ~ intelligent projects ~
> |_|  |_\__,_|\_/\___|_||_|  v. 1.0.2 
> 
> build:start: 
> 
> multiproject:install:
> multiproject:projects-init:
>    [echo] Gathering project list
> Starting the reactor...
> Our processing order:
> ApacheDS Shared
> ApacheDS Plugin
> ApacheDS Core
> ApacheDS Main
> +----------------------------------------
> | Gathering project list ApacheDS Shared
> | Memory: 4M/4M
> +----------------------------------------
> +----------------------------------------
> | Gathering project list ApacheDS Plugin
> | Memory: 4M/4M
> +----------------------------------------
> +----------------------------------------
> | Gathering project list ApacheDS Core
> | Memory: 4M/4M
> +----------------------------------------
> +----------------------------------------
> | Gathering project list ApacheDS Main
> | Memory: 4M/4M
> +----------------------------------------
> Starting the reactor...
> Our processing order:
> ApacheDS Shared
> ApacheDS Plugin
> ApacheDS Core
> ApacheDS Main
> +----------------------------------------
> | Executing multiproject:install-callback ApacheDS Shared
> | Memory: 4M/4M
> +----------------------------------------
> Attempting to download ldap-common-0.9-SNAPSHOT.jar.
> 280K downloaded 
> 
> multiproject:goal:
> build:start: 
> 
> multiproject:install-callback:
>    [echo] Running jar:install for ApacheDS Shared
> java:prepare-filesystem: 
> 
> java:compile:
>    [echo] Compiling to 
> D:\java\apacheDS\svn_head\apacheds\trunk\shared/target/c
> lasses
>    [echo]
> ========================================================== 
> 
>  NOTE: Targetting JVM 1.4, classes
>  will not run on earlier JVMs 
> 
> ========================================================== 
> 
> 
> java:jar-resources: 
> 
> test:prepare-filesystem: 
> 
> test:test-resources: 
> 
> test:compile:
>    [echo] No test source files to compile. 
> 
> test:test:
>    [echo] No tests to run.
> Copying: from 
> 'D:\java\apacheDS\svn_head\apacheds\trunk\shared\target\apacheds-s
> hared-0.9-SNAPSHOT.jar' to: 'C:\Documents and 
> Settings\Chris\.maven\repository\d
> irectory\jars\apacheds-shared-0.9-SNAPSHOT.jar'
> Copying: from 'D:\java\apacheDS\svn_head\apacheds\trunk\shared\project.xml' 
> to:
> 'C:\Documents and 
> Settings\Chris\.maven\repository\directory\poms\apacheds-share
> d-0.9-SNAPSHOT.pom'
> +----------------------------------------
> | Executing multiproject:install-callback ApacheDS Plugin
> | Memory: 5M/6M
> +----------------------------------------
> Attempting to download ldap-common-0.9-SNAPSHOT.jar.
> Attempting to download apacheds-shared-0.9-SNAPSHOT.jar. 
> 
> jar:jar: 
> 
> jar:install: 
> 
> 
> build:end: 
> 
> build:start: 
> 
> multiproject:install-callback:
> plugin:plugin:
> java:prepare-filesystem: 
> 
> java:compile:
> antlr:prepare-filesystem: 
> 
> antlr:generate: 
> 
>    [echo] Compiling to 
> D:\java\apacheDS\svn_head\apacheds\trunk\plugin/target/c
> lasses
>    [echo]
> ========================================================== 
> 
>  NOTE: Targetting JVM 1.4, classes
>  will not run on earlier JVMs 
> 
> ========================================================== 
> 
> 
> java:jar-resources: 
> 
> test:prepare-filesystem: 
> 
> test:test-resources: 
> 
> test:compile: 
> 
> test:test:
>    [junit] Running 
> org.apache.ldap.server.tools.schema.AttributeTypesTemplateTe
> st
>    [junit] Tests run: 7, Failures: 0, Errors: 0, Time elapsed: 1.344 sec
>    [junit] Running 
> org.apache.ldap.server.tools.schema.DirectorySchemaToolTest
>    [junit] Tests run: 1, Failures: 0, Errors: 0, Time elapsed: 0.703 sec
>    [junit] Running 
> org.apache.ldap.server.tools.schema.ObjectClassesTemplateTes
> t
>    [junit] Tests run: 7, Failures: 0, Errors: 0, Time elapsed: 1.016 sec
>    [junit] Running 
> org.apache.ldap.server.tools.schema.OpenLdapSchemaParserTest 
> 
>    [junit] Tests run: 14, Failures: 0, Errors: 0, Time elapsed: 0.437 sec
> Copying: from 
> 'D:\java\apacheDS\svn_head\apacheds\trunk\plugin\target\maven-dire
> ctory-plugin-0.9-SNAPSHOT.jar' to: 'C:\Documents and 
> Settings\Chris\.maven\repos
> itory\directory\plugins\maven-directory-plugin-0.9-SNAPSHOT.jar'
> Copying: from 'D:\java\apacheDS\svn_head\apacheds\trunk\plugin\project.xml' 
> to:
> 'C:\Documents and 
> Settings\Chris\.maven\repository\directory\poms\maven-director
> y-plugin-0.9-SNAPSHOT.pom'
> +----------------------------------------
> | Executing multiproject:install-callback ApacheDS Core
> | Memory: 12M/20M
> +----------------------------------------
> Attempting to download ldap-common-0.9-SNAPSHOT.jar.
> Attempting to download apacheds-shared-0.9-SNAPSHOT.jar.
> Attempting to download ldap-protocol-0.9-SNAPSHOT.jar.
> 35K downloaded
> Attempting to download asn1-codec-0.3-SNAPSHOT.jar.
> 29K downloaded
> Attempting to download apache-ldapber-provider-0.9-SNAPSHOT.jar.
> 152K downloaded
> Attempting to download asn1-ber-0.3-SNAPSHOT.jar.
> 88K downloaded
> Attempting to download mina-0.7-SNAPSHOT.jar.
> 198K downloaded
> Attempting to download maven-directory-plugin-0.9-SNAPSHOT.jar. 
> 
> jar:jar: 
> 
> 
> plugin:repository-install: 
> 
> 
> build:end: 
> 
> build:start: 
> 
> multiproject:install-callback:
>    [echo] Running jar:install for ApacheDS Core
> Attempting to download ldap-common-0.9-SNAPSHOT.jar.
> Attempting to download apacheds-shared-0.9-SNAPSHOT.jar.
> java:prepare-filesystem: 
> 
> java:compile:
> directory:schema:
> directory:init: 
> 
> directory:prepare-filesystem: 
> 
> directory:generate: 
> 
> 
>    [echo] Compiling to 
> D:\java\apacheDS\svn_head\apacheds\trunk\core/target/cla
> sses
> warning couldn't find aspectjrt.jar on classpath, checked: 
> 
> aspectj:init: 
> 
> aspectj:compile: 
> 
> 
> java:jar-resources: 
> 
> test:prepare-filesystem: 
> 
> test:test-resources: 
> 
> test:compile: 
> 
> test:test:
>    [junit] Running org.apache.ldap.server.authn.SimpleAuthenticationTest
>    [junit] Tests run: 9, Failures: 0, Errors: 4, Time elapsed: 3.141 sec
>    [junit] [ERROR] TEST 
> org.apache.ldap.server.authn.SimpleAuthenticationTest F
> AILED
>    [junit] Running org.apache.ldap.server.authz.AuthorizationServiceTest
>    [junit] Tests run: 8, Failures: 0, Errors: 8, Time elapsed: 0.078 sec
>    [junit] [ERROR] TEST 
> org.apache.ldap.server.authz.AuthorizationServiceTest F
> AILED
>    [junit] Running org.apache.ldap.server.exception.ExceptionServiceTest
>    [junit] Tests run: 21, Failures: 0, Errors: 21, Time elapsed: 0.11 sec
>    [junit] [ERROR] TEST 
> org.apache.ldap.server.exception.ExceptionServiceTest F
> AILED
>    [junit] Running org.apache.ldap.server.interceptor.ConfigurationTest
>    [junit] Tests run: 4, Failures: 0, Errors: 4, Time elapsed: 0.235 sec
>    [junit] [ERROR] TEST org.apache.ldap.server.interceptor.ConfigurationTest 
> FA
> ILED
>    [junit] Running org.apache.ldap.server.jndi.ComparatorNPEBugTest
>    [junit] Tests run: 2, Failures: 0, Errors: 0, Time elapsed: 2.438 sec
>    [junit] Running org.apache.ldap.server.jndi.CreateContextTest
>    [junit] Tests run: 2, Failures: 0, Errors: 2, Time elapsed: 0.031 sec
>    [junit] [ERROR] TEST org.apache.ldap.server.jndi.CreateContextTest FAILED
>    [junit] Running org.apache.ldap.server.jndi.DestroyContextTest
>    [junit] Tests run: 1, Failures: 0, Errors: 1, Time elapsed: 0.031 sec
>    [junit] [ERROR] TEST org.apache.ldap.server.jndi.DestroyContextTest 
> FAILED
>    [junit] Running org.apache.ldap.server.jndi.ImportConfirmationTest
>    [junit] Tests run: 1, Failures: 0, Errors: 1, Time elapsed: 0.016 sec
>    [junit] [ERROR] TEST org.apache.ldap.server.jndi.ImportConfirmationTest 
> FAIL
> ED
>    [junit] Running org.apache.ldap.server.jndi.ListTest
>    [junit] Tests run: 4, Failures: 0, Errors: 4, Time elapsed: 0.031 sec
>    [junit] [ERROR] TEST org.apache.ldap.server.jndi.ListTest FAILED
>    [junit] Running org.apache.ldap.server.jndi.ModifyContextTest
>    [junit] Tests run: 1, Failures: 0, Errors: 1, Time elapsed: 0.015 sec
>    [junit] [ERROR] TEST org.apache.ldap.server.jndi.ModifyContextTest FAILED
>    [junit] Running org.apache.ldap.server.jndi.ObjStateFactoryTest
>    [junit] Tests run: 2, Failures: 0, Errors: 2, Time elapsed: 0.016 sec
>    [junit] [ERROR] TEST org.apache.ldap.server.jndi.ObjStateFactoryTest 
> FAILED
>    [junit] Running org.apache.ldap.server.jndi.PartitionContextBuilderTest
>    [junit] Tests run: 8, Failures: 0, Errors: 0, Time elapsed: 0.172 sec
>    [junit] Running org.apache.ldap.server.jndi.RFC2713Tests
>    [junit] Tests run: 1, Failures: 0, Errors: 1, Time elapsed: 0.015 sec
>    [junit] [ERROR] TEST org.apache.ldap.server.jndi.RFC2713Tests FAILED
>    [junit] Running org.apache.ldap.server.jndi.RootDSETest
>    [junit] Tests run: 7, Failures: 0, Errors: 0, Time elapsed: 4.516 sec
>    [junit] Running org.apache.ldap.server.jndi.SearchContextTest
>    [junit] Tests run: 2, Failures: 0, Errors: 2, Time elapsed: 0.016 sec
>    [junit] [ERROR] TEST org.apache.ldap.server.jndi.SearchContextTest FAILED
>    [junit] Running org.apache.ldap.server.jndi.ServerContextFactoryTest
>    [junit] Tests run: 5, Failures: 0, Errors: 5, Time elapsed: 0.032 sec
>    [junit] [ERROR] TEST org.apache.ldap.server.jndi.ServerContextFactoryTest 
> FA
> ILED
>    [junit] Running org.apache.ldap.server.jndi.ServiceRegistryPassthruTest
>    [junit] Tests run: 2, Failures: 0, Errors: 2, Time elapsed: 0.172 sec
>    [junit] [ERROR] TEST 
> org.apache.ldap.server.jndi.ServiceRegistryPassthruTest
> FAILED
>    [junit] Running org.apache.ldap.server.jndi.ShutdownTest
>    [junit] Tests run: 2, Failures: 0, Errors: 2, Time elapsed: 0.031 sec
>    [junit] [ERROR] TEST org.apache.ldap.server.jndi.ShutdownTest FAILED
>    [junit] Running org.apache.ldap.server.jndi.SyncTest
>    [junit] Tests run: 2, Failures: 0, Errors: 2, Time elapsed: 0.031 sec
>    [junit] [ERROR] TEST org.apache.ldap.server.jndi.SyncTest FAILED
>    [junit] Running 
> org.apache.ldap.server.operational.BinaryAttributeFilterTest 
> 
>    [junit] Tests run: 1, Failures: 0, Errors: 1, Time elapsed: 0.015 sec
>    [junit] [ERROR] TEST 
> org.apache.ldap.server.operational.BinaryAttributeFilte
> rTest FAILED
>    [junit] Running 
> org.apache.ldap.server.operational.OperationalAttributeServi
> ceTest
>    [junit] Tests run: 3, Failures: 0, Errors: 3, Time elapsed: 0.031 sec
>    [junit] [ERROR] TEST 
> org.apache.ldap.server.operational.OperationalAttribute
> ServiceTest FAILED
>    [junit] Running org.apache.ldap.server.prefs.PreferencesUtilsTest
>    [junit] Tests run: 1, Failures: 0, Errors: 0, Time elapsed: 0.125 sec
>    [junit] Running org.apache.ldap.server.prefs.ServerPreferencesFactoryTest
>    [junit] Tests run: 1, Failures: 0, Errors: 1, Time elapsed: 0.016 sec
>    [junit] [ERROR] TEST 
> org.apache.ldap.server.prefs.ServerPreferencesFactoryTe
> st FAILED
>    [junit] Running org.apache.ldap.server.prefs.ServerSystemPreferencesTest
>    [junit] Tests run: 4, Failures: 0, Errors: 4, Time elapsed: 0.031 sec
>    [junit] [ERROR] TEST 
> org.apache.ldap.server.prefs.ServerSystemPreferencesTes
> t FAILED
>    [junit] Running 
> org.apache.ldap.server.schema.bootstrap.BootstrapSchemaLoade
> rTest
>    [junit] Tests run: 10, Failures: 0, Errors: 0, Time elapsed: 0.688 sec 
> 
> BUILD FAILED
> File...... C:\Documents and 
> Settings\Chris\.maven\cache\maven-multiproject-plugi
> n-1.3.1\plugin.jelly
> Element... maven:reactor
> Line...... 217
> Column.... 9
> Unable to obtain goal [multiproject:install-callback] -- C:\Documents and 
> Settin
> gs\Chris\.maven\cache\maven-test-plugin-1.6.2\plugin.jelly:181:54: <fail> 
> There
> were test failures.
> Total time: 2 minutes 10 seconds
> Finished at: Fri Apr 22 09:33:29 EST 2005 
> 
> D:\java\apacheDS\svn_head\apacheds\trunk>
> D:\java\apacheDS\svn_head\apacheds\trunk>cd ../.. 
> 
> D:\java\apacheDS\svn_head>cd .. 
> 
> D:\java\apacheDS>cd svn_head 
> 
> D:\java\apacheDS\svn_head>cd D:\java\apacheDS\svn_head\apacheds\trunk 
> 
> D:\java\apacheDS\svn_head\apacheds\trunk>java -version
> java version "1.4.2_04"
> Java(TM) 2 Runtime Environment, Standard Edition (build 1.4.2_04-b05)
> Java HotSpot(TM) Client VM (build 1.4.2_04-b05, mixed mode) 
> 
> D:\java\apacheDS\svn_head\apacheds\trunk>maven multiproject:install
> __  __
> |  \/  |__ _Apache__ ___
> | |\/| / _` \ V / -_) ' \  ~ intelligent projects ~
> |_|  |_\__,_|\_/\___|_||_|  v. 1.0.2 
> 
> Plugin cache will be regenerated
> Attempting to download junit-3.8.1.jar.
> 118K downloaded
> Attempting to download dom4j-1.4-dev-8.jar.
> 475K downloaded
> Attempting to download commons-jelly-20030902.160215.jar.
> 150K downloaded
> Attempting to download commons-jelly-tags-jsl-20030211.143151.jar.
> 14K downloaded
> Attempting to download commons-jelly-tags-log-20030211.142821.jar.
> 8K downloaded
> Attempting to download commons-jelly-tags-velocity-20030303.205659.jar.
> 7K downloaded
> Attempting to download commons-jelly-tags-xml-20040613.030723.jar.
> 33K downloaded
> Attempting to download commons-logging-1.0.3.jar.
> 30K downloaded
> Attempting to download velocity-1.4-dev.jar.
> 351K downloaded
> Attempting to download velocity-dvsl-0.45.jar.
> 25K downloaded
> Attempting to download xml-apis-1.0.b2.jar.
> 106K downloaded
> Attempting to download isorelax-20030108.jar.
> 188K downloaded
> Attempting to download jing-20030619.jar.
> 475K downloaded
> Attempting to download xerces-2.4.0.jar.
> 874K downloaded
> Attempting to download commons-io-20030203.000550.jar.
> 59K downloaded
> Attempting to download commons-net-1.1.0.jar.
> 139K downloaded
> Attempting to download commons-httpclient-2.0.jar.
> 217K downloaded
> Attempting to download commons-lang-2.0.jar.
> 165K downloaded
> Attempting to download jsch-0.1.5.jar.
> 79K downloaded
> build:start: 
> 
> multiproject:install:
> multiproject:projects-init:
>    [echo] Gathering project list
> Starting the reactor...
> Our processing order:
> ApacheDS Shared
> ApacheDS Plugin
> ApacheDS Core
> ApacheDS Main
> +----------------------------------------
> | Gathering project list ApacheDS Shared
> | Memory: 6M/8M
> +----------------------------------------
> +----------------------------------------
> | Gathering project list ApacheDS Plugin
> | Memory: 6M/8M
> +----------------------------------------
> +----------------------------------------
> | Gathering project list ApacheDS Core
> | Memory: 6M/8M
> +----------------------------------------
> +----------------------------------------
> | Gathering project list ApacheDS Main
> | Memory: 6M/8M
> +----------------------------------------
> Starting the reactor...
> Our processing order:
> ApacheDS Shared
> ApacheDS Plugin
> ApacheDS Core
> ApacheDS Main
> +----------------------------------------
> | Executing multiproject:install-callback ApacheDS Shared
> | Memory: 6M/8M
> +----------------------------------------
> Attempting to download ldap-common-0.9-SNAPSHOT.jar.
> 280K downloaded 
> 
> multiproject:goal:
> build:start: 
> 
> multiproject:install-callback:
>    [echo] Running jar:install for ApacheDS Shared
> Attempting to download commons-jelly-tags-antlr-20030211.143720.jar.
> 7K downloaded
> Attempting to download antlr-2.7.2.jar.
> 349K downloaded
> java:prepare-filesystem:
>    [mkdir] Created dir: 
> D:\java\apacheDS\svn_head\apacheds\trunk\shared\target\
> classes 
> 
> java:compile:
>    [echo] Compiling to 
> D:\java\apacheDS\svn_head\apacheds\trunk\shared/target/c
> lasses
>    [echo]
> ========================================================== 
> 
>  NOTE: Targetting JVM 1.4, classes
>  will not run on earlier JVMs 
> 
> ========================================================== 
> 
>    [javac] Compiling 3 source files to 
> D:\java\apacheDS\svn_head\apacheds\trunk
> \shared\target\classes 
> 
> java:jar-resources: 
> 
> test:prepare-filesystem:
>    [mkdir] Created dir: 
> D:\java\apacheDS\svn_head\apacheds\trunk\shared\target\
> test-classes
>    [mkdir] Created dir: 
> D:\java\apacheDS\svn_head\apacheds\trunk\shared\target\
> test-reports 
> 
> test:test-resources: 
> 
> test:compile:
>    [echo] No test source files to compile. 
> 
> test:test:
>    [echo] No tests to run. 
> 
> jar:jar:
>    [jar] Building jar: 
> D:\java\apacheDS\svn_head\apacheds\trunk\shared\target\a
> pacheds-shared-0.9-SNAPSHOT.jar
> Copying: from 
> 'D:\java\apacheDS\svn_head\apacheds\trunk\shared\target\apacheds-s
> hared-0.9-SNAPSHOT.jar' to: 'C:\Documents and 
> Settings\Chris\.maven\repository\d
> irectory\jars\apacheds-shared-0.9-SNAPSHOT.jar'
> Copying: from 'D:\java\apacheDS\svn_head\apacheds\trunk\shared\project.xml' 
> to:
> 'C:\Documents and 
> Settings\Chris\.maven\repository\directory\poms\apacheds-share
> d-0.9-SNAPSHOT.pom'
> +----------------------------------------
> | Executing multiproject:install-callback ApacheDS Plugin
> | Memory: 7M/12M
> +----------------------------------------
> Attempting to download ant-1.5.3-1.jar.
> 720K downloaded
> Attempting to download ldap-common-0.9-SNAPSHOT.jar.
> Attempting to download apacheds-shared-0.9-SNAPSHOT.jar.
> Attempting to download velocity-dep-1.4.jar.
> 505K downloaded
> Attempting to download commons-jelly-tags-xml-20030211.142705.jar.
> 31K downloaded
> Attempting to download commons-jelly-tags-interaction-20030211.143817.jar.
> 4K downloaded 
> 
> jar:install: 
> 
> 
> build:end: 
> 
> build:start: 
> 
> multiproject:install-callback:
> plugin:plugin:
> java:prepare-filesystem:
>    [mkdir] Created dir: 
> D:\java\apacheDS\svn_head\apacheds\trunk\plugin\target\
> classes 
> 
> java:compile:
> antlr:prepare-filesystem:
>    [mkdir] Created dir: 
> D:\java\apacheDS\svn_head\apacheds\trunk\plugin\target\
> antlr
> ANTLR Parser Generator   Version 2.7.2   1989-2003 jGuru.com 
> 
> antlr:generate: 
> 
>    [echo] Compiling to 
> D:\java\apacheDS\svn_head\apacheds\trunk\plugin/target/c
> lasses
>    [echo]
> ========================================================== 
> 
>  NOTE: Targetting JVM 1.4, classes
>  will not run on earlier JVMs 
> 
> ========================================================== 
> 
>    [javac] Compiling 11 source files to 
> D:\java\apacheDS\svn_head\apacheds\trun
> k\plugin\target\classes 
> 
> java:jar-resources:
> Copying 4 files to 
> D:\java\apacheDS\svn_head\apacheds\trunk\plugin\target\classe
> s
> Copying 4 files to 
> D:\java\apacheDS\svn_head\apacheds\trunk\plugin\target\classe
> s 
> 
> test:prepare-filesystem:
>    [mkdir] Created dir: 
> D:\java\apacheDS\svn_head\apacheds\trunk\plugin\target\
> test-classes
>    [mkdir] Created dir: 
> D:\java\apacheDS\svn_head\apacheds\trunk\plugin\target\
> test-reports 
> 
> test:test-resources:
> Copying 8 files to 
> D:\java\apacheDS\svn_head\apacheds\trunk\plugin\target\test-c
> lasses\org\apache\ldap\server\tools\schema 
> 
> test:compile:
>    [javac] Compiling 6 source files to 
> D:\java\apacheDS\svn_head\apacheds\trunk
> \plugin\target\test-classes 
> 
> test:test:
>    [junit] Running 
> org.apache.ldap.server.tools.schema.AttributeTypesTemplateTe
> st
>    [junit] Tests run: 7, Failures: 0, Errors: 0, Time elapsed: 1.109 sec
>    [junit] Running 
> org.apache.ldap.server.tools.schema.DirectorySchemaToolTest
>    [junit] Tests run: 1, Failures: 0, Errors: 0, Time elapsed: 0.719 sec
>    [junit] Running 
> org.apache.ldap.server.tools.schema.ObjectClassesTemplateTes
> t
>    [junit] Tests run: 7, Failures: 0, Errors: 0, Time elapsed: 1.969 sec
>    [junit] Running 
> org.apache.ldap.server.tools.schema.OpenLdapSchemaParserTest 
> 
>    [junit] Tests run: 14, Failures: 0, Errors: 0, Time elapsed: 0.469 sec 
> 
> jar:jar:
>    [jar] Building jar: 
> D:\java\apacheDS\svn_head\apacheds\trunk\plugin\target\m
> aven-directory-plugin-0.9-SNAPSHOT.jar
> Copying: from 
> 'D:\java\apacheDS\svn_head\apacheds\trunk\plugin\target\maven-dire
> ctory-plugin-0.9-SNAPSHOT.jar' to: 'C:\Documents and 
> Settings\Chris\.maven\repos
> itory\directory\plugins\maven-directory-plugin-0.9-SNAPSHOT.jar'
> Copying: from 'D:\java\apacheDS\svn_head\apacheds\trunk\plugin\project.xml' 
> to:
> 'C:\Documents and 
> Settings\Chris\.maven\repository\directory\poms\maven-director
> y-plugin-0.9-SNAPSHOT.pom'
> +----------------------------------------
> | Executing multiproject:install-callback ApacheDS Core
> | Memory: 15M/16M
> +----------------------------------------
> Attempting to download commons-collections-3.1.jar.
> 546K downloaded
> Attempting to download commons-primitives-20041207.202534.jar.
> 292K downloaded
> Attempting to download regexp-1.2.jar.
> 29K downloaded
> Attempting to download oro-2.0.7.jar.
> 63K downloaded
> Attempting to download commons-logging-1.0.jar.
> 21K downloaded
> Attempting to download commons-io-1.0.jar.
> 44K downloaded
> Attempting to download jdbm-0.20-dev.jar.
> 84K downloaded
> Attempting to download ldap-common-0.9-SNAPSHOT.jar.
> Attempting to download aspectjrt-1.2.jar.
> 34K downloaded
> Attempting to download apacheds-shared-0.9-SNAPSHOT.jar.
> Attempting to download ldap-protocol-0.9-SNAPSHOT.jar.
> 35K downloaded
> Attempting to download asn1-codec-0.3-SNAPSHOT.jar.
> 29K downloaded
> Attempting to download apache-ldapber-provider-0.9-SNAPSHOT.jar.
> 152K downloaded
> Attempting to download asn1-ber-0.3-SNAPSHOT.jar.
> 88K downloaded
> Attempting to download mina-0.7-SNAPSHOT.jar.
> 198K downloaded
> Attempting to download maven-directory-plugin-0.9-SNAPSHOT.jar. 
> 
> 
> plugin:repository-install: 
> 
> 
> build:end: 
> 
> build:start: 
> 
> multiproject:install-callback:
>    [echo] Running jar:install for ApacheDS Core
> java:prepare-filesystem:
>    [mkdir] Created dir: 
> D:\java\apacheDS\svn_head\apacheds\trunk\core\target\cl
> asses
> Attempting to download ldap-common-0.9-SNAPSHOT.jar.
> Attempting to download apacheds-shared-0.9-SNAPSHOT.jar. 
> 
> java:compile:
> directory:schema:
> directory:init: 
> 
> directory:prepare-filesystem:
>    [mkdir] Created dir: 
> D:\java\apacheDS\svn_head\apacheds\trunk\core\target\sc
> hema 
> 
> directory:generate:
>    [echo] Generated schema producer classes for apachedns.schema
>    [echo] Generated schema producer classes for autofs.schema
>    [echo] Generated schema producer classes for core.schema
>    [echo] Generated schema producer classes for cosine.schema
>    [echo] Generated schema producer classes for corba.schema
>    [echo] Generated schema producer classes for apache.schema
>    [echo] Generated schema producer classes for inetorgperson.schema
>    [echo] Generated schema producer classes for java.schema
>    [echo] Generated schema producer classes for krb5kdc.schema
>    [echo] Generated schema producer classes for nis.schema
>    [echo] Generated schema producer classes for system.schema
>    [echo] Generated schema producer classes for dhcp.schema
>    [echo] Generated schema producer classes for samba.schema
>    [touch] Creating 
> D:\java\apacheDS\svn_head\apacheds\trunk\core\target\schema
> \.flagfile 
> 
> 
>    [echo] Compiling to 
> D:\java\apacheDS\svn_head\apacheds\trunk\core/target/cla
> sses
>    [javac] Compiling 374 source files to 
> D:\java\apacheDS\svn_head\apacheds\tru
> nk\core\target\classes
> Attempting to download aspectjtools-1.2.jar.
> 5340K downloaded
> warning couldn't find aspectjrt.jar on classpath, checked: 
> 
> aspectj:init: 
> 
> aspectj:compile:
>    [iajc] Copying 7 files to 
> D:\java\apacheDS\svn_head\apacheds\trunk\core\targ
> et\classes 
> 
> 
> java:jar-resources: 
> 
> test:prepare-filesystem:
>    [mkdir] Created dir: 
> D:\java\apacheDS\svn_head\apacheds\trunk\core\target\te
> st-classes
>    [mkdir] Created dir: 
> D:\java\apacheDS\svn_head\apacheds\trunk\core\target\te
> st-reports 
> 
> test:test-resources: 
> 
> test:compile:
>    [javac] Compiling 26 source files to 
> D:\java\apacheDS\svn_head\apacheds\trun
> k\core\target\test-classes 
> 
> test:test:
>    [junit] Running org.apache.ldap.server.authn.SimpleAuthenticationTest
>    [junit] Tests run: 9, Failures: 0, Errors: 4, Time elapsed: 3.36 sec
>    [junit] [ERROR] TEST 
> org.apache.ldap.server.authn.SimpleAuthenticationTest F
> AILED
>    [junit] Running org.apache.ldap.server.authz.AuthorizationServiceTest
>    [junit] Tests run: 8, Failures: 0, Errors: 0, Time elapsed: 5.203 sec
>    [junit] Running org.apache.ldap.server.exception.ExceptionServiceTest
>    [junit] Tests run: 21, Failures: 0, Errors: 0, Time elapsed: 11.14 sec
>    [junit] Running org.apache.ldap.server.interceptor.ConfigurationTest
>    [junit] Tests run: 4, Failures: 0, Errors: 0, Time elapsed: 3.203 sec
>    [junit] Running org.apache.ldap.server.jndi.ComparatorNPEBugTest
>    [junit] Tests run: 2, Failures: 0, Errors: 0, Time elapsed: 1.891 sec
>    [junit] Running org.apache.ldap.server.jndi.CreateContextTest
>    [junit] Tests run: 2, Failures: 0, Errors: 0, Time elapsed: 2.781 sec
>    [junit] Running org.apache.ldap.server.jndi.DestroyContextTest
>    [junit] Tests run: 1, Failures: 0, Errors: 0, Time elapsed: 2.016 sec
>    [junit] Running org.apache.ldap.server.jndi.ImportConfirmationTest
>    [junit] Tests run: 1, Failures: 0, Errors: 0, Time elapsed: 1.922 sec
>    [junit] Running org.apache.ldap.server.jndi.ListTest
>    [junit] Tests run: 4, Failures: 0, Errors: 0, Time elapsed: 3.266 sec
>    [junit] Running org.apache.ldap.server.jndi.ModifyContextTest
>    [junit] Tests run: 1, Failures: 0, Errors: 0, Time elapsed: 2.422 sec
>    [junit] Running org.apache.ldap.server.jndi.ObjStateFactoryTest
>    [junit] Tests run: 2, Failures: 0, Errors: 0, Time elapsed: 2.39 sec
>    [junit] Running org.apache.ldap.server.jndi.PartitionContextBuilderTest
>    [junit] Tests run: 8, Failures: 0, Errors: 0, Time elapsed: 0.188 sec
>    [junit] Running org.apache.ldap.server.jndi.RFC2713Tests
>    [junit] Tests run: 1, Failures: 0, Errors: 0, Time elapsed: 1.921 sec
>    [junit] Running org.apache.ldap.server.jndi.RootDSETest
>    [junit] Tests run: 7, Failures: 0, Errors: 0, Time elapsed: 5.016 sec
>    [junit] Running org.apache.ldap.server.jndi.SearchContextTest
>    [junit] Tests run: 2, Failures: 0, Errors: 0, Time elapsed: 2.594 sec
>    [junit] Running org.apache.ldap.server.jndi.ServerContextFactoryTest
>    [junit] Tests run: 5, Failures: 0, Errors: 0, Time elapsed: 11.141 sec
>    [junit] Running org.apache.ldap.server.jndi.ServiceRegistryPassthruTest
>    [junit] Tests run: 2, Failures: 0, Errors: 0, Time elapsed: 3.25 sec
>    [junit] Running org.apache.ldap.server.jndi.ShutdownTest
>    [junit] Tests run: 2, Failures: 0, Errors: 0, Time elapsed: 2.469 sec
>    [junit] Running org.apache.ldap.server.jndi.SyncTest
>    [junit] Tests run: 2, Failures: 0, Errors: 2, Time elapsed: 0.047 sec
>    [junit] [ERROR] TEST org.apache.ldap.server.jndi.SyncTest FAILED
>    [junit] Running 
> org.apache.ldap.server.operational.BinaryAttributeFilterTest 
> 
>    [junit] Tests run: 1, Failures: 0, Errors: 1, Time elapsed: 0.015 sec
>    [junit] [ERROR] TEST 
> org.apache.ldap.server.operational.BinaryAttributeFilte
> rTest FAILED
>    [junit] Running 
> org.apache.ldap.server.operational.OperationalAttributeServi
> ceTest
>    [junit] Tests run: 3, Failures: 0, Errors: 3, Time elapsed: 0.047 sec
>    [junit] [ERROR] TEST 
> org.apache.ldap.server.operational.OperationalAttribute
> ServiceTest FAILED
>    [junit] Running org.apache.ldap.server.prefs.PreferencesUtilsTest
>    [junit] Tests run: 1, Failures: 0, Errors: 0, Time elapsed: 0.109 sec
>    [junit] Running org.apache.ldap.server.prefs.ServerPreferencesFactoryTest
>    [junit] Tests run: 1, Failures: 0, Errors: 1, Time elapsed: 0.015 sec
>    [junit] [ERROR] TEST 
> org.apache.ldap.server.prefs.ServerPreferencesFactoryTe
> st FAILED
>    [junit] Running org.apache.ldap.server.prefs.ServerSystemPreferencesTest
>    [junit] Tests run: 4, Failures: 0, Errors: 4, Time elapsed: 0.047 sec
>    [junit] [ERROR] TEST 
> org.apache.ldap.server.prefs.ServerSystemPreferencesTes
> t FAILED
>    [junit] Running 
> org.apache.ldap.server.schema.bootstrap.BootstrapSchemaLoade
> rTest
>    [junit] Tests run: 10, Failures: 0, Errors: 0, Time elapsed: 0.734 sec 
> 
> BUILD FAILED
> File...... C:\Documents and 
> Settings\Chris\.maven\cache\maven-multiproject-plugi
> n-1.3.1\plugin.jelly
> Element... maven:reactor
> Line...... 217
> Column.... 9
> Unable to obtain goal [multiproject:install-callback] -- C:\Documents and 
> Settin
> gs\Chris\.maven\cache\maven-test-plugin-1.6.2\plugin.jelly:181:54: <fail> 
> There
> were test failures.
> Total time: 9 minutes 5 seconds
> Finished at: Fri Apr 22 10:10:47 EST 2005 
> 
> D:\java\apacheDS\svn_head\apacheds\trunk>
> ---------------------------------------------------------------------------------------
> Wanadoo vous informe que cet  e-mail a ete controle par l'anti-virus mail. 
> Aucun virus connu a ce jour par nos services n'a ete detecte.
> 
> 



Mime
View raw message