directory-dev mailing list archives

Site index · List index
Message view « Date » · « Thread »
Top « Date » · « Thread »
From Emmanuel Lecharny <elecha...@apache.org>
Subject Re: Build broken (Was: Re: Getting There! (Was: Newbie qn de jour: how do I make the jar?))
Date Thu, 21 Apr 2005 22:42:29 GMT
On Thu, 2005-04-21 at 14:37 -0400, Alex Karasulu wrote:
> Looks like you have jdk 1.5 which makes build with this version of 
> aspectj freak out.  Is my guess correct.

Man, even if you were quite ill those last days, you didn't loose your
brain ! You guessed well. For some reasons, I switched to jdk1.5 two
weaks ago (I don't remember why).

So I tested the build again, after having changed JAVA_HOME and java
version, cleaned the .maven repository, and here is what I get (I'm
sorry to say that I get another error) :



maven multiproject:install

 __  __
|  \/  |__ _Apache__ ___
| |\/| / _` \ V / -_) ' \  ~ intelligent projects ~
|_|  |_\__,_|\_/\___|_||_|  v. 1.0.2

Attempting to download junit-3.8.1.jar.
118K downloaded
Attempting to download dom4j-1.4-dev-8.jar.
475K downloaded
Attempting to download commons-jelly-20030902.160215.jar.
150K downloaded
Attempting to download commons-jelly-tags-jsl-20030211.143151.jar.
14K downloaded
Attempting to download commons-jelly-tags-log-20030211.142821.jar.
8K downloaded
Attempting to download commons-jelly-tags-velocity-20030303.205659.jar.
7K downloaded
Attempting to download commons-jelly-tags-xml-20040613.030723.jar.
33K downloaded
Attempting to download commons-logging-1.0.3.jar.
30K downloaded
Attempting to download velocity-1.4-dev.jar.
351K downloaded
Attempting to download velocity-dvsl-0.45.jar.
25K downloaded
Attempting to download xml-apis-1.0.b2.jar.
106K downloaded
Attempting to download isorelax-20030108.jar.
188K downloaded
Attempting to download jing-20030619.jar.
475K downloaded
Attempting to download xerces-2.4.0.jar.
874K downloaded
Attempting to download commons-io-20030203.000550.jar.
59K downloaded
Attempting to download commons-net-1.1.0.jar.
139K downloaded
Attempting to download commons-httpclient-2.0.jar.
217K downloaded
Attempting to download commons-lang-2.0.jar.
165K downloaded
Attempting to download jsch-0.1.5.jar.
79K downloaded
build:start:

multiproject:install:
multiproject:projects-init:
    [echo] Gathering project list
Starting the reactor...
Our processing order:
ApacheDS Shared
ApacheDS Plugin
ApacheDS Core
ApacheDS Main
+----------------------------------------
| Gathering project list ApacheDS Shared
| Memory: 4M/5M
+----------------------------------------
+----------------------------------------
| Gathering project list ApacheDS Plugin
| Memory: 4M/5M
+----------------------------------------
+----------------------------------------
| Gathering project list ApacheDS Core
| Memory: 4M/5M
+----------------------------------------
+----------------------------------------
| Gathering project list ApacheDS Main
| Memory: 4M/5M
+----------------------------------------
Starting the reactor...
Our processing order:
ApacheDS Shared
ApacheDS Plugin
ApacheDS Core
ApacheDS Main
+----------------------------------------
| Executing multiproject:install-callback ApacheDS Shared
| Memory: 4M/5M
+----------------------------------------
Attempting to download ldap-common-0.9-SNAPSHOT.jar.
280K downloaded

multiproject:goal:
build:start:

multiproject:install-callback:
    [echo] Running jar:install for ApacheDS Shared
Attempting to download commons-jelly-tags-antlr-20030211.143720.jar.
7K downloaded
Attempting to download antlr-2.7.2.jar.
349K downloaded
java:prepare-filesystem:

java:compile:
    [echo] Compiling
to /home/elecharny/ttt/directory/apacheds/trunk/shared/target/classes
    [echo]
==========================================================

  NOTE: Targetting JVM 1.4, classes
  will not run on earlier JVMs

==========================================================


java:jar-resources:

test:prepare-filesystem:

test:test-resources:

test:compile:
    [echo] No test source files to compile.

test:test:
    [echo] No tests to run.
Copying: from
'/home/elecharny/ttt/directory/apacheds/trunk/shared/target/apacheds-
shared-0.9-SNAPSHOT.jar' to:
'/home/elecharny/.maven/repository/directory/jars/apacheds-shared-0.9-
SNAPSHOT.jar'
Copying: from
'/home/elecharny/ttt/directory/apacheds/trunk/shared/project.xml' to:
'/home/elecharny/.maven/repository/directory/poms/apacheds-shared-0.9-
SNAPSHOT.pom'
+----------------------------------------
| Executing multiproject:install-callback ApacheDS Plugin
| Memory: 4M/7M
+----------------------------------------
Attempting to download ant-1.5.3-1.jar.
720K downloaded
Attempting to download ldap-common-0.9-SNAPSHOT.jar.
Attempting to download apacheds-shared-0.9-SNAPSHOT.jar.
Attempting to download velocity-dep-1.4.jar.
505K downloaded
Attempting to download commons-jelly-tags-xml-20030211.142705.jar.
31K downloaded
Attempting to download commons-jelly-tags-
interaction-20030211.143817.jar.
4K downloaded

jar:jar:

jar:install:


build:end:

build:start:

multiproject:install-callback:
plugin:plugin:
java:prepare-filesystem:

java:compile:
antlr:prepare-filesystem:

antlr:generate:

    [echo] Compiling
to /home/elecharny/ttt/directory/apacheds/trunk/plugin/target/classes
    [echo]
==========================================================

  NOTE: Targetting JVM 1.4, classes
  will not run on earlier JVMs

==========================================================


BUILD FAILED
File...... /home/elecharny/.maven/cache/maven-multiproject-
plugin-1.3.1/plugin.jelly
Element... maven:reactor
Line...... 217
Column.... 9
Unable to obtain goal [multiproject:install-callback]
-- /home/elecharny/.maven/cache/maven-test-
plugin-1.6.2/plugin.jelly:133:41: <junit>
org/apache/ldap/server/tools/schema/OpenLdapSchemaParserTest
(Unsupported major.minor version 49.0)
Total time: 1 minutes 11 seconds
Finished at: Fri Apr 22 00:27:50 CEST 2005

> Alex
> 
> Emmanuel Lecharny wrote:
> 
> >Chris, 
> >
> >if you just need the jars, you can grab the last version right here :
> >
> >http://cvs.apache.org/repository/directory/jars/
> >
> >I've to go, office is waiting for me, but I gonna check what's happening
> >with the build this evening.
> >
> >
> >
> >On Thu, 2005-04-21 at 17:36 +1000, Chris Betts wrote:
> >  
> >
> >>Cool - at least I'm in good company :-)
> >>
> >>On 21/04/2005, at 5:30 PM, Emmanuel Lecharny wrote:
> >>
> >>    
> >>
> >>>Hi guys,
> >>>
> >>>here is what I get when trying to compile the whole stuff from
> >>>apacheds/trunk launching maven multiproject:install :
> >>>
> >>>
> >>>... (many lines) ...
> >>>
> >>>build:end:
> >>>
> >>>build:start:
> >>>
> >>>multiproject:install-callback:
> >>>    [echo] Running jar:install for ApacheDS Core
> >>>java:prepare-filesystem:
> >>>    [mkdir] Created
> >>>dir: /home/elecharny/ttt/directory/apacheds/trunk/core/target/classes
> >>>Attempting to download ldap-common-0.9-SNAPSHOT.jar.
> >>>Attempting to download apacheds-shared-0.9-SNAPSHOT.jar.
> >>>
> >>>java:compile:
> >>>directory:schema:
> >>>directory:init:
> >>>
> >>>directory:prepare-filesystem:
> >>>    [mkdir] Created
> >>>dir: /home/elecharny/ttt/directory/apacheds/trunk/core/target/schema
> >>>
> >>>directory:generate:
> >>>    [echo] Generated schema producer classes for apachedns.schema
> >>>    [echo] Generated schema producer classes for autofs.schema
> >>>    [echo] Generated schema producer classes for core.schema
> >>>    [echo] Generated schema producer classes for cosine.schema
> >>>    [echo] Generated schema producer classes for corba.schema
> >>>    [echo] Generated schema producer classes for apache.schema
> >>>    [echo] Generated schema producer classes for inetorgperson.schema
> >>>    [echo] Generated schema producer classes for java.schema
> >>>    [echo] Generated schema producer classes for krb5kdc.schema
> >>>    [echo] Generated schema producer classes for nis.schema
> >>>    [echo] Generated schema producer classes for system.schema
> >>>    [echo] Generated schema producer classes for dhcp.schema
> >>>    [echo] Generated schema producer classes for samba.schema
> >>>    [touch]
> >>>Creating  
> >>>/home/elecharny/ttt/directory/apacheds/trunk/core/target/schema/ 
> >>>.flagfile
> >>>
> >>>
> >>>    [echo] Compiling
> >>>to /home/elecharny/ttt/directory/apacheds/trunk/core/target/classes
> >>>    [javac] Compiling 374 source files
> >>>to /home/elecharny/ttt/directory/apacheds/trunk/core/target/classes
> >>>warning couldn't find aspectjrt.jar on classpath, checked:
> >>>
> >>>/home/elecharny/ttt/directory/apacheds/trunk/core/src/main/java/org/ 
> >>>apache/ldap/server/db/gui/EntryNode.java:191 error The type  
> >>>AbstractStringBuilder is not visible
> >>>buf.append( "(" ).append( id ).append( ") " );
> >>>^^^^
> >>>/home/elecharny/ttt/directory/apacheds/trunk/core/src/main/java/org/ 
> >>>apache/ldap/server/db/gui/EntryNode.java:202 error The type  
> >>>AbstractStringBuilder is not visible
> >>>buf.append( " [" ).append( children.size() ).append( "]" );
> >>>^^^^^
> >>>/home/elecharny/ttt/directory/apacheds/trunk/core/src/main/java/org/ 
> >>>apache/ldap/server/authn/AuthenticatorConfigBuilder.java:67 error The  
> >>>type AbstractStringBuilder is not visible
> >>>buf.append( EnvKeys.AUTHENTICATOR_CLASS ).append( authenticatorName );
> >>>^^^^^^^^^^^^^^^^^^^^^^^^^^^^^^^^
> >>>/home/elecharny/ttt/directory/apacheds/trunk/core/src/main/java/org/ 
> >>>apache/ldap/server/authn/AuthenticatorConfigBuilder.java:80 error The  
> >>>type AbstractStringBuilder is not visible
> >>>buf.append( EnvKeys.AUTHENTICATOR_PROPERTIES ).append
> >>>( authenticatorName );
> >>>^^^^^^^^^^^^^^^^^^^^^^^^^^^^^^^^^^^^^
> >>>/home/elecharny/ttt/directory/apacheds/trunk/core/src/main/java/org/ 
> >>>apache/ldap/server/jndi/PartitionConfigBuilder.java:72 error The type  
> >>>AbstractStringBuilder is not visible
> >>>buf.append( EnvKeys.SUFFIX ).append( id );
> >>>^^^^^^^^^^^^^^^^^^^
> >>>/home/elecharny/ttt/directory/apacheds/trunk/core/src/main/java/org/ 
> >>>apache/ldap/server/jndi/PartitionConfigBuilder.java:89 error The type  
> >>>AbstractStringBuilder is not visible
> >>>buf.append( EnvKeys.PARTITION_CLASS ).append( id );
> >>>^^^^^^^^^^^^^^^^^^^^^^^^^^^^
> >>>/home/elecharny/ttt/directory/apacheds/trunk/core/src/main/java/org/ 
> >>>apache/ldap/server/jndi/PartitionConfigBuilder.java:104 error The type  
> >>>AbstractStringBuilder is not visible
> >>>buf.append( EnvKeys.PARTITION_PROPERTIES ).append( id );
> >>>^^^^^^^^^^^^^^^^^^^^^^^^^^^^^^^^^
> >>>/home/elecharny/ttt/directory/apacheds/trunk/core/src/main/java/org/ 
> >>>apache/ldap/server/jndi/PartitionConfigBuilder.java:119 error The type  
> >>>AbstractStringBuilder is not visible
> >>>buf.append( EnvKeys.INDICES ).append( id );
> >>>^^^^^^^^^^^^^^^^^^^^
> >>>/home/elecharny/ttt/directory/apacheds/trunk/core/src/main/java/org/ 
> >>>apache/ldap/server/jndi/PartitionConfigBuilder.java:140 error The type  
> >>>AbstractStringBuilder is not visible
> >>>buf.append( EnvKeys.ATTRIBUTES ).append( id );
> >>>^^^^^^^^^^^^^^^^^^^^^^^
> >>>aspectj:init:
> >>>
> >>>aspectj:compile:
> >>>    [iajc] Copying 7 files
> >>>to /home/elecharny/ttt/directory/apacheds/trunk/core/target/classes
> >>>MessageHolder:  (1 warning)  (9 error)
> >>>[error   0]: error at buf.append( "(" ).append( id ).append( ") " );
> >>>^^^^
> >>>/home/elecharny/ttt/directory/apacheds/trunk/core/src/main/java/org/ 
> >>>apache/ldap/server/db/gui/EntryNode.java:191:0 The type  
> >>>AbstractStringBuilder is not visible[error   1]: error at buf.append(  
> >>>" [" ).append( children.size() ).append( "]" );
> >>>^^^^^
> >>>/home/elecharny/ttt/directory/apacheds/trunk/core/src/main/java/org/ 
> >>>apache/ldap/server/db/gui/EntryNode.java:202:0 The type  
> >>>AbstractStringBuilder is not visible[error   2]: error at buf.append(  
> >>>EnvKeys.AUTHENTICATOR_CLASS ).append( authenticatorName );
> >>>^^^^^^^^^^^^^^^^^^^^^^^^^^^^^^^^
> >>>/home/elecharny/ttt/directory/apacheds/trunk/core/src/main/java/org/ 
> >>>apache/ldap/server/authn/AuthenticatorConfigBuilder.java:67:0 The type  
> >>>AbstractStringBuilder is not visible
> >>>[error   3]: error at buf.append
> >>>( EnvKeys.AUTHENTICATOR_PROPERTIES ).append( authenticatorName );
> >>>^^^^^^^^^^^^^^^^^^^^^^^^^^^^^^^^^^^^^
> >>>/home/elecharny/ttt/directory/apacheds/trunk/core/src/main/java/org/ 
> >>>apache/ldap/server/authn/AuthenticatorConfigBuilder.java:80:0 The type  
> >>>AbstractStringBuilder is not visible
> >>>[error   4]: error at buf.append( EnvKeys.SUFFIX ).append( id );
> >>>^^^^^^^^^^^^^^^^^^^
> >>>/home/elecharny/ttt/directory/apacheds/trunk/core/src/main/java/org/ 
> >>>apache/ldap/server/jndi/PartitionConfigBuilder.java:72:0 The type  
> >>>AbstractStringBuilder is not visible
> >>>[error   5]: error at buf.append( EnvKeys.PARTITION_CLASS ).append
> >>>( id );
> >>>^^^^^^^^^^^^^^^^^^^^^^^^^^^^
> >>>/home/elecharny/ttt/directory/apacheds/trunk/core/src/main/java/org/ 
> >>>apache/ldap/server/jndi/PartitionConfigBuilder.java:89:0 The type  
> >>>AbstractStringBuilder is not visible
> >>>[error   6]: error at buf.append( EnvKeys.PARTITION_PROPERTIES ).append
> >>>( id );
> >>>^^^^^^^^^^^^^^^^^^^^^^^^^^^^^^^^^
> >>>/home/elecharny/ttt/directory/apacheds/trunk/core/src/main/java/org/ 
> >>>apache/ldap/server/jndi/PartitionConfigBuilder.java:104:0 The type  
> >>>AbstractStringBuilder is not visible
> >>>[error   7]: error at buf.append( EnvKeys.INDICES ).append( id );
> >>>^^^^^^^^^^^^^^^^^^^^
> >>>/home/elecharny/ttt/directory/apacheds/trunk/core/src/main/java/org/ 
> >>>apache/ldap/server/jndi/PartitionConfigBuilder.java:119:0 The type  
> >>>AbstractStringBuilder is not visible
> >>>[error   8]: error at buf.append( EnvKeys.ATTRIBUTES ).append( id );
> >>>^^^^^^^^^^^^^^^^^^^^^^^
> >>>/home/elecharny/ttt/directory/apacheds/trunk/core/src/main/java/org/ 
> >>>apache/ldap/server/jndi/PartitionConfigBuilder.java:140:0 The type  
> >>>AbstractStringBuilder is not visible
> >>>
> >>>BUILD FAILED
> >>>File...... /home/elecharny/.maven/cache/maven-multiproject-
> >>>plugin-1.3.1/plugin.jelly
> >>>Element... maven:reactor
> >>>Line...... 217
> >>>Column.... 9
> >>>Unable to obtain goal [multiproject:install-callback]
> >>>-- /home/elecharny/.maven/cache/maven-aspectj-
> >>>plugin-3.2/plugin.jelly:59:40: <ant:iajc> 9 errors
> >>>Total time: 1 minutes 14 seconds
> >>>Finished at: Thu Apr 21 09:24:42 CEST 2005
> >>>
> >>>
> >>>On Thu, 2005-04-21 at 11:26 +0900, Trustin Lee wrote:
> >>>      
> >>>
> >>>>Hi,
> >>>>
> >>>>I tried to build apacheds-core from scratch, and it compiles without
> >>>>any errors and all test pass.  Strange...
> >>>>
> >>>>Trustin
> >>>>
> >>>>2005/4/21, Alex Karasulu <aok123@bellsouth.net>:
> >>>>        
> >>>>
> >>>>>Ok Chris I just updated my entire directory trunk and found that
the
> >>>>>buid is broken so tests would fail too.   Here's what I get ..
> >>>>>
> >>>>>[root@kerberos trunk]# java -version
> >>>>>java version "1.4.2_07"
> >>>>>Java(TM) 2 Runtime Environment, Standard Edition (build 1.4.2_07-b05)
> >>>>>Java HotSpot(TM) Client VM (build 1.4.2_07-b05, mixed mode)
> >>>>>[root@kerberos trunk]# maven multiproject:install
> >>>>>
> >>>>>...
> >>>>>
> >>>>>build:start:
> >>>>>
> >>>>>............................................
> >>>>>
> >>>>>In the core build I get the following ...
> >>>>>
> >>>>>    [echo] Compiling to  
> >>>>>/root/directory/apacheds/trunk/core/target/classes
> >>>>>    [javac] Compiling 340 source files to
> >>>>>/root/directory/apacheds/trunk/core/target/classes
> >>>>>/root/directory/apacheds/trunk/core/src/main/java/org/apache/ldap/

> >>>>>server/jndi/JndiProvider.java:171:
> >>>>>process(org.apache.ldap.server.interceptor.NextInterceptor,org.apache

> >>>>>.ldap.server.invocation.Invocation)
> >>>>>in org.apache.ldap.server.interceptor.Interceptor cannot be applied
 
> >>>>>to
> >>>>>(<nulltype>,org.apache.ldap.server.jndi.Invocation)
> >>>>>        interceptor.process( null, call );
> >>>>>                   ^
> >>>>>/root/directory/apacheds/trunk/core/src/main/java/org/apache/ldap/

> >>>>>server/jndi/JndiProvider.java:195:
> >>>>>invoke(org.apache.ldap.server.jndi.Invocation) in
> >>>>>org.apache.ldap.server.jndi.JndiProvider cannot be applied to
> >>>>>(org.apache.ldap.server.invocation.GetMatchedDN)
> >>>>>            return ( Name ) JndiProvider.this.invoke( new  
> >>>>>GetMatchedDN(
> >>>>>dn, normalized ) );
> >>>>>                                        ^
> >>>>>/root/directory/apacheds/trunk/core/src/main/java/org/apache/ldap/

> >>>>>server/jndi/JndiProvider.java:199:
> >>>>>invoke(org.apache.ldap.server.jndi.Invocation) in
> >>>>>org.apache.ldap.server.jndi.JndiProvider cannot be applied to
> >>>>>(org.apache.ldap.server.invocation.GetSuffix)
> >>>>>            return ( Name ) JndiProvider.this.invoke( new GetSuffix(
 
> >>>>>dn,
> >>>>>normalized ) );
> >>>>>                                        ^
> >>>>>/root/directory/apacheds/trunk/core/src/main/java/org/apache/ldap/

> >>>>>server/jndi/JndiProvider.java:203:
> >>>>>invoke(org.apache.ldap.server.jndi.Invocation) in
> >>>>>org.apache.ldap.server.jndi.JndiProvider cannot be applied to
> >>>>>(org.apache.ldap.server.invocation.ListSuffixes)
> >>>>>            return ( Iterator ) JndiProvider.this.invoke( new
> >>>>>ListSuffixes( normalized ) );
> >>>>>                                            ^
> >>>>>/root/directory/apacheds/trunk/core/src/main/java/org/apache/ldap/

> >>>>>server/jndi/JndiProvider.java:215:
> >>>>>invoke(org.apache.ldap.server.jndi.Invocation) in
> >>>>>org.apache.ldap.server.jndi.JndiProvider cannot be applied to
> >>>>>(org.apache.ldap.server.invocation.Delete)
> >>>>>            JndiProvider.this.invoke( new Delete( name ) );
> >>>>>                        ^
> >>>>>/root/directory/apacheds/trunk/core/src/main/java/org/apache/ldap/

> >>>>>server/jndi/JndiProvider.java:219:
> >>>>>invoke(org.apache.ldap.server.jndi.Invocation) in
> >>>>>org.apache.ldap.server.jndi.JndiProvider cannot be applied to
> >>>>>(org.apache.ldap.server.invocation.Add)
> >>>>>            JndiProvider.this.invoke( new Add( upName, normName,
 
> >>>>>entry ) );
> >>>>>                        ^
> >>>>>/root/directory/apacheds/trunk/core/src/main/java/org/apache/ldap/

> >>>>>server/jndi/JndiProvider.java:223:
> >>>>>invoke(org.apache.ldap.server.jndi.Invocation) in
> >>>>>org.apache.ldap.server.jndi.JndiProvider cannot be applied to
> >>>>>(org.apache.ldap.server.invocation.Modify)
> >>>>>            JndiProvider.this.invoke( new Modify( name, modOp, mods
 
> >>>>>) );
> >>>>>                        ^
> >>>>>/root/directory/apacheds/trunk/core/src/main/java/org/apache/ldap/

> >>>>>server/jndi/JndiProvider.java:227:
> >>>>>invoke(org.apache.ldap.server.jndi.Invocation) in
> >>>>>org.apache.ldap.server.jndi.JndiProvider cannot be applied to
> >>>>>(org.apache.ldap.server.invocation.ModifyMany)
> >>>>>            JndiProvider.this.invoke( new ModifyMany( name, mods
) );
> >>>>>                        ^
> >>>>>/root/directory/apacheds/trunk/core/src/main/java/org/apache/ldap/

> >>>>>server/jndi/JndiProvider.java:231:
> >>>>>invoke(org.apache.ldap.server.jndi.Invocation) in
> >>>>>org.apache.ldap.server.jndi.JndiProvider cannot be applied to
> >>>>>(org.apache.ldap.server.invocation.List)
> >>>>>            return ( NamingEnumeration ) JndiProvider.this.invoke(
 
> >>>>>new
> >>>>>List( base ) );
> >>>>>                                                     ^
> >>>>>/root/directory/apacheds/trunk/core/src/main/java/org/apache/ldap/

> >>>>>server/jndi/JndiProvider.java:235:
> >>>>>invoke(org.apache.ldap.server.jndi.Invocation) in
> >>>>>org.apache.ldap.server.jndi.JndiProvider cannot be applied to
> >>>>>(org.apache.ldap.server.invocation.Search)
> >>>>>            return ( NamingEnumeration ) JndiProvider.this.invoke(
 
> >>>>>new
> >>>>>Search( base, env, filter, searchCtls ) );
> >>>>>                                                     ^
> >>>>>/root/directory/apacheds/trunk/core/src/main/java/org/apache/ldap/

> >>>>>server/jndi/JndiProvider.java:239:
> >>>>>invoke(org.apache.ldap.server.jndi.Invocation) in
> >>>>>org.apache.ldap.server.jndi.JndiProvider cannot be applied to
> >>>>>(org.apache.ldap.server.invocation.Lookup)
> >>>>>            return ( Attributes ) JndiProvider.this.invoke( new 

> >>>>>Lookup(
> >>>>>name ) );
> >>>>>                                              ^
> >>>>>/root/directory/apacheds/trunk/core/src/main/java/org/apache/ldap/

> >>>>>server/jndi/JndiProvider.java:243:
> >>>>>invoke(org.apache.ldap.server.jndi.Invocation) in
> >>>>>org.apache.ldap.server.jndi.JndiProvider cannot be applied to
> >>>>>(org.apache.ldap.server.invocation.LookupWithAttrIds)
> >>>>>            return ( Attributes ) JndiProvider.this.invoke( new
> >>>>>LookupWithAttrIds( dn, attrIds ) );
> >>>>>                                              ^
> >>>>>/root/directory/apacheds/trunk/core/src/main/java/org/apache/ldap/

> >>>>>server/jndi/JndiProvider.java:247:
> >>>>>invoke(org.apache.ldap.server.jndi.Invocation) in
> >>>>>org.apache.ldap.server.jndi.JndiProvider cannot be applied to
> >>>>>(org.apache.ldap.server.invocation.HasEntry)
> >>>>>            return Boolean.TRUE.equals( JndiProvider.this.invoke(
new
> >>>>>HasEntry(name ) ) );
> >>>>>                                                    ^
> >>>>>/root/directory/apacheds/trunk/core/src/main/java/org/apache/ldap/

> >>>>>server/jndi/JndiProvider.java:251:
> >>>>>invoke(org.apache.ldap.server.jndi.Invocation) in
> >>>>>org.apache.ldap.server.jndi.JndiProvider cannot be applied to
> >>>>>(org.apache.ldap.server.invocation.IsSuffix)
> >>>>>            return Boolean.TRUE.equals( JndiProvider.this.invoke(
new
> >>>>>IsSuffix(name ) ) );
> >>>>>                                                    ^
> >>>>>/root/directory/apacheds/trunk/core/src/main/java/org/apache/ldap/

> >>>>>server/jndi/JndiProvider.java:255:
> >>>>>invoke(org.apache.ldap.server.jndi.Invocation) in
> >>>>>org.apache.ldap.server.jndi.JndiProvider cannot be applied to
> >>>>>(org.apache.ldap.server.invocation.ModifyRN)
> >>>>>            JndiProvider.this.invoke( new ModifyRN( name, newRn,
> >>>>>deleteOldRn ) );
> >>>>>                        ^
> >>>>>/root/directory/apacheds/trunk/core/src/main/java/org/apache/ldap/

> >>>>>server/jndi/JndiProvider.java:259:
> >>>>>invoke(org.apache.ldap.server.jndi.Invocation) in
> >>>>>org.apache.ldap.server.jndi.JndiProvider cannot be applied to
> >>>>>(org.apache.ldap.server.invocation.Move)
> >>>>>            JndiProvider.this.invoke( new Move( oriChildName,
> >>>>>newParentName ) );
> >>>>>                        ^
> >>>>>/root/directory/apacheds/trunk/core/src/main/java/org/apache/ldap/

> >>>>>server/jndi/JndiProvider.java:263:
> >>>>>invoke(org.apache.ldap.server.jndi.Invocation) in
> >>>>>org.apache.ldap.server.jndi.JndiProvider cannot be applied to
> >>>>>(org.apache.ldap.server.invocation.MoveAndModifyRN)
> >>>>>            JndiProvider.this.invoke( new MoveAndModifyRN(  
> >>>>>oriChildName,
> >>>>>newParentName, newRn, deleteOldRn ) );
> >>>>>                        ^
> >>>>>17 errors
> >>>>>
> >>>>>BUILD FAILED
> >>>>>File......  
> >>>>>/root/.maven/cache/maven-multiproject-plugin-1.3.1/plugin.jelly
> >>>>>Element... maven:reactor
> >>>>>Line...... 217
> >>>>>Column.... 9
> >>>>>Unable to obtain goal [multiproject:install-callback] --
> >>>>>/root/.maven/cache/maven-java-plugin-1.5/plugin.jelly:63:48:  
> >>>>><ant:javac>
> >>>>>Compile failed; see the compiler error output for details.
> >>>>>Total time: 56 seconds
> >>>>>
> >>>>>Trustin you think any of this is related to the changes made within
 
> >>>>>the
> >>>>>interceptor framework?
> >>>>>
> >>>>>Alex
> >>>>>
> >>>>>
> >>>>>          
> >>>>>
> >>>>        
> >>>>
> >>>      
> >>>
> >>---------------------------------------------------------------------------------------
> >>Wanadoo vous informe que cet  e-mail a ete controle par l'anti-virus mail. 
> >>Aucun virus connu a ce jour par nos services n'a ete detecte.
> >>
> >>
> >>    
> >>
> >
> >
> >
> >  
> >
> 
> ---------------------------------------------------------------------------------------
> Wanadoo vous informe que cet  e-mail a ete controle par l'anti-virus mail. 
> Aucun virus connu a ce jour par nos services n'a ete detecte.
> 
> 



Mime
View raw message