directory-dev mailing list archives

Site index · List index
Message view « Date » · « Thread »
Top « Date » · « Thread »
From Brett Porter <br...@apache.org>
Subject Re: [GUMP@brutus]: Project apseda (in module apseda) failed
Date Sat, 12 Feb 2005 10:41:13 GMT
Back to test failures :)

I'm poking the gump list about this to see why we can't get through on 
that set of ports.

- Brett

Apache SEDA development wrote:

>To whom it may engage...
>        
>This is an automated request, but not an unsolicited one. For 
>more information please visit http://gump.apache.org/nagged.html, 
>and/or contact the folk at general@gump.apache.org.
>
>Project apseda has an issue affecting its community integration.
>This issue affects 2 projects,
> and has been outstanding for 6 runs.
>The current state of this project is 'Failed', with reason 'Build Failed'.
>For reference only, the following projects are affected by this:
>    - apacheds-protocol :  Apache Directory Server
>    - apseda :  An internet protocol server framework
>
>
>Full details are available at:
>    http://brutus.apache.org/gump/public/apseda/apseda/index.html
>
>That said, some information snippets are provided here.
>
>The following annotations (debug/informational/warning/error messages) were provided:
> -DEBUG- Sole output [apseda-12022005.jar] identifier set to project name
> -DEBUG- (Gump generated) Maven Properties in: /usr/local/gump/public/workspace/apseda/build.properties
> -INFO- Failed with reason build failed
> -DEBUG- Maven POM in: /usr/local/gump/public/workspace/apseda/project.xml
> -DEBUG- Maven project properties in: /usr/local/gump/public/workspace/apseda/project.properties
> -INFO- Project Reports in: /usr/local/gump/public/workspace/apseda/target/test-reports
> -DEBUG- Extracted fallback artifacts from Gump Repository
>
>
>
>The following work was performed:
>http://brutus.apache.org/gump/public/apseda/apseda/gump_work/build_apseda_apseda.html
>Work Name: build_apseda_apseda (Type: Build)
>Work ended in a state of : Failed
>Elapsed: 21 secs
>Command Line: maven --offline jar 
>[Working Directory: /usr/local/gump/public/workspace/apseda]
>CLASSPATH: /opt/jdk1.4/lib/tools.jar:/usr/local/gump/public/workspace/asn1/codec/target/asn1-codec-12022005.jar:/usr/local/gump/public/workspace/jakarta-commons/logging/dist/commons-logging.jar:/usr/local/gump/public/workspace/jakarta-commons/logging/dist/commons-logging-api.jar:/usr/local/gump/public/workspace/ant/dist/lib/ant-jmf.jar:/usr/local/gump/public/workspace/ant/dist/lib/ant-swing.jar:/usr/local/gump/public/workspace/ant/dist/lib/ant-apache-resolver.jar:/usr/local/gump/public/workspace/ant/dist/lib/ant-trax.jar:/usr/local/gump/public/workspace/ant/dist/lib/ant-junit.jar:/usr/local/gump/public/workspace/ant/dist/lib/ant-launcher.jar:/usr/local/gump/public/workspace/ant/dist/lib/ant-nodeps.jar:/usr/local/gump/public/workspace/ant/dist/lib/ant.jar:/usr/local/gump/public/workspace/dist/junit/junit.jar:/usr/local/gump/public/workspace/xml-commons/java/build/resolver.jar:/usr/local/gump/public/workspace/ant/bootstrap/lib/ant-launcher.jar:/usr/local/gump/public/workspace/ant/bootstrap/lib/ant.jar:/usr/local/gump/public/workspace/jakarta-commons/net/dist/commons-net-12022005.jar
>---------------------------------------------
>    [javac] Compiling 124 source files to /home/gump/workspaces2/public/workspace/apseda/target/classes
>
>java:jar-resources:
>Copying 3 files to /home/gump/workspaces2/public/workspace/apseda/target/classes/META-INF
>
>test:prepare-filesystem:
>    [mkdir] Created dir: /home/gump/workspaces2/public/workspace/apseda/target/test-classes
>    [mkdir] Created dir: /home/gump/workspaces2/public/workspace/apseda/target/test-reports
>
>test:test-resources:
>
>test:compile:
>    [javac] Compiling 11 source files to /home/gump/workspaces2/public/workspace/apseda/target/test-classes
>
>test:test:
>    [junit] Running org.apache.apseda.event.AbstractSubscriberTest
>    [junit] Tests run: 4, Failures: 0, Errors: 0, Time elapsed: 0.034 sec
>    [junit] Running org.apache.apseda.event.DefaultStageTest
>    [junit] Tests run: 5, Failures: 0, Errors: 0, Time elapsed: 1.031 sec
>    [junit] Running org.apache.apseda.decoder.DefaultDecoderManagerTest
>    [junit] Tests run: 13, Failures: 0, Errors: 0, Time elapsed: 1.922 sec
>    [junit] Running org.apache.apseda.listener.TCPListenerManagerTest
>    [junit] Tests run: 2, Failures: 0, Errors: 0, Time elapsed: 0.411 sec
>    [junit] Running org.apache.apseda.listener.AvailablePortFinderTest
>    [junit] Tests run: 3, Failures: 0, Errors: 0, Time elapsed: 0.021 sec
>    [junit] Running org.apache.apseda.buffer.DefaultBufferPoolTest
>    [junit] Tests run: 7, Failures: 0, Errors: 0, Time elapsed: 0.034 sec
>    [junit] Running org.apache.apseda.examples.DiscardProtocolProviderTest
>    [junit] Tests run: 2, Failures: 0, Errors: 1, Time elapsed: 3.099 sec
>    [junit] [ERROR] TEST org.apache.apseda.examples.DiscardProtocolProviderTest FAILED
>    [junit] Running org.apache.apseda.examples.EchoProtocolProviderTest
>    [junit] Tests run: 2, Failures: 0, Errors: 0, Time elapsed: 3.227 sec
>    [junit] Running org.apache.apseda.HexDumpTest
>  
>00000000:  48 65 6c 6c 6f 20 57 6f   72 6c 64 20 74 68 69 73   
>00000010:  20 69 73 20 74 68 65 20   68 65 78 20 64 75 6d 70   
>00000020:  20 74 6f 6f 6c 
>    [junit] Tests run: 1, Failures: 0, Errors: 0, Time elapsed: 0.01 sec
>    [junit] Running org.apache.apseda.DefaultFrontendFactoryTest
>    [junit] Tests run: 3, Failures: 0, Errors: 0, Time elapsed: 4.439 sec
>
>BUILD FAILED
>File...... /home/gump/.maven/cache/maven-test-plugin-1.6.2/plugin.jelly
>Element... fail
>Line...... 181
>Column.... 54
>There were test failures.
>Total time: 21 seconds
>Finished at: Sat Feb 12 02:01:36 PST 2005
>
>---------------------------------------------
>
>To subscribe to this information via syndicated feeds:
>- RSS: http://brutus.apache.org/gump/public/apseda/apseda/rss.xml
>- Atom: http://brutus.apache.org/gump/public/apseda/apseda/atom.xml
>
>============================== Gump Tracking Only ===
>Produced by Gump version 2.2.
>Gump Run 19000012022005, brutus:brutus-public:19000012022005
>Gump E-mail Identifier (unique within run) #21.
>
>--
>Apache Gump
>http://gump.apache.org/ [Instance: brutus]
>
>
>  
>



Mime
View raw message