directory-dev mailing list archives

Site index · List index
Message view « Date » · « Thread »
Top « Date » · « Thread »
From Emmanuel LECHARNY <e.lecha...@wanadoo.fr>
Subject Some build problems...
Date Tue, 08 Feb 2005 01:19:17 GMT
Hi,

I just tried a script to set up my env, which extract the latest version into a brand new
directory, the laucnh a maven multiproject to create eclipse .project & .classpath

I got some error messages like those one. Any clue ? (the mavenizing project [xxx] are produced
by the script)

mavenizing project [apacheds]
mavenizing project [asn1]
mavenizing project [authx]

BUILD FAILED
File...... /home/elecharny/.maven/cache/maven-multiproject-plugin-1.3.1/plugin.jelly
Element... maven:reactor
Line...... 217
Column.... 9
The build cannot continue because of the following unsatisfied dependency:

authx-api-0.2-SNAPSHOT.jar

mavenizing project [ldap]
mavenizing project [naming]

BUILD FAILED
File...... /home/elecharny/.maven/cache/maven-multiproject-plugin-1.3.1/plugin.jelly
Element... maven:reactor
Line...... 217
Column.... 9
The build cannot continue because of the following unsatisfied dependency:

naming-core-0.9-dev.jar

mavenizing project [network/apseda]
mavenizing project [network/mina]
mavenizing project [network/sedang]
The build cannot continue because of the following unsatisfied dependency:

protocol-api-1.0-SNAPSHOT.jar (try downloading from http://incubator.apache.org/directory/subprojects/protocol-api/)

mavenizing project [protocols/changepw]

BUILD FAILED
File...... /home/elecharny/.maven/cache/maven-multiproject-plugin-1.3.1/plugin.jelly
Element... maven:reactor
Line...... 217
Column.... 9
The build cannot continue because of the following unsatisfied dependency:

changepw-core-0.4-SNAPSHOT.jar

mavenizing project [protocols/dhcp]

BUILD FAILED
File...... /home/elecharny/.maven/cache/maven-multiproject-plugin-1.3.1/plugin.jelly
Element... maven:reactor
Line...... 217
Column.... 9
The build cannot continue because of the following unsatisfied dependency:

dhcp-core-0.1-SNAPSHOT.jar

mavenizing project [protocols/dns]

BUILD FAILED
File...... /home/elecharny/.maven/cache/maven-multiproject-plugin-1.3.1/plugin.jelly
Element... maven:reactor
Line...... 217
Column.... 9
The build cannot continue because of the following unsatisfied dependency:

dns-core-0.1-SNAPSHOT.jar

mavenizing project [protocols/kerberos]
mavenizing project [protocols/ntp]

BUILD FAILED
File...... /home/elecharny/.maven/cache/maven-multiproject-plugin-1.3.1/plugin.jelly
Element... maven:reactor
Line...... 217
Column.... 9
The build cannot continue because of the following unsatisfied dependency:

ntp-core-0.4-SNAPSHOT.jar

mavenizing project [sandbox]

BUILD FAILED
File...... /home/elecharny/.maven/cache/maven-multiproject-plugin-1.3.1/plugin.jelly
Element... maven:reactor
Line...... 63
Column.... 9
Error reading XML or initializing
mavenizing project [sitedocs]



Mime
View raw message