directory-dev mailing list archives

Site index · List index
Message view « Date » · « Thread »
Top « Date » · « Thread »
From Alex Karasulu <aok...@bellsouth.net>
Subject Re: [GUMP@brutus]: Project apseda (in module apseda) failed
Date Mon, 31 Jan 2005 13:45:41 GMT
Trustin,

I know you're totally unenthralled with SEDA and onto MINA but if you 
could take a few minutes to look at why this is failing just to shut up 
GUMP that would be awesome.  Eventually we can just yank SEDA but its 
still going to hang around a little bit even after MINA replaces it.  
We'll just deprecate the whole API.

In the meantime, I want to try to get GUMP all cleared up.  It's 
starting to become irritating but then again that's its job :).  In the 
worst case we can just blow away the darn test case but before we do 
that let's see if this can be fixed.

Thanks,
Alex

Apache SEDA development wrote:

>To whom it may engage...
>  
>
<snip/>

>    [junit] [ERROR] TEST org.apache.apseda.examples.DiscardProtocolProviderTest FAILED
>    [junit] Running org.apache.apseda.examples.EchoProtocolProviderTest
>   
>  
>
<snip/>

>BUILD FAILED
>File...... /home/gump/.maven/cache/maven-test-plugin-1.6.2/plugin.jelly
>Element... fail
>Line...... 181
>Column.... 54
>There were test failures.
>Total time: 21 seconds
>Finished at: Mon Jan 31 01:34:01 PST 2005
>  
>


Mime
View raw message