directory-dev mailing list archives

Site index · List index
Message view « Date » · « Thread »
Top « Date » · « Thread »
From Berin Loritsch <blorit...@d-haven.org>
Subject Re: [GUMP@brutus]: Project seda (in module seda) failed
Date Tue, 14 Dec 2004 01:44:19 GMT
Trustin Lee wrote:

>I ran all tests several times but I could not make it fail.  Any ideas?
>  
>

Its the DiscardProtocolProviderTest.  Could there be some environmental
issues?  The biggest thing I ran into for testing issues was ports still 
in use.

>
>On Mon, 13 Dec 2004 01:22:07 PST, seda development
><directory-dev@incubator.apache.org> wrote:
>  
>
>>To whom it may engage...
>>
>>This is an automated request, but not an unsolicited one. For
>>more information please visit http://gump.apache.org/nagged.html,
>>and/or contact the folk at general@gump.apache.org.
>>
>>Project seda has an issue affecting its community integration.
>>This issue affects 1 projects,
>>and has been outstanding for 6 runs.
>>The current state of this project is 'Failed', with reason 'Build Failed'.
>>For reference only, the following projects are affected by this:
>>   - seda :  An internet protocol server framework
>>
>>Full details are available at:
>>   http://brutus.apache.org/gump/public/seda/seda/index.html
>>
>>That said, some information snippets are provided here.
>>
>>The following annotations (debug/informational/warning/error messages) were provided:
>>-DEBUG- Sole output [seda-13122004.jar] identifier set to project name
>>-DEBUG- (Gump generated) Maven Properties in: /usr/local/gump/public/workspace/seda/build.properties
>>-INFO- Failed with reason build failed
>>-DEBUG- Maven POM in: /usr/local/gump/public/workspace/seda/project.xml
>>-DEBUG- Maven project properties in: /usr/local/gump/public/workspace/seda/project.properties
>>-INFO- Project Reports in: /usr/local/gump/public/workspace/seda/target/test-reports
>>-INFO- Failed to extract fallback artifacts from Gump Repository
>>
>>The following work was performed:
>>http://brutus.apache.org/gump/public/seda/seda/gump_work/build_seda_seda.html
>>Work Name: build_seda_seda (Type: Build)
>>Work ended in a state of : Failed
>>Elapsed: 21 secs
>>Command Line: maven --offline jar
>>[Working Directory: /usr/local/gump/public/workspace/seda]
>>CLASSPATH: /opt/jdk1.4/lib/tools.jar:/usr/local/gump/public/workspace/jakarta-commons/logging/dist/commons-logging.jar:/usr/local/gump/public/workspace/jakarta-commons/logging/dist/commons-logging-api.jar:/usr/local/gump/public/workspace/ant/dist/lib/ant-stylebook.jar:/usr/local/gump/public/workspace/ant/dist/lib/ant-jmf.jar:/usr/local/gump/public/workspace/ant/dist/lib/ant-swing.jar:/usr/local/gump/public/workspace/ant/dist/lib/ant-trax.jar:/usr/local/gump/public/workspace/ant/dist/lib/ant-junit.jar:/usr/local/gump/public/workspace/ant/dist/lib/ant-launcher.jar:/usr/local/gump/public/workspace/ant/dist/lib/ant-nodeps.jar:/usr/local/gump/public/workspace/ant/dist/lib/ant.jar:/usr/local/gump/public/workspace/directory-snickers/codec/target/snickers-codec-13122004.jar:/usr/local/gump/public/workspace/jakarta-commons/net/dist/commons-net-13122004.jar:/usr/local/gump/public/workspace/dist/junit/junit.jar
>>---------------------------------------------
>>   [echo] Compiling to /home/gump/workspaces2/public/workspace/seda/target/classes
>>   [javac] Compiling 124 source files to /home/gump/workspaces2/public/workspace/seda/target/classes
>>
>>java:jar-resources:
>>
>>test:prepare-filesystem:
>>   [mkdir] Created dir: /home/gump/workspaces2/public/workspace/seda/target/test-classes
>>   [mkdir] Created dir: /home/gump/workspaces2/public/workspace/seda/target/test-reports
>>
>>test:test-resources:
>>
>>test:compile:
>>   [javac] Compiling 11 source files to /home/gump/workspaces2/public/workspace/seda/target/test-classes
>>
>>test:test:
>>   [junit] Running org.apache.seda.event.AbstractSubscriberTest
>>   [junit] Tests run: 4, Failures: 0, Errors: 0, Time elapsed: 0.035 sec
>>   [junit] Running org.apache.seda.event.DefaultStageTest
>>   [junit] Tests run: 5, Failures: 0, Errors: 0, Time elapsed: 1.033 sec
>>   [junit] Running org.apache.seda.listener.TCPListenerManagerTest
>>   [junit] Tests run: 2, Failures: 0, Errors: 0, Time elapsed: 0.439 sec
>>   [junit] Running org.apache.seda.listener.AvailablePortFinderTest
>>   [junit] Tests run: 3, Failures: 0, Errors: 0, Time elapsed: 0.009 sec
>>   [junit] Running org.apache.seda.decoder.DefaultDecoderManagerTest
>>   [junit] Tests run: 13, Failures: 0, Errors: 0, Time elapsed: 2.588 sec
>>   [junit] Running org.apache.seda.buffer.DefaultBufferPoolTest
>>   [junit] Tests run: 7, Failures: 0, Errors: 0, Time elapsed: 0.039 sec
>>   [junit] Running org.apache.seda.examples.DiscardProtocolProviderTest
>>   [junit] Tests run: 2, Failures: 0, Errors: 1, Time elapsed: 3.098 sec
>>   [junit] [ERROR] TEST org.apache.seda.examples.DiscardProtocolProviderTest FAILED
>>   [junit] Running org.apache.seda.examples.EchoProtocolProviderTest
>>   [junit] Tests run: 2, Failures: 0, Errors: 0, Time elapsed: 3.241 sec
>>   [junit] Running org.apache.seda.HexDumpTest
>>
>>00000000:  48 65 6c 6c 6f 20 57 6f   72 6c 64 20 74 68 69 73
>>00000010:  20 69 73 20 74 68 65 20   68 65 78 20 64 75 6d 70
>>00000020:  20 74 6f 6f 6c
>>   [junit] Tests run: 1, Failures: 0, Errors: 0, Time elapsed: 0.012 sec
>>   [junit] Running org.apache.seda.DefaultFrontendFactoryTest
>>   [junit] Tests run: 3, Failures: 0, Errors: 0, Time elapsed: 4.442 sec
>>
>>BUILD FAILED
>>File...... /home/gump/.maven/cache/maven-test-plugin-1.6.2/plugin.jelly
>>Element... fail
>>Line...... 181
>>Column.... 54
>>There were test failures.
>>Total time: 21 seconds
>>Finished at: Mon Dec 13 01:22:01 PST 2004
>>
>>---------------------------------------------
>>
>>To subscribe to this information via syndicated feeds:
>>- RSS: http://brutus.apache.org/gump/public/seda/seda/rss.xml
>>- Atom: http://brutus.apache.org/gump/public/seda/seda/atom.xml
>>
>>============================== Gump Tracking Only ===
>>Produced by Gump version 2.2.
>>Gump Run 27000013122004, brutus:brutus-public:27000013122004
>>Gump E-mail Identifier (unique within run) #10.
>>
>>--
>>Apache Gump
>>http://gump.apache.org/ [Instance: brutus]
>>
>>    
>>
>
>
>  
>


-- 

"Programming today is a race between software engineers striving to build bigger and better
idiot-proof programs, and the Universe trying to produce bigger and better idiots. So far,
the Universe is winning."
                - Rich Cook



Mime
View raw message