directory-commits mailing list archives

Site index · List index
Message view « Date » · « Thread »
Top « Date » · « Thread »
From "Continuum@vmbuild" <contin...@apache.org>
Subject [continuum] BUILD FAILURE: Directory - ApacheDS 1.5 Build With Dependencies - Default Maven 2 Build Definition
Date Sun, 20 Mar 2011 21:17:58 GMT
Online report : http://vmbuild.apache.org/continuum/buildResult.action?buildId=5199&projectId=10

Build statistics:
  State: Failed
  Previous State: Building
  Started at: Sun 20 Mar 2011 21:15:59 +0000
  Finished at: Sun 20 Mar 2011 21:17:50 +0000
  Total time: 1m 51s
  Build Trigger: Schedule
  Build Number: 600
  Exit code: 1
  Building machine hostname: vmbuild
  Operating system : Linux(unknown)
  Java Home version : 
          java version "1.6.0_22"
          Java(TM) SE Runtime Environment (build 1.6.0_22-b04)
          Java HotSpot(TM) 64-Bit Server VM (build 17.1-b03, mixed mode)
        
  Builder version :
          Apache Maven 3.0.2 (r1056850; 2011-01-09 00:58:10+0000)
          Java version: 1.6.0_22, vendor: Sun Microsystems Inc.
          Java home: /usr/lib/jvm/java-6-sun-1.6.0.22/jre
          Default locale: en_US, platform encoding: ANSI_X3.4-1968
          OS name: "linux", version: "2.6.32-27-server", arch: "amd64", family: "unix"
    
****************************************************************************
SCM Changes:
****************************************************************************
No files changed

****************************************************************************
Dependencies Changes:
****************************************************************************
No dependencies changed


****************************************************************************
Build Definition:
****************************************************************************
POM filename: pom.xml
Goals: clean install -Dintegration   
Arguments: --batch-mode
Build Fresh: true
Always Build: false
Default Build Definition: true
Schedule: DEFAULT_SCHEDULE
Profile Name: Apache Maven 3.0.2
Description: Default Maven 2 Build Definition

****************************************************************************
Test Summary:
****************************************************************************
Tests: 1856
Failures: 1
Errors: 286
Success Rate: 84
Total time: 7.2369986

****************************************************************************
Test Failures:
****************************************************************************

SubEntryControlTest
    testDecodeSubEntryVisibilityTrue :
  java.lang.AssertionError
  java.lang.AssertionError: 
	at org.junit.Assert.fail(Assert.java:91)
	at org.junit.Assert.assertTrue(Assert.java:43)
	at org.junit.Assert.assertTrue(Assert.java:54)
	at org.apache.directory.shared.ldap.codec.search.controls.SubEntryControlTest.testDecodeSubEntryVisibilityTrue(SubEntryControlTest.java:68)
	at sun.reflect.NativeMethodAccessorImpl.invoke0(Native Method)
	at sun.reflect.NativeMethodAccessorImpl.invoke(NativeMethodAccessorImpl.java:39)
	at sun.reflect.DelegatingMethodAccessorImpl.invoke(DelegatingMethodAccessorImpl.java:25)
	at java.lang.reflect.Method.invoke(Method.java:597)
	at org.junit.runners.model.FrameworkMethod$1.runReflectiveCall(FrameworkMethod.java:44)
	at org.junit.internal.runners.model.ReflectiveCallable.run(ReflectiveCallable.java:15)
	at org.junit.runners.model.FrameworkMethod.invokeExplosively(FrameworkMethod.java:41)
	at org.junit.internal.runners.statements.InvokeMethod.evaluate(InvokeMethod.java:20)
	at org.junit.runners.BlockJUnit4ClassRunner.runNotIgnored(BlockJUnit4ClassRunner.java:79)
	at org.junit.runners.BlockJUnit4ClassRunner.runChild(BlockJUnit4ClassRunner.java:71)
	at org.junit.runners.BlockJUnit4ClassRunner.runChild(BlockJUnit4ClassRunner.java:49)
	at org.junit.runners.ParentRunner$3.run(ParentRunner.java:193)
	at java.util.concurrent.Executors$RunnableAdapter.call(Executors.java:441)
	at java.util.concurrent.FutureTask$Sync.innerRun(FutureTask.java:303)
	at java.util.concurrent.FutureTask.run(FutureTask.java:138)
	at java.util.concurrent.Executors$RunnableAdapter.call(Executors.java:441)
	at java.util.concurrent.FutureTask$Sync.innerRun(FutureTask.java:303)
	at java.util.concurrent.FutureTask.run(FutureTask.java:138)
	at java.util.concurrent.ThreadPoolExecutor$Worker.runTask(ThreadPoolExecutor.java:886)
	at java.util.concurrent.ThreadPoolExecutor$Worker.run(ThreadPoolExecutor.java:908)
	at java.lang.Thread.run(Thread.java:662)

    testDecodeSubEntryEmptyVisibility :
  java.lang.Exception
  java.lang.Exception: Unexpected exception, expected<org.apache.directory.shared.asn1.DecoderException>
but was<java.lang.NullPointerException>
	at org.junit.internal.runners.statements.ExpectException.evaluate(ExpectException.java:28)
	at org.junit.runners.BlockJUnit4ClassRunner.runNotIgnored(BlockJUnit4ClassRunner.java:79)
	at org.junit.runners.BlockJUnit4ClassRunner.runChild(BlockJUnit4ClassRunner.java:71)
	at org.junit.runners.BlockJUnit4ClassRunner.runChild(BlockJUnit4ClassRunner.java:49)
	at org.junit.runners.ParentRunner$3.run(ParentRunner.java:193)
	at java.util.concurrent.Executors$RunnableAdapter.call(Executors.java:441)
	at java.util.concurrent.FutureTask$Sync.innerRun(FutureTask.java:303)
	at java.util.concurrent.FutureTask.run(FutureTask.java:138)
	at java.util.concurrent.Executors$RunnableAdapter.call(Executors.java:441)
	at java.util.concurrent.FutureTask$Sync.innerRun(FutureTask.java:303)
	at java.util.concurrent.FutureTask.run(FutureTask.java:138)
	at java.util.concurrent.ThreadPoolExecutor$Worker.runTask(ThreadPoolExecutor.java:886)
	at java.util.concurrent.ThreadPoolExecutor$Worker.run(ThreadPoolExecutor.java:908)
	at java.lang.Thread.run(Thread.java:662)
Caused by: java.lang.NullPointerException
	at org.apache.directory.shared.asn1.ber.tlv.Value.getData(Value.java:156)
	at org.apache.directory.shared.asn1.ber.tlv.BooleanDecoder.parse(BooleanDecoder.java:48)
	at org.apache.directory.shared.ldap.codec.controls.search.subentries.SubentriesGrammar$1.action(SubentriesGrammar.java:84)
	at org.apache.directory.shared.ldap.codec.controls.search.subentries.SubentriesGrammar$1.action(SubentriesGrammar.java:69)
	at org.apache.directory.shared.asn1.ber.grammar.AbstractGrammar.executeAction(AbstractGrammar.java:138)
	at org.apache.directory.shared.asn1.ber.Asn1Decoder.treatTLVDoneState(Asn1Decoder.java:599)
	at org.apache.directory.shared.asn1.ber.Asn1Decoder.decode(Asn1Decoder.java:735)
	at org.apache.directory.shared.ldap.codec.controls.search.subentries.SubentriesDecorator.decode(SubentriesDecorator.java:146)
	at org.apache.directory.shared.ldap.codec.search.controls.SubEntryControlTest.testDecodeSubEntryEmptyVisibility(SubEntryControlTest.java:137)
	at sun.reflect.NativeMethodAccessorImpl.invoke0(Native Method)
	at sun.reflect.NativeMethodAccessorImpl.invoke(NativeMethodAccessorImpl.java:39)
	at sun.reflect.DelegatingMethodAccessorImpl.invoke(DelegatingMethodAccessorImpl.java:25)
	at java.lang.reflect.Method.invoke(Method.java:597)
	at org.junit.runners.model.FrameworkMethod$1.runReflectiveCall(FrameworkMethod.java:44)
	at org.junit.internal.runners.model.ReflectiveCallable.run(ReflectiveCallable.java:15)
	at org.junit.runners.model.FrameworkMethod.invokeExplosively(FrameworkMethod.java:41)
	at org.junit.internal.runners.statements.InvokeMethod.evaluate(InvokeMethod.java:20)
	at org.junit.internal.runners.statements.ExpectException.evaluate(ExpectException.java:21)
	... 13 more

  



Mime
View raw message