directory-commits mailing list archives

Site index · List index
Message view « Date » · « Thread »
Top « Date » · « Thread »
From "Continuum@vmbuild" <contin...@apache.org>
Subject [continuum] BUILD FAILURE: Directory - ApacheDS 1.5 Build With Dependencies - Default Maven 2 Build Definition
Date Thu, 24 Mar 2011 09:21:08 GMT
Online report : http://vmbuild.apache.org/continuum/buildResult.action?buildId=5539&projectId=10

Build statistics:
  State: Failed
  Previous State: Building
  Started at: Thu 24 Mar 2011 08:56:11 +0000
  Finished at: Thu 24 Mar 2011 09:21:04 +0000
  Total time: 24m 52s
  Build Trigger: Schedule
  Build Number: 623
  Exit code: 1
  Building machine hostname: vmbuild
  Operating system : Linux(unknown)
  Java Home version : 
          java version "1.6.0_22"
          Java(TM) SE Runtime Environment (build 1.6.0_22-b04)
          Java HotSpot(TM) 64-Bit Server VM (build 17.1-b03, mixed mode)
        
  Builder version :
          Apache Maven 3.0.2 (r1056850; 2011-01-09 00:58:10+0000)
          Java version: 1.6.0_22, vendor: Sun Microsystems Inc.
          Java home: /usr/lib/jvm/java-6-sun-1.6.0.22/jre
          Default locale: en_US, platform encoding: ANSI_X3.4-1968
          OS name: "linux", version: "2.6.32-27-server", arch: "amd64", family: "unix"
    
****************************************************************************
SCM Changes:
****************************************************************************
No files changed

****************************************************************************
Dependencies Changes:
****************************************************************************
No dependencies changed


****************************************************************************
Build Definition:
****************************************************************************
POM filename: pom.xml
Goals: clean install -Dintegration   
Arguments: --batch-mode
Build Fresh: true
Always Build: false
Default Build Definition: true
Schedule: DEFAULT_SCHEDULE
Profile Name: Apache Maven 3.0.2
Description: Default Maven 2 Build Definition

****************************************************************************
Test Summary:
****************************************************************************
Tests: 298
Failures: 10
Errors: 20
Success Rate: 89
Total time: 236.84

****************************************************************************
Test Failures:
****************************************************************************

StockServerISuite
    testMultipleAuthenticators :
  java.lang.AssertionError
  java.lang.AssertionError: this authentication should have been successful, got result code : PROTOCOL_ERROR
	at org.junit.Assert.fail(Assert.java:91)
	at org.apache.directory.server.operations.bind.DelegatedAuthIT.testMultipleAuthenticators(DelegatedAuthIT.java:209)
	at sun.reflect.NativeMethodAccessorImpl.invoke0(Native Method)
	at sun.reflect.NativeMethodAccessorImpl.invoke(NativeMethodAccessorImpl.java:39)
	at sun.reflect.DelegatingMethodAccessorImpl.invoke(DelegatingMethodAccessorImpl.java:25)
	at java.lang.reflect.Method.invoke(Method.java:597)
	at org.junit.runners.model.FrameworkMethod$1.runReflectiveCall(FrameworkMethod.java:44)
	at org.junit.internal.runners.model.ReflectiveCallable.run(ReflectiveCallable.java:15)
	at org.junit.runners.model.FrameworkMethod.invokeExplosively(FrameworkMethod.java:41)
	at org.junit.internal.runners.statements.InvokeMethod.evaluate(InvokeMethod.java:20)
	at org.junit.runners.BlockJUnit4ClassRunner.runNotIgnored(BlockJUnit4ClassRunner.java:79)
	at org.junit.runners.BlockJUnit4ClassRunner.runChild(BlockJUnit4ClassRunner.java:71)
	at org.apache.directory.server.core.integ.FrameworkRunner.runChild(FrameworkRunner.java:433)
	at org.apache.directory.server.core.integ.FrameworkRunner.runChild(FrameworkRunner.java:56)
	at org.junit.runners.ParentRunner$3.run(ParentRunner.java:193)
	at org.junit.runners.ParentRunner$1.schedule(ParentRunner.java:52)
	at org.junit.runners.ParentRunner.runChildren(ParentRunner.java:191)
	at org.junit.runners.ParentRunner.access$000(ParentRunner.java:42)
	at org.junit.runners.ParentRunner$2.evaluate(ParentRunner.java:184)
	at org.junit.runners.ParentRunner.run(ParentRunner.java:236)
	at org.apache.directory.server.core.integ.FrameworkRunner.run(FrameworkRunner.java:222)
	at org.junit.runners.Suite.runChild(Suite.java:128)
	at org.apache.directory.server.core.integ.FrameworkSuite.runChild(FrameworkSuite.java:191)
	at org.apache.directory.server.core.integ.FrameworkSuite.runChild(FrameworkSuite.java:48)
	at org.junit.runners.ParentRunner$3.run(ParentRunner.java:193)
	at org.junit.runners.ParentRunner$1.schedule(ParentRunner.java:52)
	at org.junit.runners.ParentRunner.runChildren(ParentRunner.java:191)
	at org.junit.runners.ParentRunner.access$000(ParentRunner.java:42)
	at org.junit.runners.ParentRunner$2.evaluate(ParentRunner.java:184)
	at org.junit.runners.ParentRunner.run(ParentRunner.java:236)
	at org.apache.directory.server.core.integ.FrameworkSuite.run(FrameworkSuite.java:158)
	at org.apache.maven.surefire.junit4.JUnit4TestSet.execute(JUnit4TestSet.java:35)
	at org.apache.maven.surefire.junit4.JUnit4Provider.executeTestSet(JUnit4Provider.java:115)
	at org.apache.maven.surefire.junit4.JUnit4Provider.invoke(JUnit4Provider.java:97)
	at sun.reflect.NativeMethodAccessorImpl.invoke0(Native Method)
	at sun.reflect.NativeMethodAccessorImpl.invoke(NativeMethodAccessorImpl.java:39)
	at sun.reflect.DelegatingMethodAccessorImpl.invoke(DelegatingMethodAccessorImpl.java:25)
	at java.lang.reflect.Method.invoke(Method.java:597)
	at org.apache.maven.surefire.booter.ProviderFactory$ClassLoaderProxy.invoke(ProviderFactory.java:103)
	at $Proxy0.invoke(Unknown Source)
	at org.apache.maven.surefire.booter.SurefireStarter.invokeProvider(SurefireStarter.java:150)
	at org.apache.maven.surefire.booter.SurefireStarter.runSuitesInProcess(SurefireStarter.java:91)
	at org.apache.maven.surefire.booter.ForkedBooter.main(ForkedBooter.java:69)

    testPsearchModify :
  java.lang.AssertionError
  java.lang.AssertionError: 
	at org.junit.Assert.fail(Assert.java:91)
	at org.junit.Assert.assertTrue(Assert.java:43)
	at org.junit.Assert.assertNotNull(Assert.java:524)
	at org.junit.Assert.assertNotNull(Assert.java:535)
	at org.apache.directory.server.operations.search.PersistentSearchIT.testPsearchModify(PersistentSearchIT.java:217)
	at sun.reflect.NativeMethodAccessorImpl.invoke0(Native Method)
	at sun.reflect.NativeMethodAccessorImpl.invoke(NativeMethodAccessorImpl.java:39)
	at sun.reflect.DelegatingMethodAccessorImpl.invoke(DelegatingMethodAccessorImpl.java:25)
	at java.lang.reflect.Method.invoke(Method.java:597)
	at org.junit.runners.model.FrameworkMethod$1.runReflectiveCall(FrameworkMethod.java:44)
	at org.junit.internal.runners.model.ReflectiveCallable.run(ReflectiveCallable.java:15)
	at org.junit.runners.model.FrameworkMethod.invokeExplosively(FrameworkMethod.java:41)
	at org.junit.internal.runners.statements.InvokeMethod.evaluate(InvokeMethod.java:20)
	at org.junit.internal.runners.statements.RunAfters.evaluate(RunAfters.java:31)
	at org.junit.runners.BlockJUnit4ClassRunner.runNotIgnored(BlockJUnit4ClassRunner.java:79)
	at org.junit.runners.BlockJUnit4ClassRunner.runChild(BlockJUnit4ClassRunner.java:71)
	at org.apache.directory.server.core.integ.FrameworkRunner.runChild(FrameworkRunner.java:433)
	at org.apache.directory.server.core.integ.FrameworkRunner.runChild(FrameworkRunner.java:56)
	at org.junit.runners.ParentRunner$3.run(ParentRunner.java:193)
	at org.junit.runners.ParentRunner$1.schedule(ParentRunner.java:52)
	at org.junit.runners.ParentRunner.runChildren(ParentRunner.java:191)
	at org.junit.runners.ParentRunner.access$000(ParentRunner.java:42)
	at org.junit.runners.ParentRunner$2.evaluate(ParentRunner.java:184)
	at org.junit.runners.ParentRunner.run(ParentRunner.java:236)
	at org.apache.directory.server.core.integ.FrameworkRunner.run(FrameworkRunner.java:222)
	at org.junit.runners.Suite.runChild(Suite.java:128)
	at org.apache.directory.server.core.integ.FrameworkSuite.runChild(FrameworkSuite.java:191)
	at org.apache.directory.server.core.integ.FrameworkSuite.runChild(FrameworkSuite.java:48)
	at org.junit.runners.ParentRunner$3.run(ParentRunner.java:193)
	at org.junit.runners.ParentRunner$1.schedule(ParentRunner.java:52)
	at org.junit.runners.ParentRunner.runChildren(ParentRunner.java:191)
	at org.junit.runners.ParentRunner.access$000(ParentRunner.java:42)
	at org.junit.runners.ParentRunner$2.evaluate(ParentRunner.java:184)
	at org.junit.runners.ParentRunner.run(ParentRunner.java:236)
	at org.apache.directory.server.core.integ.FrameworkSuite.run(FrameworkSuite.java:158)
	at org.apache.maven.surefire.junit4.JUnit4TestSet.execute(JUnit4TestSet.java:35)
	at org.apache.maven.surefire.junit4.JUnit4Provider.executeTestSet(JUnit4Provider.java:115)
	at org.apache.maven.surefire.junit4.JUnit4Provider.invoke(JUnit4Provider.java:97)
	at sun.reflect.NativeMethodAccessorImpl.invoke0(Native Method)
	at sun.reflect.NativeMethodAccessorImpl.invoke(NativeMethodAccessorImpl.java:39)
	at sun.reflect.DelegatingMethodAccessorImpl.invoke(DelegatingMethodAccessorImpl.java:25)
	at java.lang.reflect.Method.invoke(Method.java:597)
	at org.apache.maven.surefire.booter.ProviderFactory$ClassLoaderProxy.invoke(ProviderFactory.java:103)
	at $Proxy0.invoke(Unknown Source)
	at org.apache.maven.surefire.booter.SurefireStarter.invokeProvider(SurefireStarter.java:150)
	at org.apache.maven.surefire.booter.SurefireStarter.runSuitesInProcess(SurefireStarter.java:91)
	at org.apache.maven.surefire.booter.ForkedBooter.main(ForkedBooter.java:69)

    testPsearchModifyDn :
  java.lang.AssertionError
  java.lang.AssertionError: 
	at org.junit.Assert.fail(Assert.java:91)
	at org.junit.Assert.assertTrue(Assert.java:43)
	at org.junit.Assert.assertNotNull(Assert.java:524)
	at org.junit.Assert.assertNotNull(Assert.java:535)
	at org.apache.directory.server.operations.search.PersistentSearchIT.testPsearchModifyDn(PersistentSearchIT.java:231)
	at sun.reflect.NativeMethodAccessorImpl.invoke0(Native Method)
	at sun.reflect.NativeMethodAccessorImpl.invoke(NativeMethodAccessorImpl.java:39)
	at sun.reflect.DelegatingMethodAccessorImpl.invoke(DelegatingMethodAccessorImpl.java:25)
	at java.lang.reflect.Method.invoke(Method.java:597)
	at org.junit.runners.model.FrameworkMethod$1.runReflectiveCall(FrameworkMethod.java:44)
	at org.junit.internal.runners.model.ReflectiveCallable.run(ReflectiveCallable.java:15)
	at org.junit.runners.model.FrameworkMethod.invokeExplosively(FrameworkMethod.java:41)
	at org.junit.internal.runners.statements.InvokeMethod.evaluate(InvokeMethod.java:20)
	at org.junit.internal.runners.statements.RunAfters.evaluate(RunAfters.java:31)
	at org.junit.runners.BlockJUnit4ClassRunner.runNotIgnored(BlockJUnit4ClassRunner.java:79)
	at org.junit.runners.BlockJUnit4ClassRunner.runChild(BlockJUnit4ClassRunner.java:71)
	at org.apache.directory.server.core.integ.FrameworkRunner.runChild(FrameworkRunner.java:433)
	at org.apache.directory.server.core.integ.FrameworkRunner.runChild(FrameworkRunner.java:56)
	at org.junit.runners.ParentRunner$3.run(ParentRunner.java:193)
	at org.junit.runners.ParentRunner$1.schedule(ParentRunner.java:52)
	at org.junit.runners.ParentRunner.runChildren(ParentRunner.java:191)
	at org.junit.runners.ParentRunner.access$000(ParentRunner.java:42)
	at org.junit.runners.ParentRunner$2.evaluate(ParentRunner.java:184)
	at org.junit.runners.ParentRunner.run(ParentRunner.java:236)
	at org.apache.directory.server.core.integ.FrameworkRunner.run(FrameworkRunner.java:222)
	at org.junit.runners.Suite.runChild(Suite.java:128)
	at org.apache.directory.server.core.integ.FrameworkSuite.runChild(FrameworkSuite.java:191)
	at org.apache.directory.server.core.integ.FrameworkSuite.runChild(FrameworkSuite.java:48)
	at org.junit.runners.ParentRunner$3.run(ParentRunner.java:193)
	at org.junit.runners.ParentRunner$1.schedule(ParentRunner.java:52)
	at org.junit.runners.ParentRunner.runChildren(ParentRunner.java:191)
	at org.junit.runners.ParentRunner.access$000(ParentRunner.java:42)
	at org.junit.runners.ParentRunner$2.evaluate(ParentRunner.java:184)
	at org.junit.runners.ParentRunner.run(ParentRunner.java:236)
	at org.apache.directory.server.core.integ.FrameworkSuite.run(FrameworkSuite.java:158)
	at org.apache.maven.surefire.junit4.JUnit4TestSet.execute(JUnit4TestSet.java:35)
	at org.apache.maven.surefire.junit4.JUnit4Provider.executeTestSet(JUnit4Provider.java:115)
	at org.apache.maven.surefire.junit4.JUnit4Provider.invoke(JUnit4Provider.java:97)
	at sun.reflect.NativeMethodAccessorImpl.invoke0(Native Method)
	at sun.reflect.NativeMethodAccessorImpl.invoke(NativeMethodAccessorImpl.java:39)
	at sun.reflect.DelegatingMethodAccessorImpl.invoke(DelegatingMethodAccessorImpl.java:25)
	at java.lang.reflect.Method.invoke(Method.java:597)
	at org.apache.maven.surefire.booter.ProviderFactory$ClassLoaderProxy.invoke(ProviderFactory.java:103)
	at $Proxy0.invoke(Unknown Source)
	at org.apache.maven.surefire.booter.SurefireStarter.invokeProvider(SurefireStarter.java:150)
	at org.apache.maven.surefire.booter.SurefireStarter.runSuitesInProcess(SurefireStarter.java:91)
	at org.apache.maven.surefire.booter.ForkedBooter.main(ForkedBooter.java:69)


    testPsearchDelete :
  java.lang.AssertionError
  java.lang.AssertionError: 
	at org.junit.Assert.fail(Assert.java:91)
	at org.junit.Assert.assertTrue(Assert.java:43)
	at org.junit.Assert.assertNotNull(Assert.java:524)
	at org.junit.Assert.assertNotNull(Assert.java:535)
	at org.apache.directory.server.operations.search.PersistentSearchIT.testPsearchDelete(PersistentSearchIT.java:245)
	at sun.reflect.NativeMethodAccessorImpl.invoke0(Native Method)
	at sun.reflect.NativeMethodAccessorImpl.invoke(NativeMethodAccessorImpl.java:39)
	at sun.reflect.DelegatingMethodAccessorImpl.invoke(DelegatingMethodAccessorImpl.java:25)
	at java.lang.reflect.Method.invoke(Method.java:597)
	at org.junit.runners.model.FrameworkMethod$1.runReflectiveCall(FrameworkMethod.java:44)
	at org.junit.internal.runners.model.ReflectiveCallable.run(ReflectiveCallable.java:15)
	at org.junit.runners.model.FrameworkMethod.invokeExplosively(FrameworkMethod.java:41)
	at org.junit.internal.runners.statements.InvokeMethod.evaluate(InvokeMethod.java:20)
	at org.junit.internal.runners.statements.RunAfters.evaluate(RunAfters.java:31)
	at org.junit.runners.BlockJUnit4ClassRunner.runNotIgnored(BlockJUnit4ClassRunner.java:79)
	at org.junit.runners.BlockJUnit4ClassRunner.runChild(BlockJUnit4ClassRunner.java:71)
	at org.apache.directory.server.core.integ.FrameworkRunner.runChild(FrameworkRunner.java:433)
	at org.apache.directory.server.core.integ.FrameworkRunner.runChild(FrameworkRunner.java:56)
	at org.junit.runners.ParentRunner$3.run(ParentRunner.java:193)
	at org.junit.runners.ParentRunner$1.schedule(ParentRunner.java:52)
	at org.junit.runners.ParentRunner.runChildren(ParentRunner.java:191)
	at org.junit.runners.ParentRunner.access$000(ParentRunner.java:42)
	at org.junit.runners.ParentRunner$2.evaluate(ParentRunner.java:184)
	at org.junit.runners.ParentRunner.run(ParentRunner.java:236)
	at org.apache.directory.server.core.integ.FrameworkRunner.run(FrameworkRunner.java:222)
	at org.junit.runners.Suite.runChild(Suite.java:128)
	at org.apache.directory.server.core.integ.FrameworkSuite.runChild(FrameworkSuite.java:191)
	at org.apache.directory.server.core.integ.FrameworkSuite.runChild(FrameworkSuite.java:48)
	at org.junit.runners.ParentRunner$3.run(ParentRunner.java:193)
	at org.junit.runners.ParentRunner$1.schedule(ParentRunner.java:52)
	at org.junit.runners.ParentRunner.runChildren(ParentRunner.java:191)
	at org.junit.runners.ParentRunner.access$000(ParentRunner.java:42)
	at org.junit.runners.ParentRunner$2.evaluate(ParentRunner.java:184)
	at org.junit.runners.ParentRunner.run(ParentRunner.java:236)
	at org.apache.directory.server.core.integ.FrameworkSuite.run(FrameworkSuite.java:158)
	at org.apache.maven.surefire.junit4.JUnit4TestSet.execute(JUnit4TestSet.java:35)
	at org.apache.maven.surefire.junit4.JUnit4Provider.executeTestSet(JUnit4Provider.java:115)
	at org.apache.maven.surefire.junit4.JUnit4Provider.invoke(JUnit4Provider.java:97)
	at sun.reflect.NativeMethodAccessorImpl.invoke0(Native Method)
	at sun.reflect.NativeMethodAccessorImpl.invoke(NativeMethodAccessorImpl.java:39)
	at sun.reflect.DelegatingMethodAccessorImpl.invoke(DelegatingMethodAccessorImpl.java:25)
	at java.lang.reflect.Method.invoke(Method.java:597)
	at org.apache.maven.surefire.booter.ProviderFactory$ClassLoaderProxy.invoke(ProviderFactory.java:103)
	at $Proxy0.invoke(Unknown Source)
	at org.apache.maven.surefire.booter.SurefireStarter.invokeProvider(SurefireStarter.java:150)
	at org.apache.maven.surefire.booter.SurefireStarter.runSuitesInProcess(SurefireStarter.java:91)
	at org.apache.maven.surefire.booter.ForkedBooter.main(ForkedBooter.java:69)

    testPsearchAdd :
  java.lang.AssertionError
  java.lang.AssertionError: 
	at org.junit.Assert.fail(Assert.java:91)
	at org.junit.Assert.assertTrue(Assert.java:43)
	at org.junit.Assert.assertNotNull(Assert.java:524)
	at org.junit.Assert.assertNotNull(Assert.java:535)
	at org.apache.directory.server.operations.search.PersistentSearchIT.testPsearchAdd(PersistentSearchIT.java:259)
	at sun.reflect.NativeMethodAccessorImpl.invoke0(Native Method)
	at sun.reflect.NativeMethodAccessorImpl.invoke(NativeMethodAccessorImpl.java:39)
	at sun.reflect.DelegatingMethodAccessorImpl.invoke(DelegatingMethodAccessorImpl.java:25)
	at java.lang.reflect.Method.invoke(Method.java:597)
	at org.junit.runners.model.FrameworkMethod$1.runReflectiveCall(FrameworkMethod.java:44)
	at org.junit.internal.runners.model.ReflectiveCallable.run(ReflectiveCallable.java:15)
	at org.junit.runners.model.FrameworkMethod.invokeExplosively(FrameworkMethod.java:41)
	at org.junit.internal.runners.statements.InvokeMethod.evaluate(InvokeMethod.java:20)
	at org.junit.internal.runners.statements.RunAfters.evaluate(RunAfters.java:31)
	at org.junit.runners.BlockJUnit4ClassRunner.runNotIgnored(BlockJUnit4ClassRunner.java:79)
	at org.junit.runners.BlockJUnit4ClassRunner.runChild(BlockJUnit4ClassRunner.java:71)
	at org.apache.directory.server.core.integ.FrameworkRunner.runChild(FrameworkRunner.java:433)
	at org.apache.directory.server.core.integ.FrameworkRunner.runChild(FrameworkRunner.java:56)
	at org.junit.runners.ParentRunner$3.run(ParentRunner.java:193)
	at org.junit.runners.ParentRunner$1.schedule(ParentRunner.java:52)
	at org.junit.runners.ParentRunner.runChildren(ParentRunner.java:191)
	at org.junit.runners.ParentRunner.access$000(ParentRunner.java:42)
	at org.junit.runners.ParentRunner$2.evaluate(ParentRunner.java:184)
	at org.junit.runners.ParentRunner.run(ParentRunner.java:236)
	at org.apache.directory.server.core.integ.FrameworkRunner.run(FrameworkRunner.java:222)
	at org.junit.runners.Suite.runChild(Suite.java:128)
	at org.apache.directory.server.core.integ.FrameworkSuite.runChild(FrameworkSuite.java:191)
	at org.apache.directory.server.core.integ.FrameworkSuite.runChild(FrameworkSuite.java:48)
	at org.junit.runners.ParentRunner$3.run(ParentRunner.java:193)
	at org.junit.runners.ParentRunner$1.schedule(ParentRunner.java:52)
	at org.junit.runners.ParentRunner.runChildren(ParentRunner.java:191)
	at org.junit.runners.ParentRunner.access$000(ParentRunner.java:42)
	at org.junit.runners.ParentRunner$2.evaluate(ParentRunner.java:184)
	at org.junit.runners.ParentRunner.run(ParentRunner.java:236)
	at org.apache.directory.server.core.integ.FrameworkSuite.run(FrameworkSuite.java:158)
	at org.apache.maven.surefire.junit4.JUnit4TestSet.execute(JUnit4TestSet.java:35)
	at org.apache.maven.surefire.junit4.JUnit4Provider.executeTestSet(JUnit4Provider.java:115)
	at org.apache.maven.surefire.junit4.JUnit4Provider.invoke(JUnit4Provider.java:97)
	at sun.reflect.NativeMethodAccessorImpl.invoke0(Native Method)
	at sun.reflect.NativeMethodAccessorImpl.invoke(NativeMethodAccessorImpl.java:39)
	at sun.reflect.DelegatingMethodAccessorImpl.invoke(DelegatingMethodAccessorImpl.java:25)
	at java.lang.reflect.Method.invoke(Method.java:597)
	at org.apache.maven.surefire.booter.ProviderFactory$ClassLoaderProxy.invoke(ProviderFactory.java:103)
	at $Proxy0.invoke(Unknown Source)
	at org.apache.maven.surefire.booter.SurefireStarter.invokeProvider(SurefireStarter.java:150)
	at org.apache.maven.surefire.booter.SurefireStarter.runSuitesInProcess(SurefireStarter.java:91)
	at org.apache.maven.surefire.booter.ForkedBooter.main(ForkedBooter.java:69)

    testPsearchModifyWithEC :
  java.lang.AssertionError
  java.lang.AssertionError: 
	at org.junit.Assert.fail(Assert.java:91)
	at org.junit.Assert.assertTrue(Assert.java:43)
	at org.junit.Assert.assertNotNull(Assert.java:524)
	at org.junit.Assert.assertNotNull(Assert.java:535)
	at org.apache.directory.server.operations.search.PersistentSearchIT.testPsearchModifyWithEC(PersistentSearchIT.java:275)
	at sun.reflect.NativeMethodAccessorImpl.invoke0(Native Method)
	at sun.reflect.NativeMethodAccessorImpl.invoke(NativeMethodAccessorImpl.java:39)
	at sun.reflect.DelegatingMethodAccessorImpl.invoke(DelegatingMethodAccessorImpl.java:25)
	at java.lang.reflect.Method.invoke(Method.java:597)
	at org.junit.runners.model.FrameworkMethod$1.runReflectiveCall(FrameworkMethod.java:44)
	at org.junit.internal.runners.model.ReflectiveCallable.run(ReflectiveCallable.java:15)
	at org.junit.runners.model.FrameworkMethod.invokeExplosively(FrameworkMethod.java:41)
	at org.junit.internal.runners.statements.InvokeMethod.evaluate(InvokeMethod.java:20)
	at org.junit.internal.runners.statements.RunAfters.evaluate(RunAfters.java:31)
	at org.junit.runners.BlockJUnit4ClassRunner.runNotIgnored(BlockJUnit4ClassRunner.java:79)
	at org.junit.runners.BlockJUnit4ClassRunner.runChild(BlockJUnit4ClassRunner.java:71)
	at org.apache.directory.server.core.integ.FrameworkRunner.runChild(FrameworkRunner.java:433)
	at org.apache.directory.server.core.integ.FrameworkRunner.runChild(FrameworkRunner.java:56)
	at org.junit.runners.ParentRunner$3.run(ParentRunner.java:193)
	at org.junit.runners.ParentRunner$1.schedule(ParentRunner.java:52)
	at org.junit.runners.ParentRunner.runChildren(ParentRunner.java:191)
	at org.junit.runners.ParentRunner.access$000(ParentRunner.java:42)
	at org.junit.runners.ParentRunner$2.evaluate(ParentRunner.java:184)
	at org.junit.runners.ParentRunner.run(ParentRunner.java:236)
	at org.apache.directory.server.core.integ.FrameworkRunner.run(FrameworkRunner.java:222)
	at org.junit.runners.Suite.runChild(Suite.java:128)
	at org.apache.directory.server.core.integ.FrameworkSuite.runChild(FrameworkSuite.java:191)
	at org.apache.directory.server.core.integ.FrameworkSuite.runChild(FrameworkSuite.java:48)
	at org.junit.runners.ParentRunner$3.run(ParentRunner.java:193)
	at org.junit.runners.ParentRunner$1.schedule(ParentRunner.java:52)
	at org.junit.runners.ParentRunner.runChildren(ParentRunner.java:191)
	at org.junit.runners.ParentRunner.access$000(ParentRunner.java:42)
	at org.junit.runners.ParentRunner$2.evaluate(ParentRunner.java:184)
	at org.junit.runners.ParentRunner.run(ParentRunner.java:236)
	at org.apache.directory.server.core.integ.FrameworkSuite.run(FrameworkSuite.java:158)
	at org.apache.maven.surefire.junit4.JUnit4TestSet.execute(JUnit4TestSet.java:35)
	at org.apache.maven.surefire.junit4.JUnit4Provider.executeTestSet(JUnit4Provider.java:115)
	at org.apache.maven.surefire.junit4.JUnit4Provider.invoke(JUnit4Provider.java:97)
	at sun.reflect.NativeMethodAccessorImpl.invoke0(Native Method)
	at sun.reflect.NativeMethodAccessorImpl.invoke(NativeMethodAccessorImpl.java:39)
	at sun.reflect.DelegatingMethodAccessorImpl.invoke(DelegatingMethodAccessorImpl.java:25)
	at java.lang.reflect.Method.invoke(Method.java:597)
	at org.apache.maven.surefire.booter.ProviderFactory$ClassLoaderProxy.invoke(ProviderFactory.java:103)
	at $Proxy0.invoke(Unknown Source)
	at org.apache.maven.surefire.booter.SurefireStarter.invokeProvider(SurefireStarter.java:150)
	at org.apache.maven.surefire.booter.SurefireStarter.runSuitesInProcess(SurefireStarter.java:91)
	at org.apache.maven.surefire.booter.ForkedBooter.main(ForkedBooter.java:69)

    testPsearchModifyDnWithEC :
  java.lang.AssertionError
  java.lang.AssertionError: 
	at org.junit.Assert.fail(Assert.java:91)
	at org.junit.Assert.assertTrue(Assert.java:43)
	at org.junit.Assert.assertNotNull(Assert.java:524)
	at org.junit.Assert.assertNotNull(Assert.java:535)
	at org.apache.directory.server.operations.search.PersistentSearchIT.testPsearchModifyDnWithEC(PersistentSearchIT.java:291)
	at sun.reflect.NativeMethodAccessorImpl.invoke0(Native Method)
	at sun.reflect.NativeMethodAccessorImpl.invoke(NativeMethodAccessorImpl.java:39)
	at sun.reflect.DelegatingMethodAccessorImpl.invoke(DelegatingMethodAccessorImpl.java:25)
	at java.lang.reflect.Method.invoke(Method.java:597)
	at org.junit.runners.model.FrameworkMethod$1.runReflectiveCall(FrameworkMethod.java:44)
	at org.junit.internal.runners.model.ReflectiveCallable.run(ReflectiveCallable.java:15)
	at org.junit.runners.model.FrameworkMethod.invokeExplosively(FrameworkMethod.java:41)
	at org.junit.internal.runners.statements.InvokeMethod.evaluate(InvokeMethod.java:20)
	at org.junit.internal.runners.statements.RunAfters.evaluate(RunAfters.java:31)
	at org.junit.runners.BlockJUnit4ClassRunner.runNotIgnored(BlockJUnit4ClassRunner.java:79)
	at org.junit.runners.BlockJUnit4ClassRunner.runChild(BlockJUnit4ClassRunner.java:71)
	at org.apache.directory.server.core.integ.FrameworkRunner.runChild(FrameworkRunner.java:433)
	at org.apache.directory.server.core.integ.FrameworkRunner.runChild(FrameworkRunner.java:56)
	at org.junit.runners.ParentRunner$3.run(ParentRunner.java:193)
	at org.junit.runners.ParentRunner$1.schedule(ParentRunner.java:52)
	at org.junit.runners.ParentRunner.runChildren(ParentRunner.java:191)
	at org.junit.runners.ParentRunner.access$000(ParentRunner.java:42)
	at org.junit.runners.ParentRunner$2.evaluate(ParentRunner.java:184)
	at org.junit.runners.ParentRunner.run(ParentRunner.java:236)
	at org.apache.directory.server.core.integ.FrameworkRunner.run(FrameworkRunner.java:222)
	at org.junit.runners.Suite.runChild(Suite.java:128)
	at org.apache.directory.server.core.integ.FrameworkSuite.runChild(FrameworkSuite.java:191)
	at org.apache.directory.server.core.integ.FrameworkSuite.runChild(FrameworkSuite.java:48)
	at org.junit.runners.ParentRunner$3.run(ParentRunner.java:193)
	at org.junit.runners.ParentRunner$1.schedule(ParentRunner.java:52)
	at org.junit.runners.ParentRunner.runChildren(ParentRunner.java:191)
	at org.junit.runners.ParentRunner.access$000(ParentRunner.java:42)
	at org.junit.runners.ParentRunner$2.evaluate(ParentRunner.java:184)
	at org.junit.runners.ParentRunner.run(ParentRunner.java:236)
	at org.apache.directory.server.core.integ.FrameworkSuite.run(FrameworkSuite.java:158)
	at org.apache.maven.surefire.junit4.JUnit4TestSet.execute(JUnit4TestSet.java:35)
	at org.apache.maven.surefire.junit4.JUnit4Provider.executeTestSet(JUnit4Provider.java:115)
	at org.apache.maven.surefire.junit4.JUnit4Provider.invoke(JUnit4Provider.java:97)
	at sun.reflect.NativeMethodAccessorImpl.invoke0(Native Method)
	at sun.reflect.NativeMethodAccessorImpl.invoke(NativeMethodAccessorImpl.java:39)
	at sun.reflect.DelegatingMethodAccessorImpl.invoke(DelegatingMethodAccessorImpl.java:25)
	at java.lang.reflect.Method.invoke(Method.java:597)
	at org.apache.maven.surefire.booter.ProviderFactory$ClassLoaderProxy.invoke(ProviderFactory.java:103)
	at $Proxy0.invoke(Unknown Source)
	at org.apache.maven.surefire.booter.SurefireStarter.invokeProvider(SurefireStarter.java:150)
	at org.apache.maven.surefire.booter.SurefireStarter.runSuitesInProcess(SurefireStarter.java:91)
	at org.apache.maven.surefire.booter.ForkedBooter.main(ForkedBooter.java:69)

    testPsearchDeleteWithEC :
  java.lang.AssertionError
  java.lang.AssertionError: 
	at org.junit.Assert.fail(Assert.java:91)
	at org.junit.Assert.assertTrue(Assert.java:43)
	at org.junit.Assert.assertNotNull(Assert.java:524)
	at org.junit.Assert.assertNotNull(Assert.java:535)
	at org.apache.directory.server.operations.search.PersistentSearchIT.testPsearchDeleteWithEC(PersistentSearchIT.java:308)
	at sun.reflect.NativeMethodAccessorImpl.invoke0(Native Method)
	at sun.reflect.NativeMethodAccessorImpl.invoke(NativeMethodAccessorImpl.java:39)
	at sun.reflect.DelegatingMethodAccessorImpl.invoke(DelegatingMethodAccessorImpl.java:25)
	at java.lang.reflect.Method.invoke(Method.java:597)
	at org.junit.runners.model.FrameworkMethod$1.runReflectiveCall(FrameworkMethod.java:44)
	at org.junit.internal.runners.model.ReflectiveCallable.run(ReflectiveCallable.java:15)
	at org.junit.runners.model.FrameworkMethod.invokeExplosively(FrameworkMethod.java:41)
	at org.junit.internal.runners.statements.InvokeMethod.evaluate(InvokeMethod.java:20)
	at org.junit.internal.runners.statements.RunAfters.evaluate(RunAfters.java:31)
	at org.junit.runners.BlockJUnit4ClassRunner.runNotIgnored(BlockJUnit4ClassRunner.java:79)
	at org.junit.runners.BlockJUnit4ClassRunner.runChild(BlockJUnit4ClassRunner.java:71)
	at org.apache.directory.server.core.integ.FrameworkRunner.runChild(FrameworkRunner.java:433)
	at org.apache.directory.server.core.integ.FrameworkRunner.runChild(FrameworkRunner.java:56)
	at org.junit.runners.ParentRunner$3.run(ParentRunner.java:193)
	at org.junit.runners.ParentRunner$1.schedule(ParentRunner.java:52)
	at org.junit.runners.ParentRunner.runChildren(ParentRunner.java:191)
	at org.junit.runners.ParentRunner.access$000(ParentRunner.java:42)
	at org.junit.runners.ParentRunner$2.evaluate(ParentRunner.java:184)
	at org.junit.runners.ParentRunner.run(ParentRunner.java:236)
	at org.apache.directory.server.core.integ.FrameworkRunner.run(FrameworkRunner.java:222)
	at org.junit.runners.Suite.runChild(Suite.java:128)
	at org.apache.directory.server.core.integ.FrameworkSuite.runChild(FrameworkSuite.java:191)
	at org.apache.directory.server.core.integ.FrameworkSuite.runChild(FrameworkSuite.java:48)
	at org.junit.runners.ParentRunner$3.run(ParentRunner.java:193)
	at org.junit.runners.ParentRunner$1.schedule(ParentRunner.java:52)
	at org.junit.runners.ParentRunner.runChildren(ParentRunner.java:191)
	at org.junit.runners.ParentRunner.access$000(ParentRunner.java:42)
	at org.junit.runners.ParentRunner$2.evaluate(ParentRunner.java:184)
	at org.junit.runners.ParentRunner.run(ParentRunner.java:236)
	at org.apache.directory.server.core.integ.FrameworkSuite.run(FrameworkSuite.java:158)
	at org.apache.maven.surefire.junit4.JUnit4TestSet.execute(JUnit4TestSet.java:35)
	at org.apache.maven.surefire.junit4.JUnit4Provider.executeTestSet(JUnit4Provider.java:115)
	at org.apache.maven.surefire.junit4.JUnit4Provider.invoke(JUnit4Provider.java:97)
	at sun.reflect.NativeMethodAccessorImpl.invoke0(Native Method)
	at sun.reflect.NativeMethodAccessorImpl.invoke(NativeMethodAccessorImpl.java:39)
	at sun.reflect.DelegatingMethodAccessorImpl.invoke(DelegatingMethodAccessorImpl.java:25)
	at java.lang.reflect.Method.invoke(Method.java:597)
	at org.apache.maven.surefire.booter.ProviderFactory$ClassLoaderProxy.invoke(ProviderFactory.java:103)
	at $Proxy0.invoke(Unknown Source)
	at org.apache.maven.surefire.booter.SurefireStarter.invokeProvider(SurefireStarter.java:150)
	at org.apache.maven.surefire.booter.SurefireStarter.runSuitesInProcess(SurefireStarter.java:91)
	at org.apache.maven.surefire.booter.ForkedBooter.main(ForkedBooter.java:69)

    testPsearchAddWithEC :
  java.lang.AssertionError
  java.lang.AssertionError: 
	at org.junit.Assert.fail(Assert.java:91)
	at org.junit.Assert.assertTrue(Assert.java:43)
	at org.junit.Assert.assertNotNull(Assert.java:524)
	at org.junit.Assert.assertNotNull(Assert.java:535)
	at org.apache.directory.server.operations.search.PersistentSearchIT.testPsearchAddWithEC(PersistentSearchIT.java:324)
	at sun.reflect.NativeMethodAccessorImpl.invoke0(Native Method)
	at sun.reflect.NativeMethodAccessorImpl.invoke(NativeMethodAccessorImpl.java:39)
	at sun.reflect.DelegatingMethodAccessorImpl.invoke(DelegatingMethodAccessorImpl.java:25)
	at java.lang.reflect.Method.invoke(Method.java:597)
	at org.junit.runners.model.FrameworkMethod$1.runReflectiveCall(FrameworkMethod.java:44)
	at org.junit.internal.runners.model.ReflectiveCallable.run(ReflectiveCallable.java:15)
	at org.junit.runners.model.FrameworkMethod.invokeExplosively(FrameworkMethod.java:41)
	at org.junit.internal.runners.statements.InvokeMethod.evaluate(InvokeMethod.java:20)
	at org.junit.internal.runners.statements.RunAfters.evaluate(RunAfters.java:31)
	at org.junit.runners.BlockJUnit4ClassRunner.runNotIgnored(BlockJUnit4ClassRunner.java:79)
	at org.junit.runners.BlockJUnit4ClassRunner.runChild(BlockJUnit4ClassRunner.java:71)
	at org.apache.directory.server.core.integ.FrameworkRunner.runChild(FrameworkRunner.java:433)
	at org.apache.directory.server.core.integ.FrameworkRunner.runChild(FrameworkRunner.java:56)
	at org.junit.runners.ParentRunner$3.run(ParentRunner.java:193)
	at org.junit.runners.ParentRunner$1.schedule(ParentRunner.java:52)
	at org.junit.runners.ParentRunner.runChildren(ParentRunner.java:191)
	at org.junit.runners.ParentRunner.access$000(ParentRunner.java:42)
	at org.junit.runners.ParentRunner$2.evaluate(ParentRunner.java:184)
	at org.junit.runners.ParentRunner.run(ParentRunner.java:236)
	at org.apache.directory.server.core.integ.FrameworkRunner.run(FrameworkRunner.java:222)
	at org.junit.runners.Suite.runChild(Suite.java:128)
	at org.apache.directory.server.core.integ.FrameworkSuite.runChild(FrameworkSuite.java:191)
	at org.apache.directory.server.core.integ.FrameworkSuite.runChild(FrameworkSuite.java:48)
	at org.junit.runners.ParentRunner$3.run(ParentRunner.java:193)
	at org.junit.runners.ParentRunner$1.schedule(ParentRunner.java:52)
	at org.junit.runners.ParentRunner.runChildren(ParentRunner.java:191)
	at org.junit.runners.ParentRunner.access$000(ParentRunner.java:42)
	at org.junit.runners.ParentRunner$2.evaluate(ParentRunner.java:184)
	at org.junit.runners.ParentRunner.run(ParentRunner.java:236)
	at org.apache.directory.server.core.integ.FrameworkSuite.run(FrameworkSuite.java:158)
	at org.apache.maven.surefire.junit4.JUnit4TestSet.execute(JUnit4TestSet.java:35)
	at org.apache.maven.surefire.junit4.JUnit4Provider.executeTestSet(JUnit4Provider.java:115)
	at org.apache.maven.surefire.junit4.JUnit4Provider.invoke(JUnit4Provider.java:97)
	at sun.reflect.NativeMethodAccessorImpl.invoke0(Native Method)
	at sun.reflect.NativeMethodAccessorImpl.invoke(NativeMethodAccessorImpl.java:39)
	at sun.reflect.DelegatingMethodAccessorImpl.invoke(DelegatingMethodAccessorImpl.java:25)
	at java.lang.reflect.Method.invoke(Method.java:597)
	at org.apache.maven.surefire.booter.ProviderFactory$ClassLoaderProxy.invoke(ProviderFactory.java:103)
	at $Proxy0.invoke(Unknown Source)
	at org.apache.maven.surefire.booter.SurefireStarter.invokeProvider(SurefireStarter.java:150)
	at org.apache.maven.surefire.booter.SurefireStarter.runSuitesInProcess(SurefireStarter.java:91)
	at org.apache.maven.surefire.booter.ForkedBooter.main(ForkedBooter.java:69)

    testPsearchAddModifyEnabledWithEC :
  java.lang.AssertionError
  java.lang.AssertionError: 
	at org.junit.Assert.fail(Assert.java:91)
	at org.junit.Assert.assertTrue(Assert.java:43)
	at org.junit.Assert.assertNotNull(Assert.java:524)
	at org.junit.Assert.assertNotNull(Assert.java:535)
	at org.apache.directory.server.operations.search.PersistentSearchIT.testPsearchAddModifyEnabledWithEC(PersistentSearchIT.java:345)
	at sun.reflect.NativeMethodAccessorImpl.invoke0(Native Method)
	at sun.reflect.NativeMethodAccessorImpl.invoke(NativeMethodAccessorImpl.java:39)
	at sun.reflect.DelegatingMethodAccessorImpl.invoke(DelegatingMethodAccessorImpl.java:25)
	at java.lang.reflect.Method.invoke(Method.java:597)
	at org.junit.runners.model.FrameworkMethod$1.runReflectiveCall(FrameworkMethod.java:44)
	at org.junit.internal.runners.model.ReflectiveCallable.run(ReflectiveCallable.java:15)
	at org.junit.runners.model.FrameworkMethod.invokeExplosively(FrameworkMethod.java:41)
	at org.junit.internal.runners.statements.InvokeMethod.evaluate(InvokeMethod.java:20)
	at org.junit.internal.runners.statements.RunAfters.evaluate(RunAfters.java:31)
	at org.junit.runners.BlockJUnit4ClassRunner.runNotIgnored(BlockJUnit4ClassRunner.java:79)
	at org.junit.runners.BlockJUnit4ClassRunner.runChild(BlockJUnit4ClassRunner.java:71)
	at org.apache.directory.server.core.integ.FrameworkRunner.runChild(FrameworkRunner.java:433)
	at org.apache.directory.server.core.integ.FrameworkRunner.runChild(FrameworkRunner.java:56)
	at org.junit.runners.ParentRunner$3.run(ParentRunner.java:193)
	at org.junit.runners.ParentRunner$1.schedule(ParentRunner.java:52)
	at org.junit.runners.ParentRunner.runChildren(ParentRunner.java:191)
	at org.junit.runners.ParentRunner.access$000(ParentRunner.java:42)
	at org.junit.runners.ParentRunner$2.evaluate(ParentRunner.java:184)
	at org.junit.runners.ParentRunner.run(ParentRunner.java:236)
	at org.apache.directory.server.core.integ.FrameworkRunner.run(FrameworkRunner.java:222)
	at org.junit.runners.Suite.runChild(Suite.java:128)
	at org.apache.directory.server.core.integ.FrameworkSuite.runChild(FrameworkSuite.java:191)
	at org.apache.directory.server.core.integ.FrameworkSuite.runChild(FrameworkSuite.java:48)
	at org.junit.runners.ParentRunner$3.run(ParentRunner.java:193)
	at org.junit.runners.ParentRunner$1.schedule(ParentRunner.java:52)
	at org.junit.runners.ParentRunner.runChildren(ParentRunner.java:191)
	at org.junit.runners.ParentRunner.access$000(ParentRunner.java:42)
	at org.junit.runners.ParentRunner$2.evaluate(ParentRunner.java:184)
	at org.junit.runners.ParentRunner.run(ParentRunner.java:236)
	at org.apache.directory.server.core.integ.FrameworkSuite.run(FrameworkSuite.java:158)
	at org.apache.maven.surefire.junit4.JUnit4TestSet.execute(JUnit4TestSet.java:35)
	at org.apache.maven.surefire.junit4.JUnit4Provider.executeTestSet(JUnit4Provider.java:115)
	at org.apache.maven.surefire.junit4.JUnit4Provider.invoke(JUnit4Provider.java:97)
	at sun.reflect.NativeMethodAccessorImpl.invoke0(Native Method)
	at sun.reflect.NativeMethodAccessorImpl.invoke(NativeMethodAccessorImpl.java:39)
	at sun.reflect.DelegatingMethodAccessorImpl.invoke(DelegatingMethodAccessorImpl.java:25)
	at java.lang.reflect.Method.invoke(Method.java:597)
	at org.apache.maven.surefire.booter.ProviderFactory$ClassLoaderProxy.invoke(ProviderFactory.java:103)
	at $Proxy0.invoke(Unknown Source)
	at org.apache.maven.surefire.booter.SurefireStarter.invokeProvider(SurefireStarter.java:150)
	at org.apache.maven.surefire.booter.SurefireStarter.runSuitesInProcess(SurefireStarter.java:91)
	at org.apache.maven.surefire.booter.ForkedBooter.main(ForkedBooter.java:69)

    testRequestConstrainedUnlimitByConfiguration :
  java.lang.Exception
  java.lang.Exception: Unexpected exception, expected<javax.naming.TimeLimitExceededException> but was<javax.naming.NamingException>
	at org.junit.internal.runners.statements.ExpectException.evaluate(ExpectException.java:28)
	at org.junit.internal.runners.statements.RunBefores.evaluate(RunBefores.java:28)
	at org.junit.internal.runners.statements.RunAfters.evaluate(RunAfters.java:31)
	at org.junit.runners.BlockJUnit4ClassRunner.runNotIgnored(BlockJUnit4ClassRunner.java:79)
	at org.junit.runners.BlockJUnit4ClassRunner.runChild(BlockJUnit4ClassRunner.java:71)
	at org.apache.directory.server.core.integ.FrameworkRunner.runChild(FrameworkRunner.java:433)
	at org.apache.directory.server.core.integ.FrameworkRunner.runChild(FrameworkRunner.java:56)
	at org.junit.runners.ParentRunner$3.run(ParentRunner.java:193)
	at org.junit.runners.ParentRunner$1.schedule(ParentRunner.java:52)
	at org.junit.runners.ParentRunner.runChildren(ParentRunner.java:191)
	at org.junit.runners.ParentRunner.access$000(ParentRunner.java:42)
	at org.junit.runners.ParentRunner$2.evaluate(ParentRunner.java:184)
	at org.junit.runners.ParentRunner.run(ParentRunner.java:236)
	at org.apache.directory.server.core.integ.FrameworkRunner.run(FrameworkRunner.java:222)
	at org.junit.runners.Suite.runChild(Suite.java:128)
	at org.apache.directory.server.core.integ.FrameworkSuite.runChild(FrameworkSuite.java:191)
	at org.apache.directory.server.core.integ.FrameworkSuite.runChild(FrameworkSuite.java:48)
	at org.junit.runners.ParentRunner$3.run(ParentRunner.java:193)
	at org.junit.runners.ParentRunner$1.schedule(ParentRunner.java:52)
	at org.junit.runners.ParentRunner.runChildren(ParentRunner.java:191)
	at org.junit.runners.ParentRunner.access$000(ParentRunner.java:42)
	at org.junit.runners.ParentRunner$2.evaluate(ParentRunner.java:184)
	at org.junit.runners.ParentRunner.run(ParentRunner.java:236)
	at org.apache.directory.server.core.integ.FrameworkSuite.run(FrameworkSuite.java:158)
	at org.apache.maven.surefire.junit4.JUnit4TestSet.execute(JUnit4TestSet.java:35)
	at org.apache.maven.surefire.junit4.JUnit4Provider.executeTestSet(JUnit4Provider.java:115)
	at org.apache.maven.surefire.junit4.JUnit4Provider.invoke(JUnit4Provider.java:97)
	at sun.reflect.NativeMethodAccessorImpl.invoke0(Native Method)
	at sun.reflect.NativeMethodAccessorImpl.invoke(NativeMethodAccessorImpl.java:39)
	at sun.reflect.DelegatingMethodAccessorImpl.invoke(DelegatingMethodAccessorImpl.java:25)
	at java.lang.reflect.Method.invoke(Method.java:597)
	at org.apache.maven.surefire.booter.ProviderFactory$ClassLoaderProxy.invoke(ProviderFactory.java:103)
	at $Proxy0.invoke(Unknown Source)
	at org.apache.maven.surefire.booter.SurefireStarter.invokeProvider(SurefireStarter.java:150)
	at org.apache.maven.surefire.booter.SurefireStarter.runSuitesInProcess(SurefireStarter.java:91)
	at org.apache.maven.surefire.booter.ForkedBooter.main(ForkedBooter.java:69)
Caused by: javax.naming.NamingException: [LDAP: error code 36 - ALIAS_DEREFERENCING_PROBLEM: failed for MessageType : SEARCH_REQUEST
Message ID : 2
    SearchRequest
        baseDn : 'ou=actors,ou=system'
        filter : '(objectClass=*:[15])'
        scope : single level
        typesOnly : false
        Size Limit : no limit
        Time Limit : 1
        Deref Aliases : deref Always
        attributes : 
org.apache.directory.shared.ldap.model.message.SearchRequestImpl@c4cd09a    ManageDsaITImpl Control
        Type OID    : '2.16.840.1.113730.3.4.2'
        Criticality : 'false''
: ERR_333 Unexpected exception.]; remaining name 'ou=actors,ou=system'
	at com.sun.jndi.ldap.LdapCtx.mapErrorCode(LdapCtx.java:3017)
	at com.sun.jndi.ldap.LdapCtx.processReturnCode(LdapCtx.java:2987)
	at com.sun.jndi.ldap.LdapCtx.processReturnCode(LdapCtx.java:2794)
	at com.sun.jndi.ldap.LdapCtx.searchAux(LdapCtx.java:1826)
	at com.sun.jndi.ldap.LdapCtx.c_search(LdapCtx.java:1749)
	at com.sun.jndi.toolkit.ctx.ComponentDirContext.p_search(ComponentDirContext.java:368)
	at com.sun.jndi.toolkit.ctx.PartialCompositeDirContext.search(PartialCompositeDirContext.java:338)
	at com.sun.jndi.toolkit.ctx.PartialCompositeDirContext.search(PartialCompositeDirContext.java:321)
	at javax.naming.directory.InitialDirContext.search(InitialDirContext.java:248)
	at org.apache.directory.server.operations.search.SearchLimitsIT.getActorsWithLimit(SearchLimitsIT.java:454)
	at org.apache.directory.server.operations.search.SearchLimitsIT.testRequestConstrainedUnlimitByConfiguration(SearchLimitsIT.java:207)
	at sun.reflect.NativeMethodAccessorImpl.invoke0(Native Method)
	at sun.reflect.NativeMethodAccessorImpl.invoke(NativeMethodAccessorImpl.java:39)
	at sun.reflect.DelegatingMethodAccessorImpl.invoke(DelegatingMethodAccessorImpl.java:25)
	at java.lang.reflect.Method.invoke(Method.java:597)
	at org.junit.runners.model.FrameworkMethod$1.runReflectiveCall(FrameworkMethod.java:44)
	at org.junit.internal.runners.model.ReflectiveCallable.run(ReflectiveCallable.java:15)
	at org.junit.runners.model.FrameworkMethod.invokeExplosively(FrameworkMethod.java:41)
	at org.junit.internal.runners.statements.InvokeMethod.evaluate(InvokeMethod.java:20)
	at org.junit.internal.runners.statements.ExpectException.evaluate(ExpectException.java:21)
	... 35 more


    testRequestConstrainedLessThanConfiguration :
  java.lang.Exception
  java.lang.Exception: Unexpected exception, expected<javax.naming.TimeLimitExceededException> but was<javax.naming.NamingException>
	at org.junit.internal.runners.statements.ExpectException.evaluate(ExpectException.java:28)
	at org.junit.internal.runners.statements.RunBefores.evaluate(RunBefores.java:28)
	at org.junit.internal.runners.statements.RunAfters.evaluate(RunAfters.java:31)
	at org.junit.runners.BlockJUnit4ClassRunner.runNotIgnored(BlockJUnit4ClassRunner.java:79)
	at org.junit.runners.BlockJUnit4ClassRunner.runChild(BlockJUnit4ClassRunner.java:71)
	at org.apache.directory.server.core.integ.FrameworkRunner.runChild(FrameworkRunner.java:433)
	at org.apache.directory.server.core.integ.FrameworkRunner.runChild(FrameworkRunner.java:56)
	at org.junit.runners.ParentRunner$3.run(ParentRunner.java:193)
	at org.junit.runners.ParentRunner$1.schedule(ParentRunner.java:52)
	at org.junit.runners.ParentRunner.runChildren(ParentRunner.java:191)
	at org.junit.runners.ParentRunner.access$000(ParentRunner.java:42)
	at org.junit.runners.ParentRunner$2.evaluate(ParentRunner.java:184)
	at org.junit.runners.ParentRunner.run(ParentRunner.java:236)
	at org.apache.directory.server.core.integ.FrameworkRunner.run(FrameworkRunner.java:222)
	at org.junit.runners.Suite.runChild(Suite.java:128)
	at org.apache.directory.server.core.integ.FrameworkSuite.runChild(FrameworkSuite.java:191)
	at org.apache.directory.server.core.integ.FrameworkSuite.runChild(FrameworkSuite.java:48)
	at org.junit.runners.ParentRunner$3.run(ParentRunner.java:193)
	at org.junit.runners.ParentRunner$1.schedule(ParentRunner.java:52)
	at org.junit.runners.ParentRunner.runChildren(ParentRunner.java:191)
	at org.junit.runners.ParentRunner.access$000(ParentRunner.java:42)
	at org.junit.runners.ParentRunner$2.evaluate(ParentRunner.java:184)
	at org.junit.runners.ParentRunner.run(ParentRunner.java:236)
	at org.apache.directory.server.core.integ.FrameworkSuite.run(FrameworkSuite.java:158)
	at org.apache.maven.surefire.junit4.JUnit4TestSet.execute(JUnit4TestSet.java:35)
	at org.apache.maven.surefire.junit4.JUnit4Provider.executeTestSet(JUnit4Provider.java:115)
	at org.apache.maven.surefire.junit4.JUnit4Provider.invoke(JUnit4Provider.java:97)
	at sun.reflect.NativeMethodAccessorImpl.invoke0(Native Method)
	at sun.reflect.NativeMethodAccessorImpl.invoke(NativeMethodAccessorImpl.java:39)
	at sun.reflect.DelegatingMethodAccessorImpl.invoke(DelegatingMethodAccessorImpl.java:25)
	at java.lang.reflect.Method.invoke(Method.java:597)
	at org.apache.maven.surefire.booter.ProviderFactory$ClassLoaderProxy.invoke(ProviderFactory.java:103)
	at $Proxy0.invoke(Unknown Source)
	at org.apache.maven.surefire.booter.SurefireStarter.invokeProvider(SurefireStarter.java:150)
	at org.apache.maven.surefire.booter.SurefireStarter.runSuitesInProcess(SurefireStarter.java:91)
	at org.apache.maven.surefire.booter.ForkedBooter.main(ForkedBooter.java:69)
Caused by: javax.naming.NamingException: [LDAP: error code 36 - ALIAS_DEREFERENCING_PROBLEM: failed for MessageType : SEARCH_REQUEST
Message ID : 2
    SearchRequest
        baseDn : 'ou=actors,ou=system'
        filter : '(objectClass=*:[15])'
        scope : single level
        typesOnly : false
        Size Limit : no limit
        Time Limit : 1
        Deref Aliases : deref Always
        attributes : 
org.apache.directory.shared.ldap.model.message.SearchRequestImpl@c4cd09a    ManageDsaITImpl Control
        Type OID    : '2.16.840.1.113730.3.4.2'
        Criticality : 'false''
: ERR_333 Unexpected exception.]; remaining name 'ou=actors,ou=system'
	at com.sun.jndi.ldap.LdapCtx.mapErrorCode(LdapCtx.java:3017)
	at com.sun.jndi.ldap.LdapCtx.processReturnCode(LdapCtx.java:2987)
	at com.sun.jndi.ldap.LdapCtx.processReturnCode(LdapCtx.java:2794)
	at com.sun.jndi.ldap.LdapCtx.searchAux(LdapCtx.java:1826)
	at com.sun.jndi.ldap.LdapCtx.c_search(LdapCtx.java:1749)
	at com.sun.jndi.toolkit.ctx.ComponentDirContext.p_search(ComponentDirContext.java:368)
	at com.sun.jndi.toolkit.ctx.PartialCompositeDirContext.search(PartialCompositeDirContext.java:338)
	at com.sun.jndi.toolkit.ctx.PartialCompositeDirContext.search(PartialCompositeDirContext.java:321)
	at javax.naming.directory.InitialDirContext.search(InitialDirContext.java:248)
	at org.apache.directory.server.operations.search.SearchLimitsIT.getActorsWithLimit(SearchLimitsIT.java:454)
	at org.apache.directory.server.operations.search.SearchLimitsIT.testRequestConstrainedLessThanConfiguration(SearchLimitsIT.java:222)
	at sun.reflect.NativeMethodAccessorImpl.invoke0(Native Method)
	at sun.reflect.NativeMethodAccessorImpl.invoke(NativeMethodAccessorImpl.java:39)
	at sun.reflect.DelegatingMethodAccessorImpl.invoke(DelegatingMethodAccessorImpl.java:25)
	at java.lang.reflect.Method.invoke(Method.java:597)
	at org.junit.runners.model.FrameworkMethod$1.runReflectiveCall(FrameworkMethod.java:44)
	at org.junit.internal.runners.model.ReflectiveCallable.run(ReflectiveCallable.java:15)
	at org.junit.runners.model.FrameworkMethod.invokeExplosively(FrameworkMethod.java:41)
	at org.junit.internal.runners.statements.InvokeMethod.evaluate(InvokeMethod.java:20)
	at org.junit.internal.runners.statements.ExpectException.evaluate(ExpectException.java:21)
	... 35 more


    testRequestConstrainedGreaterThanConfiguration :
  java.lang.Exception
  java.lang.Exception: Unexpected exception, expected<javax.naming.TimeLimitExceededException> but was<javax.naming.NamingException>
	at org.junit.internal.runners.statements.ExpectException.evaluate(ExpectException.java:28)
	at org.junit.internal.runners.statements.RunBefores.evaluate(RunBefores.java:28)
	at org.junit.internal.runners.statements.RunAfters.evaluate(RunAfters.java:31)
	at org.junit.runners.BlockJUnit4ClassRunner.runNotIgnored(BlockJUnit4ClassRunner.java:79)
	at org.junit.runners.BlockJUnit4ClassRunner.runChild(BlockJUnit4ClassRunner.java:71)
	at org.apache.directory.server.core.integ.FrameworkRunner.runChild(FrameworkRunner.java:433)
	at org.apache.directory.server.core.integ.FrameworkRunner.runChild(FrameworkRunner.java:56)
	at org.junit.runners.ParentRunner$3.run(ParentRunner.java:193)
	at org.junit.runners.ParentRunner$1.schedule(ParentRunner.java:52)
	at org.junit.runners.ParentRunner.runChildren(ParentRunner.java:191)
	at org.junit.runners.ParentRunner.access$000(ParentRunner.java:42)
	at org.junit.runners.ParentRunner$2.evaluate(ParentRunner.java:184)
	at org.junit.runners.ParentRunner.run(ParentRunner.java:236)
	at org.apache.directory.server.core.integ.FrameworkRunner.run(FrameworkRunner.java:222)
	at org.junit.runners.Suite.runChild(Suite.java:128)
	at org.apache.directory.server.core.integ.FrameworkSuite.runChild(FrameworkSuite.java:191)
	at org.apache.directory.server.core.integ.FrameworkSuite.runChild(FrameworkSuite.java:48)
	at org.junit.runners.ParentRunner$3.run(ParentRunner.java:193)
	at org.junit.runners.ParentRunner$1.schedule(ParentRunner.java:52)
	at org.junit.runners.ParentRunner.runChildren(ParentRunner.java:191)
	at org.junit.runners.ParentRunner.access$000(ParentRunner.java:42)
	at org.junit.runners.ParentRunner$2.evaluate(ParentRunner.java:184)
	at org.junit.runners.ParentRunner.run(ParentRunner.java:236)
	at org.apache.directory.server.core.integ.FrameworkSuite.run(FrameworkSuite.java:158)
	at org.apache.maven.surefire.junit4.JUnit4TestSet.execute(JUnit4TestSet.java:35)
	at org.apache.maven.surefire.junit4.JUnit4Provider.executeTestSet(JUnit4Provider.java:115)
	at org.apache.maven.surefire.junit4.JUnit4Provider.invoke(JUnit4Provider.java:97)
	at sun.reflect.NativeMethodAccessorImpl.invoke0(Native Method)
	at sun.reflect.NativeMethodAccessorImpl.invoke(NativeMethodAccessorImpl.java:39)
	at sun.reflect.DelegatingMethodAccessorImpl.invoke(DelegatingMethodAccessorImpl.java:25)
	at java.lang.reflect.Method.invoke(Method.java:597)
	at org.apache.maven.surefire.booter.ProviderFactory$ClassLoaderProxy.invoke(ProviderFactory.java:103)
	at $Proxy0.invoke(Unknown Source)
	at org.apache.maven.surefire.booter.SurefireStarter.invokeProvider(SurefireStarter.java:150)
	at org.apache.maven.surefire.booter.SurefireStarter.runSuitesInProcess(SurefireStarter.java:91)
	at org.apache.maven.surefire.booter.ForkedBooter.main(ForkedBooter.java:69)
Caused by: javax.naming.NamingException: [LDAP: error code 36 - ALIAS_DEREFERENCING_PROBLEM: failed for MessageType : SEARCH_REQUEST
Message ID : 2
    SearchRequest
        baseDn : 'ou=actors,ou=system'
        filter : '(objectClass=*:[15])'
        scope : single level
        typesOnly : false
        Size Limit : no limit
        Time Limit : 101
        Deref Aliases : deref Always
        attributes : 
org.apache.directory.shared.ldap.model.message.SearchRequestImpl@ccc41fe    ManageDsaITImpl Control
        Type OID    : '2.16.840.1.113730.3.4.2'
        Criticality : 'false''
: ERR_333 Unexpected exception.]; remaining name 'ou=actors,ou=system'
	at com.sun.jndi.ldap.LdapCtx.mapErrorCode(LdapCtx.java:3017)
	at com.sun.jndi.ldap.LdapCtx.processReturnCode(LdapCtx.java:2987)
	at com.sun.jndi.ldap.LdapCtx.processReturnCode(LdapCtx.java:2794)
	at com.sun.jndi.ldap.LdapCtx.searchAux(LdapCtx.java:1826)
	at com.sun.jndi.ldap.LdapCtx.c_search(LdapCtx.java:1749)
	at com.sun.jndi.toolkit.ctx.ComponentDirContext.p_search(ComponentDirContext.java:368)
	at com.sun.jndi.toolkit.ctx.PartialCompositeDirContext.search(PartialCompositeDirContext.java:338)
	at com.sun.jndi.toolkit.ctx.PartialCompositeDirContext.search(PartialCompositeDirContext.java:321)
	at javax.naming.directory.InitialDirContext.search(InitialDirContext.java:248)
	at org.apache.directory.server.operations.search.SearchLimitsIT.getActorsWithLimit(SearchLimitsIT.java:454)
	at org.apache.directory.server.operations.search.SearchLimitsIT.testRequestConstrainedGreaterThanConfiguration(SearchLimitsIT.java:237)
	at sun.reflect.NativeMethodAccessorImpl.invoke0(Native Method)
	at sun.reflect.NativeMethodAccessorImpl.invoke(NativeMethodAccessorImpl.java:39)
	at sun.reflect.DelegatingMethodAccessorImpl.invoke(DelegatingMethodAccessorImpl.java:25)
	at java.lang.reflect.Method.invoke(Method.java:597)
	at org.junit.runners.model.FrameworkMethod$1.runReflectiveCall(FrameworkMethod.java:44)
	at org.junit.internal.runners.model.ReflectiveCallable.run(ReflectiveCallable.java:15)
	at org.junit.runners.model.FrameworkMethod.invokeExplosively(FrameworkMethod.java:41)
	at org.junit.internal.runners.statements.InvokeMethod.evaluate(InvokeMethod.java:20)
	at org.junit.internal.runners.statements.ExpectException.evaluate(ExpectException.java:21)
	... 35 more


    testRequestUnlimitedConfigurationLimited :
  javax.naming.NamingException
  javax.naming.NamingException: [LDAP: error code 36 - ALIAS_DEREFERENCING_PROBLEM: failed for MessageType : SEARCH_REQUEST
Message ID : 2
    SearchRequest
        baseDn : 'ou=actors,ou=system'
        filter : '(objectClass=*:[15])'
        scope : single level
        typesOnly : false
        Size Limit : no limit
        Time Limit : no limit
        Deref Aliases : deref Always
        attributes : 
org.apache.directory.shared.ldap.model.message.SearchRequestImpl@c4b8a59    ManageDsaITImpl Control
        Type OID    : '2.16.840.1.113730.3.4.2'
        Criticality : 'false''
: ERR_333 Unexpected exception.]; remaining name 'ou=actors,ou=system'
	at com.sun.jndi.ldap.LdapCtx.mapErrorCode(LdapCtx.java:3017)
	at com.sun.jndi.ldap.LdapCtx.processReturnCode(LdapCtx.java:2987)
	at com.sun.jndi.ldap.LdapCtx.processReturnCode(LdapCtx.java:2794)
	at com.sun.jndi.ldap.LdapCtx.searchAux(LdapCtx.java:1826)
	at com.sun.jndi.ldap.LdapCtx.c_search(LdapCtx.java:1749)
	at com.sun.jndi.toolkit.ctx.ComponentDirContext.p_search(ComponentDirContext.java:368)
	at com.sun.jndi.toolkit.ctx.PartialCompositeDirContext.search(PartialCompositeDirContext.java:338)
	at com.sun.jndi.toolkit.ctx.PartialCompositeDirContext.search(PartialCompositeDirContext.java:321)
	at javax.naming.directory.InitialDirContext.search(InitialDirContext.java:248)
	at org.apache.directory.server.operations.search.SearchLimitsIT.getActorsWithLimit(SearchLimitsIT.java:454)
	at org.apache.directory.server.operations.search.SearchLimitsIT.testRequestUnlimitedConfigurationLimited(SearchLimitsIT.java:251)
	at sun.reflect.NativeMethodAccessorImpl.invoke0(Native Method)
	at sun.reflect.NativeMethodAccessorImpl.invoke(NativeMethodAccessorImpl.java:39)
	at sun.reflect.DelegatingMethodAccessorImpl.invoke(DelegatingMethodAccessorImpl.java:25)
	at java.lang.reflect.Method.invoke(Method.java:597)
	at org.junit.runners.model.FrameworkMethod$1.runReflectiveCall(FrameworkMethod.java:44)
	at org.junit.internal.runners.model.ReflectiveCallable.run(ReflectiveCallable.java:15)
	at org.junit.runners.model.FrameworkMethod.invokeExplosively(FrameworkMethod.java:41)
	at org.junit.internal.runners.statements.InvokeMethod.evaluate(InvokeMethod.java:20)
	at org.junit.internal.runners.statements.RunBefores.evaluate(RunBefores.java:28)
	at org.junit.internal.runners.statements.RunAfters.evaluate(RunAfters.java:31)
	at org.junit.runners.BlockJUnit4ClassRunner.runNotIgnored(BlockJUnit4ClassRunner.java:79)
	at org.junit.runners.BlockJUnit4ClassRunner.runChild(BlockJUnit4ClassRunner.java:71)
	at org.apache.directory.server.core.integ.FrameworkRunner.runChild(FrameworkRunner.java:433)
	at org.apache.directory.server.core.integ.FrameworkRunner.runChild(FrameworkRunner.java:56)
	at org.junit.runners.ParentRunner$3.run(ParentRunner.java:193)
	at org.junit.runners.ParentRunner$1.schedule(ParentRunner.java:52)
	at org.junit.runners.ParentRunner.runChildren(ParentRunner.java:191)
	at org.junit.runners.ParentRunner.access$000(ParentRunner.java:42)
	at org.junit.runners.ParentRunner$2.evaluate(ParentRunner.java:184)
	at org.junit.runners.ParentRunner.run(ParentRunner.java:236)
	at org.apache.directory.server.core.integ.FrameworkRunner.run(FrameworkRunner.java:222)
	at org.junit.runners.Suite.runChild(Suite.java:128)
	at org.apache.directory.server.core.integ.FrameworkSuite.runChild(FrameworkSuite.java:191)
	at org.apache.directory.server.core.integ.FrameworkSuite.runChild(FrameworkSuite.java:48)
	at org.junit.runners.ParentRunner$3.run(ParentRunner.java:193)
	at org.junit.runners.ParentRunner$1.schedule(ParentRunner.java:52)
	at org.junit.runners.ParentRunner.runChildren(ParentRunner.java:191)
	at org.junit.runners.ParentRunner.access$000(ParentRunner.java:42)
	at org.junit.runners.ParentRunner$2.evaluate(ParentRunner.java:184)
	at org.junit.runners.ParentRunner.run(ParentRunner.java:236)
	at org.apache.directory.server.core.integ.FrameworkSuite.run(FrameworkSuite.java:158)
	at org.apache.maven.surefire.junit4.JUnit4TestSet.execute(JUnit4TestSet.java:35)
	at org.apache.maven.surefire.junit4.JUnit4Provider.executeTestSet(JUnit4Provider.java:115)
	at org.apache.maven.surefire.junit4.JUnit4Provider.invoke(JUnit4Provider.java:97)
	at sun.reflect.NativeMethodAccessorImpl.invoke0(Native Method)
	at sun.reflect.NativeMethodAccessorImpl.invoke(NativeMethodAccessorImpl.java:39)
	at sun.reflect.DelegatingMethodAccessorImpl.invoke(DelegatingMethodAccessorImpl.java:25)
	at java.lang.reflect.Method.invoke(Method.java:597)
	at org.apache.maven.surefire.booter.ProviderFactory$ClassLoaderProxy.invoke(ProviderFactory.java:103)
	at $Proxy0.invoke(Unknown Source)
	at org.apache.maven.surefire.booter.SurefireStarter.invokeProvider(SurefireStarter.java:150)
	at org.apache.maven.surefire.booter.SurefireStarter.runSuitesInProcess(SurefireStarter.java:91)
	at org.apache.maven.surefire.booter.ForkedBooter.main(ForkedBooter.java:69)

    testNonAdminRequestUnlimitedConfigurationLimited :
  java.lang.Exception
  java.lang.Exception: Unexpected exception, expected<javax.naming.TimeLimitExceededException> but was<javax.naming.NamingException>
	at org.junit.internal.runners.statements.ExpectException.evaluate(ExpectException.java:28)
	at org.junit.internal.runners.statements.RunBefores.evaluate(RunBefores.java:28)
	at org.junit.internal.runners.statements.RunAfters.evaluate(RunAfters.java:31)
	at org.junit.runners.BlockJUnit4ClassRunner.runNotIgnored(BlockJUnit4ClassRunner.java:79)
	at org.junit.runners.BlockJUnit4ClassRunner.runChild(BlockJUnit4ClassRunner.java:71)
	at org.apache.directory.server.core.integ.FrameworkRunner.runChild(FrameworkRunner.java:433)
	at org.apache.directory.server.core.integ.FrameworkRunner.runChild(FrameworkRunner.java:56)
	at org.junit.runners.ParentRunner$3.run(ParentRunner.java:193)
	at org.junit.runners.ParentRunner$1.schedule(ParentRunner.java:52)
	at org.junit.runners.ParentRunner.runChildren(ParentRunner.java:191)
	at org.junit.runners.ParentRunner.access$000(ParentRunner.java:42)
	at org.junit.runners.ParentRunner$2.evaluate(ParentRunner.java:184)
	at org.junit.runners.ParentRunner.run(ParentRunner.java:236)
	at org.apache.directory.server.core.integ.FrameworkRunner.run(FrameworkRunner.java:222)
	at org.junit.runners.Suite.runChild(Suite.java:128)
	at org.apache.directory.server.core.integ.FrameworkSuite.runChild(FrameworkSuite.java:191)
	at org.apache.directory.server.core.integ.FrameworkSuite.runChild(FrameworkSuite.java:48)
	at org.junit.runners.ParentRunner$3.run(ParentRunner.java:193)
	at org.junit.runners.ParentRunner$1.schedule(ParentRunner.java:52)
	at org.junit.runners.ParentRunner.runChildren(ParentRunner.java:191)
	at org.junit.runners.ParentRunner.access$000(ParentRunner.java:42)
	at org.junit.runners.ParentRunner$2.evaluate(ParentRunner.java:184)
	at org.junit.runners.ParentRunner.run(ParentRunner.java:236)
	at org.apache.directory.server.core.integ.FrameworkSuite.run(FrameworkSuite.java:158)
	at org.apache.maven.surefire.junit4.JUnit4TestSet.execute(JUnit4TestSet.java:35)
	at org.apache.maven.surefire.junit4.JUnit4Provider.executeTestSet(JUnit4Provider.java:115)
	at org.apache.maven.surefire.junit4.JUnit4Provider.invoke(JUnit4Provider.java:97)
	at sun.reflect.NativeMethodAccessorImpl.invoke0(Native Method)
	at sun.reflect.NativeMethodAccessorImpl.invoke(NativeMethodAccessorImpl.java:39)
	at sun.reflect.DelegatingMethodAccessorImpl.invoke(DelegatingMethodAccessorImpl.java:25)
	at java.lang.reflect.Method.invoke(Method.java:597)
	at org.apache.maven.surefire.booter.ProviderFactory$ClassLoaderProxy.invoke(ProviderFactory.java:103)
	at $Proxy0.invoke(Unknown Source)
	at org.apache.maven.surefire.booter.SurefireStarter.invokeProvider(SurefireStarter.java:150)
	at org.apache.maven.surefire.booter.SurefireStarter.runSuitesInProcess(SurefireStarter.java:91)
	at org.apache.maven.surefire.booter.ForkedBooter.main(ForkedBooter.java:69)
Caused by: javax.naming.NamingException: [LDAP: error code 36 - ALIAS_DEREFERENCING_PROBLEM: failed for MessageType : SEARCH_REQUEST
Message ID : 2
    SearchRequest
        baseDn : 'ou=actors,ou=system'
        filter : '(objectClass=*:[15])'
        scope : single level
        typesOnly : false
        Size Limit : no limit
        Time Limit : no limit
        Deref Aliases : deref Always
        attributes : 
org.apache.directory.shared.ldap.model.message.SearchRequestImpl@c4b8a59    ManageDsaITImpl Control
        Type OID    : '2.16.840.1.113730.3.4.2'
        Criticality : 'false''
: ERR_333 Unexpected exception.]; remaining name 'ou=actors,ou=system'
	at com.sun.jndi.ldap.LdapCtx.mapErrorCode(LdapCtx.java:3017)
	at com.sun.jndi.ldap.LdapCtx.processReturnCode(LdapCtx.java:2987)
	at com.sun.jndi.ldap.LdapCtx.processReturnCode(LdapCtx.java:2794)
	at com.sun.jndi.ldap.LdapCtx.searchAux(LdapCtx.java:1826)
	at com.sun.jndi.ldap.LdapCtx.c_search(LdapCtx.java:1749)
	at com.sun.jndi.toolkit.ctx.ComponentDirContext.p_search(ComponentDirContext.java:368)
	at com.sun.jndi.toolkit.ctx.PartialCompositeDirContext.search(PartialCompositeDirContext.java:338)
	at com.sun.jndi.toolkit.ctx.PartialCompositeDirContext.search(PartialCompositeDirContext.java:321)
	at javax.naming.directory.InitialDirContext.search(InitialDirContext.java:248)
	at org.apache.directory.server.operations.search.SearchLimitsIT.getActorsWithLimitNonAdmin(SearchLimitsIT.java:479)
	at org.apache.directory.server.operations.search.SearchLimitsIT.testNonAdminRequestUnlimitedConfigurationLimited(SearchLimitsIT.java:266)
	at sun.reflect.NativeMethodAccessorImpl.invoke0(Native Method)
	at sun.reflect.NativeMethodAccessorImpl.invoke(NativeMethodAccessorImpl.java:39)
	at sun.reflect.DelegatingMethodAccessorImpl.invoke(DelegatingMethodAccessorImpl.java:25)
	at java.lang.reflect.Method.invoke(Method.java:597)
	at org.junit.runners.model.FrameworkMethod$1.runReflectiveCall(FrameworkMethod.java:44)
	at org.junit.internal.runners.model.ReflectiveCallable.run(ReflectiveCallable.java:15)
	at org.junit.runners.model.FrameworkMethod.invokeExplosively(FrameworkMethod.java:41)
	at org.junit.internal.runners.statements.InvokeMethod.evaluate(InvokeMethod.java:20)
	at org.junit.internal.runners.statements.ExpectException.evaluate(ExpectException.java:21)
	... 35 more


    testRequestConstrainedUnlimitByConfigurationSize :
  java.lang.Exception
  java.lang.Exception: Unexpected exception, expected<javax.naming.SizeLimitExceededException> but was<javax.naming.NamingException>
	at org.junit.internal.runners.statements.ExpectException.evaluate(ExpectException.java:28)
	at org.junit.internal.runners.statements.RunBefores.evaluate(RunBefores.java:28)
	at org.junit.internal.runners.statements.RunAfters.evaluate(RunAfters.java:31)
	at org.junit.runners.BlockJUnit4ClassRunner.runNotIgnored(BlockJUnit4ClassRunner.java:79)
	at org.junit.runners.BlockJUnit4ClassRunner.runChild(BlockJUnit4ClassRunner.java:71)
	at org.apache.directory.server.core.integ.FrameworkRunner.runChild(FrameworkRunner.java:433)
	at org.apache.directory.server.core.integ.FrameworkRunner.runChild(FrameworkRunner.java:56)
	at org.junit.runners.ParentRunner$3.run(ParentRunner.java:193)
	at org.junit.runners.ParentRunner$1.schedule(ParentRunner.java:52)
	at org.junit.runners.ParentRunner.runChildren(ParentRunner.java:191)
	at org.junit.runners.ParentRunner.access$000(ParentRunner.java:42)
	at org.junit.runners.ParentRunner$2.evaluate(ParentRunner.java:184)
	at org.junit.runners.ParentRunner.run(ParentRunner.java:236)
	at org.apache.directory.server.core.integ.FrameworkRunner.run(FrameworkRunner.java:222)
	at org.junit.runners.Suite.runChild(Suite.java:128)
	at org.apache.directory.server.core.integ.FrameworkSuite.runChild(FrameworkSuite.java:191)
	at org.apache.directory.server.core.integ.FrameworkSuite.runChild(FrameworkSuite.java:48)
	at org.junit.runners.ParentRunner$3.run(ParentRunner.java:193)
	at org.junit.runners.ParentRunner$1.schedule(ParentRunner.java:52)
	at org.junit.runners.ParentRunner.runChildren(ParentRunner.java:191)
	at org.junit.runners.ParentRunner.access$000(ParentRunner.java:42)
	at org.junit.runners.ParentRunner$2.evaluate(ParentRunner.java:184)
	at org.junit.runners.ParentRunner.run(ParentRunner.java:236)
	at org.apache.directory.server.core.integ.FrameworkSuite.run(FrameworkSuite.java:158)
	at org.apache.maven.surefire.junit4.JUnit4TestSet.execute(JUnit4TestSet.java:35)
	at org.apache.maven.surefire.junit4.JUnit4Provider.executeTestSet(JUnit4Provider.java:115)
	at org.apache.maven.surefire.junit4.JUnit4Provider.invoke(JUnit4Provider.java:97)
	at sun.reflect.NativeMethodAccessorImpl.invoke0(Native Method)
	at sun.reflect.NativeMethodAccessorImpl.invoke(NativeMethodAccessorImpl.java:39)
	at sun.reflect.DelegatingMethodAccessorImpl.invoke(DelegatingMethodAccessorImpl.java:25)
	at java.lang.reflect.Method.invoke(Method.java:597)
	at org.apache.maven.surefire.booter.ProviderFactory$ClassLoaderProxy.invoke(ProviderFactory.java:103)
	at $Proxy0.invoke(Unknown Source)
	at org.apache.maven.surefire.booter.SurefireStarter.invokeProvider(SurefireStarter.java:150)
	at org.apache.maven.surefire.booter.SurefireStarter.runSuitesInProcess(SurefireStarter.java:91)
	at org.apache.maven.surefire.booter.ForkedBooter.main(ForkedBooter.java:69)
Caused by: javax.naming.NamingException: [LDAP: error code 36 - ALIAS_DEREFERENCING_PROBLEM: failed for MessageType : SEARCH_REQUEST
Message ID : 2
    SearchRequest
        baseDn : 'ou=actors,ou=system'
        filter : '(objectClass=*:[15])'
        scope : single level
        typesOnly : false
        Size Limit : 1
        Time Limit : no limit
        Deref Aliases : deref Always
        attributes : 
org.apache.directory.shared.ldap.model.message.SearchRequestImpl@c6134aa    ManageDsaITImpl Control
        Type OID    : '2.16.840.1.113730.3.4.2'
        Criticality : 'false''
: ERR_333 Unexpected exception.]; remaining name 'ou=actors,ou=system'
	at com.sun.jndi.ldap.LdapCtx.mapErrorCode(LdapCtx.java:3017)
	at com.sun.jndi.ldap.LdapCtx.processReturnCode(LdapCtx.java:2987)
	at com.sun.jndi.ldap.LdapCtx.processReturnCode(LdapCtx.java:2794)
	at com.sun.jndi.ldap.LdapCtx.searchAux(LdapCtx.java:1826)
	at com.sun.jndi.ldap.LdapCtx.c_search(LdapCtx.java:1749)
	at com.sun.jndi.toolkit.ctx.ComponentDirContext.p_search(ComponentDirContext.java:368)
	at com.sun.jndi.toolkit.ctx.PartialCompositeDirContext.search(PartialCompositeDirContext.java:338)
	at com.sun.jndi.toolkit.ctx.PartialCompositeDirContext.search(PartialCompositeDirContext.java:321)
	at javax.naming.directory.InitialDirContext.search(InitialDirContext.java:248)
	at org.apache.directory.server.operations.search.SearchLimitsIT.getActorsWithLimit(SearchLimitsIT.java:454)
	at org.apache.directory.server.operations.search.SearchLimitsIT.testRequestConstrainedUnlimitByConfigurationSize(SearchLimitsIT.java:286)
	at sun.reflect.NativeMethodAccessorImpl.invoke0(Native Method)
	at sun.reflect.NativeMethodAccessorImpl.invoke(NativeMethodAccessorImpl.java:39)
	at sun.reflect.DelegatingMethodAccessorImpl.invoke(DelegatingMethodAccessorImpl.java:25)
	at java.lang.reflect.Method.invoke(Method.java:597)
	at org.junit.runners.model.FrameworkMethod$1.runReflectiveCall(FrameworkMethod.java:44)
	at org.junit.internal.runners.model.ReflectiveCallable.run(ReflectiveCallable.java:15)
	at org.junit.runners.model.FrameworkMethod.invokeExplosively(FrameworkMethod.java:41)
	at org.junit.internal.runners.statements.InvokeMethod.evaluate(InvokeMethod.java:20)
	at org.junit.internal.runners.statements.ExpectException.evaluate(ExpectException.java:21)
	... 35 more

    testRequestConstrainedLessThanConfigurationSize :
  java.lang.Exception
  java.lang.Exception: Unexpected exception, expected<javax.naming.SizeLimitExceededException> but was<javax.naming.NamingException>
	at org.junit.internal.runners.statements.ExpectException.evaluate(ExpectException.java:28)
	at org.junit.internal.runners.statements.RunBefores.evaluate(RunBefores.java:28)
	at org.junit.internal.runners.statements.RunAfters.evaluate(RunAfters.java:31)
	at org.junit.runners.BlockJUnit4ClassRunner.runNotIgnored(BlockJUnit4ClassRunner.java:79)
	at org.junit.runners.BlockJUnit4ClassRunner.runChild(BlockJUnit4ClassRunner.java:71)
	at org.apache.directory.server.core.integ.FrameworkRunner.runChild(FrameworkRunner.java:433)
	at org.apache.directory.server.core.integ.FrameworkRunner.runChild(FrameworkRunner.java:56)
	at org.junit.runners.ParentRunner$3.run(ParentRunner.java:193)
	at org.junit.runners.ParentRunner$1.schedule(ParentRunner.java:52)
	at org.junit.runners.ParentRunner.runChildren(ParentRunner.java:191)
	at org.junit.runners.ParentRunner.access$000(ParentRunner.java:42)
	at org.junit.runners.ParentRunner$2.evaluate(ParentRunner.java:184)
	at org.junit.runners.ParentRunner.run(ParentRunner.java:236)
	at org.apache.directory.server.core.integ.FrameworkRunner.run(FrameworkRunner.java:222)
	at org.junit.runners.Suite.runChild(Suite.java:128)
	at org.apache.directory.server.core.integ.FrameworkSuite.runChild(FrameworkSuite.java:191)
	at org.apache.directory.server.core.integ.FrameworkSuite.runChild(FrameworkSuite.java:48)
	at org.junit.runners.ParentRunner$3.run(ParentRunner.java:193)
	at org.junit.runners.ParentRunner$1.schedule(ParentRunner.java:52)
	at org.junit.runners.ParentRunner.runChildren(ParentRunner.java:191)
	at org.junit.runners.ParentRunner.access$000(ParentRunner.java:42)
	at org.junit.runners.ParentRunner$2.evaluate(ParentRunner.java:184)
	at org.junit.runners.ParentRunner.run(ParentRunner.java:236)
	at org.apache.directory.server.core.integ.FrameworkSuite.run(FrameworkSuite.java:158)
	at org.apache.maven.surefire.junit4.JUnit4TestSet.execute(JUnit4TestSet.java:35)
	at org.apache.maven.surefire.junit4.JUnit4Provider.executeTestSet(JUnit4Provider.java:115)
	at org.apache.maven.surefire.junit4.JUnit4Provider.invoke(JUnit4Provider.java:97)
	at sun.reflect.NativeMethodAccessorImpl.invoke0(Native Method)
	at sun.reflect.NativeMethodAccessorImpl.invoke(NativeMethodAccessorImpl.java:39)
	at sun.reflect.DelegatingMethodAccessorImpl.invoke(DelegatingMethodAccessorImpl.java:25)
	at java.lang.reflect.Method.invoke(Method.java:597)
	at org.apache.maven.surefire.booter.ProviderFactory$ClassLoaderProxy.invoke(ProviderFactory.java:103)
	at $Proxy0.invoke(Unknown Source)
	at org.apache.maven.surefire.booter.SurefireStarter.invokeProvider(SurefireStarter.java:150)
	at org.apache.maven.surefire.booter.SurefireStarter.runSuitesInProcess(SurefireStarter.java:91)
	at org.apache.maven.surefire.booter.ForkedBooter.main(ForkedBooter.java:69)
Caused by: javax.naming.NamingException: [LDAP: error code 36 - ALIAS_DEREFERENCING_PROBLEM: failed for MessageType : SEARCH_REQUEST
Message ID : 2
    SearchRequest
        baseDn : 'ou=actors,ou=system'
        filter : '(objectClass=*:[15])'
        scope : single level
        typesOnly : false
        Size Limit : 1
        Time Limit : no limit
        Deref Aliases : deref Always
        attributes : 
org.apache.directory.shared.ldap.model.message.SearchRequestImpl@c6134aa    ManageDsaITImpl Control
        Type OID    : '2.16.840.1.113730.3.4.2'
        Criticality : 'false''
: ERR_333 Unexpected exception.]; remaining name 'ou=actors,ou=system'
	at com.sun.jndi.ldap.LdapCtx.mapErrorCode(LdapCtx.java:3017)
	at com.sun.jndi.ldap.LdapCtx.processReturnCode(LdapCtx.java:2987)
	at com.sun.jndi.ldap.LdapCtx.processReturnCode(LdapCtx.java:2794)
	at com.sun.jndi.ldap.LdapCtx.searchAux(LdapCtx.java:1826)
	at com.sun.jndi.ldap.LdapCtx.c_search(LdapCtx.java:1749)
	at com.sun.jndi.toolkit.ctx.ComponentDirContext.p_search(ComponentDirContext.java:368)
	at com.sun.jndi.toolkit.ctx.PartialCompositeDirContext.search(PartialCompositeDirContext.java:338)
	at com.sun.jndi.toolkit.ctx.PartialCompositeDirContext.search(PartialCompositeDirContext.java:321)
	at javax.naming.directory.InitialDirContext.search(InitialDirContext.java:248)
	at org.apache.directory.server.operations.search.SearchLimitsIT.getActorsWithLimit(SearchLimitsIT.java:454)
	at org.apache.directory.server.operations.search.SearchLimitsIT.testRequestConstrainedLessThanConfigurationSize(SearchLimitsIT.java:300)
	at sun.reflect.NativeMethodAccessorImpl.invoke0(Native Method)
	at sun.reflect.NativeMethodAccessorImpl.invoke(NativeMethodAccessorImpl.java:39)
	at sun.reflect.DelegatingMethodAccessorImpl.invoke(DelegatingMethodAccessorImpl.java:25)
	at java.lang.reflect.Method.invoke(Method.java:597)
	at org.junit.runners.model.FrameworkMethod$1.runReflectiveCall(FrameworkMethod.java:44)
	at org.junit.internal.runners.model.ReflectiveCallable.run(ReflectiveCallable.java:15)
	at org.junit.runners.model.FrameworkMethod.invokeExplosively(FrameworkMethod.java:41)
	at org.junit.internal.runners.statements.InvokeMethod.evaluate(InvokeMethod.java:20)
	at org.junit.internal.runners.statements.ExpectException.evaluate(ExpectException.java:21)
	... 35 more


    testRequestConstrainedGreaterThanConfigurationSize :
  javax.naming.NamingException
  javax.naming.NamingException: [LDAP: error code 36 - ALIAS_DEREFERENCING_PROBLEM: failed for MessageType : SEARCH_REQUEST
Message ID : 2
    SearchRequest
        baseDn : 'ou=actors,ou=system'
        filter : '(objectClass=*:[15])'
        scope : single level
        typesOnly : false
        Size Limit : 100000
        Time Limit : no limit
        Deref Aliases : deref Always
        attributes : 
org.apache.directory.shared.ldap.model.message.SearchRequestImpl@1b4d62f9    ManageDsaITImpl Control
        Type OID    : '2.16.840.1.113730.3.4.2'
        Criticality : 'false''
: ERR_333 Unexpected exception.]; remaining name 'ou=actors,ou=system'
	at com.sun.jndi.ldap.LdapCtx.mapErrorCode(LdapCtx.java:3017)
	at com.sun.jndi.ldap.LdapCtx.processReturnCode(LdapCtx.java:2987)
	at com.sun.jndi.ldap.LdapCtx.processReturnCode(LdapCtx.java:2794)
	at com.sun.jndi.ldap.LdapCtx.searchAux(LdapCtx.java:1826)
	at com.sun.jndi.ldap.LdapCtx.c_search(LdapCtx.java:1749)
	at com.sun.jndi.toolkit.ctx.ComponentDirContext.p_search(ComponentDirContext.java:368)
	at com.sun.jndi.toolkit.ctx.PartialCompositeDirContext.search(PartialCompositeDirContext.java:338)
	at com.sun.jndi.toolkit.ctx.PartialCompositeDirContext.search(PartialCompositeDirContext.java:321)
	at javax.naming.directory.InitialDirContext.search(InitialDirContext.java:248)
	at org.apache.directory.server.operations.search.SearchLimitsIT.getActorsWithLimit(SearchLimitsIT.java:454)
	at org.apache.directory.server.operations.search.SearchLimitsIT.testRequestConstrainedGreaterThanConfigurationSize(SearchLimitsIT.java:313)
	at sun.reflect.NativeMethodAccessorImpl.invoke0(Native Method)
	at sun.reflect.NativeMethodAccessorImpl.invoke(NativeMethodAccessorImpl.java:39)
	at sun.reflect.DelegatingMethodAccessorImpl.invoke(DelegatingMethodAccessorImpl.java:25)
	at java.lang.reflect.Method.invoke(Method.java:597)
	at org.junit.runners.model.FrameworkMethod$1.runReflectiveCall(FrameworkMethod.java:44)
	at org.junit.internal.runners.model.ReflectiveCallable.run(ReflectiveCallable.java:15)
	at org.junit.runners.model.FrameworkMethod.invokeExplosively(FrameworkMethod.java:41)
	at org.junit.internal.runners.statements.InvokeMethod.evaluate(InvokeMethod.java:20)
	at org.junit.internal.runners.statements.RunBefores.evaluate(RunBefores.java:28)
	at org.junit.internal.runners.statements.RunAfters.evaluate(RunAfters.java:31)
	at org.junit.runners.BlockJUnit4ClassRunner.runNotIgnored(BlockJUnit4ClassRunner.java:79)
	at org.junit.runners.BlockJUnit4ClassRunner.runChild(BlockJUnit4ClassRunner.java:71)
	at org.apache.directory.server.core.integ.FrameworkRunner.runChild(FrameworkRunner.java:433)
	at org.apache.directory.server.core.integ.FrameworkRunner.runChild(FrameworkRunner.java:56)
	at org.junit.runners.ParentRunner$3.run(ParentRunner.java:193)
	at org.junit.runners.ParentRunner$1.schedule(ParentRunner.java:52)
	at org.junit.runners.ParentRunner.runChildren(ParentRunner.java:191)
	at org.junit.runners.ParentRunner.access$000(ParentRunner.java:42)
	at org.junit.runners.ParentRunner$2.evaluate(ParentRunner.java:184)
	at org.junit.runners.ParentRunner.run(ParentRunner.java:236)
	at org.apache.directory.server.core.integ.FrameworkRunner.run(FrameworkRunner.java:222)
	at org.junit.runners.Suite.runChild(Suite.java:128)
	at org.apache.directory.server.core.integ.FrameworkSuite.runChild(FrameworkSuite.java:191)
	at org.apache.directory.server.core.integ.FrameworkSuite.runChild(FrameworkSuite.java:48)
	at org.junit.runners.ParentRunner$3.run(ParentRunner.java:193)
	at org.junit.runners.ParentRunner$1.schedule(ParentRunner.java:52)
	at org.junit.runners.ParentRunner.runChildren(ParentRunner.java:191)
	at org.junit.runners.ParentRunner.access$000(ParentRunner.java:42)
	at org.junit.runners.ParentRunner$2.evaluate(ParentRunner.java:184)
	at org.junit.runners.ParentRunner.run(ParentRunner.java:236)
	at org.apache.directory.server.core.integ.FrameworkSuite.run(FrameworkSuite.java:158)
	at org.apache.maven.surefire.junit4.JUnit4TestSet.execute(JUnit4TestSet.java:35)
	at org.apache.maven.surefire.junit4.JUnit4Provider.executeTestSet(JUnit4Provider.java:115)
	at org.apache.maven.surefire.junit4.JUnit4Provider.invoke(JUnit4Provider.java:97)
	at sun.reflect.NativeMethodAccessorImpl.invoke0(Native Method)
	at sun.reflect.NativeMethodAccessorImpl.invoke(NativeMethodAccessorImpl.java:39)
	at sun.reflect.DelegatingMethodAccessorImpl.invoke(DelegatingMethodAccessorImpl.java:25)
	at java.lang.reflect.Method.invoke(Method.java:597)
	at org.apache.maven.surefire.booter.ProviderFactory$ClassLoaderProxy.invoke(ProviderFactory.java:103)
	at $Proxy0.invoke(Unknown Source)
	at org.apache.maven.surefire.booter.SurefireStarter.invokeProvider(SurefireStarter.java:150)
	at org.apache.maven.surefire.booter.SurefireStarter.runSuitesInProcess(SurefireStarter.java:91)
	at org.apache.maven.surefire.booter.ForkedBooter.main(ForkedBooter.java:69)


    testNonAdminRequestConstrainedGreaterThanConfigurationSize :
  java.lang.Exception
  java.lang.Exception: Unexpected exception, expected<javax.naming.SizeLimitExceededException> but was<javax.naming.NamingException>
	at org.junit.internal.runners.statements.ExpectException.evaluate(ExpectException.java:28)
	at org.junit.internal.runners.statements.RunBefores.evaluate(RunBefores.java:28)
	at org.junit.internal.runners.statements.RunAfters.evaluate(RunAfters.java:31)
	at org.junit.runners.BlockJUnit4ClassRunner.runNotIgnored(BlockJUnit4ClassRunner.java:79)
	at org.junit.runners.BlockJUnit4ClassRunner.runChild(BlockJUnit4ClassRunner.java:71)
	at org.apache.directory.server.core.integ.FrameworkRunner.runChild(FrameworkRunner.java:433)
	at org.apache.directory.server.core.integ.FrameworkRunner.runChild(FrameworkRunner.java:56)
	at org.junit.runners.ParentRunner$3.run(ParentRunner.java:193)
	at org.junit.runners.ParentRunner$1.schedule(ParentRunner.java:52)
	at org.junit.runners.ParentRunner.runChildren(ParentRunner.java:191)
	at org.junit.runners.ParentRunner.access$000(ParentRunner.java:42)
	at org.junit.runners.ParentRunner$2.evaluate(ParentRunner.java:184)
	at org.junit.runners.ParentRunner.run(ParentRunner.java:236)
	at org.apache.directory.server.core.integ.FrameworkRunner.run(FrameworkRunner.java:222)
	at org.junit.runners.Suite.runChild(Suite.java:128)
	at org.apache.directory.server.core.integ.FrameworkSuite.runChild(FrameworkSuite.java:191)
	at org.apache.directory.server.core.integ.FrameworkSuite.runChild(FrameworkSuite.java:48)
	at org.junit.runners.ParentRunner$3.run(ParentRunner.java:193)
	at org.junit.runners.ParentRunner$1.schedule(ParentRunner.java:52)
	at org.junit.runners.ParentRunner.runChildren(ParentRunner.java:191)
	at org.junit.runners.ParentRunner.access$000(ParentRunner.java:42)
	at org.junit.runners.ParentRunner$2.evaluate(ParentRunner.java:184)
	at org.junit.runners.ParentRunner.run(ParentRunner.java:236)
	at org.apache.directory.server.core.integ.FrameworkSuite.run(FrameworkSuite.java:158)
	at org.apache.maven.surefire.junit4.JUnit4TestSet.execute(JUnit4TestSet.java:35)
	at org.apache.maven.surefire.junit4.JUnit4Provider.executeTestSet(JUnit4Provider.java:115)
	at org.apache.maven.surefire.junit4.JUnit4Provider.invoke(JUnit4Provider.java:97)
	at sun.reflect.NativeMethodAccessorImpl.invoke0(Native Method)
	at sun.reflect.NativeMethodAccessorImpl.invoke(NativeMethodAccessorImpl.java:39)
	at sun.reflect.DelegatingMethodAccessorImpl.invoke(DelegatingMethodAccessorImpl.java:25)
	at java.lang.reflect.Method.invoke(Method.java:597)
	at org.apache.maven.surefire.booter.ProviderFactory$ClassLoaderProxy.invoke(ProviderFactory.java:103)
	at $Proxy0.invoke(Unknown Source)
	at org.apache.maven.surefire.booter.SurefireStarter.invokeProvider(SurefireStarter.java:150)
	at org.apache.maven.surefire.booter.SurefireStarter.runSuitesInProcess(SurefireStarter.java:91)
	at org.apache.maven.surefire.booter.ForkedBooter.main(ForkedBooter.java:69)
Caused by: javax.naming.NamingException: [LDAP: error code 36 - ALIAS_DEREFERENCING_PROBLEM: failed for MessageType : SEARCH_REQUEST
Message ID : 2
    SearchRequest
        baseDn : 'ou=actors,ou=system'
        filter : '(objectClass=*:[15])'
        scope : single level
        typesOnly : false
        Size Limit : 100000
        Time Limit : no limit
        Deref Aliases : deref Always
        attributes : 
org.apache.directory.shared.ldap.model.message.SearchRequestImpl@1b4d62f9    ManageDsaITImpl Control
        Type OID    : '2.16.840.1.113730.3.4.2'
        Criticality : 'false''
: ERR_333 Unexpected exception.]; remaining name 'ou=actors,ou=system'
	at com.sun.jndi.ldap.LdapCtx.mapErrorCode(LdapCtx.java:3017)
	at com.sun.jndi.ldap.LdapCtx.processReturnCode(LdapCtx.java:2987)
	at com.sun.jndi.ldap.LdapCtx.processReturnCode(LdapCtx.java:2794)
	at com.sun.jndi.ldap.LdapCtx.searchAux(LdapCtx.java:1826)
	at com.sun.jndi.ldap.LdapCtx.c_search(LdapCtx.java:1749)
	at com.sun.jndi.toolkit.ctx.ComponentDirContext.p_search(ComponentDirContext.java:368)
	at com.sun.jndi.toolkit.ctx.PartialCompositeDirContext.search(PartialCompositeDirContext.java:338)
	at com.sun.jndi.toolkit.ctx.PartialCompositeDirContext.search(PartialCompositeDirContext.java:321)
	at javax.naming.directory.InitialDirContext.search(InitialDirContext.java:248)
	at org.apache.directory.server.operations.search.SearchLimitsIT.getActorsWithLimitNonAdmin(SearchLimitsIT.java:479)
	at org.apache.directory.server.operations.search.SearchLimitsIT.testNonAdminRequestConstrainedGreaterThanConfigurationSize(SearchLimitsIT.java:329)
	at sun.reflect.NativeMethodAccessorImpl.invoke0(Native Method)
	at sun.reflect.NativeMethodAccessorImpl.invoke(NativeMethodAccessorImpl.java:39)
	at sun.reflect.DelegatingMethodAccessorImpl.invoke(DelegatingMethodAccessorImpl.java:25)
	at java.lang.reflect.Method.invoke(Method.java:597)
	at org.junit.runners.model.FrameworkMethod$1.runReflectiveCall(FrameworkMethod.java:44)
	at org.junit.internal.runners.model.ReflectiveCallable.run(ReflectiveCallable.java:15)
	at org.junit.runners.model.FrameworkMethod.invokeExplosively(FrameworkMethod.java:41)
	at org.junit.internal.runners.statements.InvokeMethod.evaluate(InvokeMethod.java:20)
	at org.junit.internal.runners.statements.ExpectException.evaluate(ExpectException.java:21)
	... 35 more

    testRequestUnlimitedConfigurationLimitedSize :
  javax.naming.NamingException
  javax.naming.NamingException: [LDAP: error code 36 - ALIAS_DEREFERENCING_PROBLEM: failed for MessageType : SEARCH_REQUEST
Message ID : 2
    SearchRequest
        baseDn : 'ou=actors,ou=system'
        filter : '(objectClass=*:[15])'
        scope : single level
        typesOnly : false
        Size Limit : no limit
        Time Limit : no limit
        Deref Aliases : deref Always
        attributes : 
org.apache.directory.shared.ldap.model.message.SearchRequestImpl@c4b8a59    ManageDsaITImpl Control
        Type OID    : '2.16.840.1.113730.3.4.2'
        Criticality : 'false''
: ERR_333 Unexpected exception.]; remaining name 'ou=actors,ou=system'
	at com.sun.jndi.ldap.LdapCtx.mapErrorCode(LdapCtx.java:3017)
	at com.sun.jndi.ldap.LdapCtx.processReturnCode(LdapCtx.java:2987)
	at com.sun.jndi.ldap.LdapCtx.processReturnCode(LdapCtx.java:2794)
	at com.sun.jndi.ldap.LdapCtx.searchAux(LdapCtx.java:1826)
	at com.sun.jndi.ldap.LdapCtx.c_search(LdapCtx.java:1749)
	at com.sun.jndi.toolkit.ctx.ComponentDirContext.p_search(ComponentDirContext.java:368)
	at com.sun.jndi.toolkit.ctx.PartialCompositeDirContext.search(PartialCompositeDirContext.java:338)
	at com.sun.jndi.toolkit.ctx.PartialCompositeDirContext.search(PartialCompositeDirContext.java:321)
	at javax.naming.directory.InitialDirContext.search(InitialDirContext.java:248)
	at org.apache.directory.server.operations.search.SearchLimitsIT.getActorsWithLimit(SearchLimitsIT.java:454)
	at org.apache.directory.server.operations.search.SearchLimitsIT.testRequestUnlimitedConfigurationLimitedSize(SearchLimitsIT.java:341)
	at sun.reflect.NativeMethodAccessorImpl.invoke0(Native Method)
	at sun.reflect.NativeMethodAccessorImpl.invoke(NativeMethodAccessorImpl.java:39)
	at sun.reflect.DelegatingMethodAccessorImpl.invoke(DelegatingMethodAccessorImpl.java:25)
	at java.lang.reflect.Method.invoke(Method.java:597)
	at org.junit.runners.model.FrameworkMethod$1.runReflectiveCall(FrameworkMethod.java:44)
	at org.junit.internal.runners.model.ReflectiveCallable.run(ReflectiveCallable.java:15)
	at org.junit.runners.model.FrameworkMethod.invokeExplosively(FrameworkMethod.java:41)
	at org.junit.internal.runners.statements.InvokeMethod.evaluate(InvokeMethod.java:20)
	at org.junit.internal.runners.statements.RunBefores.evaluate(RunBefores.java:28)
	at org.junit.internal.runners.statements.RunAfters.evaluate(RunAfters.java:31)
	at org.junit.runners.BlockJUnit4ClassRunner.runNotIgnored(BlockJUnit4ClassRunner.java:79)
	at org.junit.runners.BlockJUnit4ClassRunner.runChild(BlockJUnit4ClassRunner.java:71)
	at org.apache.directory.server.core.integ.FrameworkRunner.runChild(FrameworkRunner.java:433)
	at org.apache.directory.server.core.integ.FrameworkRunner.runChild(FrameworkRunner.java:56)
	at org.junit.runners.ParentRunner$3.run(ParentRunner.java:193)
	at org.junit.runners.ParentRunner$1.schedule(ParentRunner.java:52)
	at org.junit.runners.ParentRunner.runChildren(ParentRunner.java:191)
	at org.junit.runners.ParentRunner.access$000(ParentRunner.java:42)
	at org.junit.runners.ParentRunner$2.evaluate(ParentRunner.java:184)
	at org.junit.runners.ParentRunner.run(ParentRunner.java:236)
	at org.apache.directory.server.core.integ.FrameworkRunner.run(FrameworkRunner.java:222)
	at org.junit.runners.Suite.runChild(Suite.java:128)
	at org.apache.directory.server.core.integ.FrameworkSuite.runChild(FrameworkSuite.java:191)
	at org.apache.directory.server.core.integ.FrameworkSuite.runChild(FrameworkSuite.java:48)
	at org.junit.runners.ParentRunner$3.run(ParentRunner.java:193)
	at org.junit.runners.ParentRunner$1.schedule(ParentRunner.java:52)
	at org.junit.runners.ParentRunner.runChildren(ParentRunner.java:191)
	at org.junit.runners.ParentRunner.access$000(ParentRunner.java:42)
	at org.junit.runners.ParentRunner$2.evaluate(ParentRunner.java:184)
	at org.junit.runners.ParentRunner.run(ParentRunner.java:236)
	at org.apache.directory.server.core.integ.FrameworkSuite.run(FrameworkSuite.java:158)
	at org.apache.maven.surefire.junit4.JUnit4TestSet.execute(JUnit4TestSet.java:35)
	at org.apache.maven.surefire.junit4.JUnit4Provider.executeTestSet(JUnit4Provider.java:115)
	at org.apache.maven.surefire.junit4.JUnit4Provider.invoke(JUnit4Provider.java:97)
	at sun.reflect.NativeMethodAccessorImpl.invoke0(Native Method)
	at sun.reflect.NativeMethodAccessorImpl.invoke(NativeMethodAccessorImpl.java:39)
	at sun.reflect.DelegatingMethodAccessorImpl.invoke(DelegatingMethodAccessorImpl.java:25)
	at java.lang.reflect.Method.invoke(Method.java:597)
	at org.apache.maven.surefire.booter.ProviderFactory$ClassLoaderProxy.invoke(ProviderFactory.java:103)
	at $Proxy0.invoke(Unknown Source)
	at org.apache.maven.surefire.booter.SurefireStarter.invokeProvider(SurefireStarter.java:150)
	at org.apache.maven.surefire.booter.SurefireStarter.runSuitesInProcess(SurefireStarter.java:91)
	at org.apache.maven.surefire.booter.ForkedBooter.main(ForkedBooter.java:69)

    testNonAdminRequestUnlimitedConfigurationLimitedSize :
  java.lang.Exception
  java.lang.Exception: Unexpected exception, expected<javax.naming.SizeLimitExceededException> but was<javax.naming.NamingException>
	at org.junit.internal.runners.statements.ExpectException.evaluate(ExpectException.java:28)
	at org.junit.internal.runners.statements.RunBefores.evaluate(RunBefores.java:28)
	at org.junit.internal.runners.statements.RunAfters.evaluate(RunAfters.java:31)
	at org.junit.runners.BlockJUnit4ClassRunner.runNotIgnored(BlockJUnit4ClassRunner.java:79)
	at org.junit.runners.BlockJUnit4ClassRunner.runChild(BlockJUnit4ClassRunner.java:71)
	at org.apache.directory.server.core.integ.FrameworkRunner.runChild(FrameworkRunner.java:433)
	at org.apache.directory.server.core.integ.FrameworkRunner.runChild(FrameworkRunner.java:56)
	at org.junit.runners.ParentRunner$3.run(ParentRunner.java:193)
	at org.junit.runners.ParentRunner$1.schedule(ParentRunner.java:52)
	at org.junit.runners.ParentRunner.runChildren(ParentRunner.java:191)
	at org.junit.runners.ParentRunner.access$000(ParentRunner.java:42)
	at org.junit.runners.ParentRunner$2.evaluate(ParentRunner.java:184)
	at org.junit.runners.ParentRunner.run(ParentRunner.java:236)
	at org.apache.directory.server.core.integ.FrameworkRunner.run(FrameworkRunner.java:222)
	at org.junit.runners.Suite.runChild(Suite.java:128)
	at org.apache.directory.server.core.integ.FrameworkSuite.runChild(FrameworkSuite.java:191)
	at org.apache.directory.server.core.integ.FrameworkSuite.runChild(FrameworkSuite.java:48)
	at org.junit.runners.ParentRunner$3.run(ParentRunner.java:193)
	at org.junit.runners.ParentRunner$1.schedule(ParentRunner.java:52)
	at org.junit.runners.ParentRunner.runChildren(ParentRunner.java:191)
	at org.junit.runners.ParentRunner.access$000(ParentRunner.java:42)
	at org.junit.runners.ParentRunner$2.evaluate(ParentRunner.java:184)
	at org.junit.runners.ParentRunner.run(ParentRunner.java:236)
	at org.apache.directory.server.core.integ.FrameworkSuite.run(FrameworkSuite.java:158)
	at org.apache.maven.surefire.junit4.JUnit4TestSet.execute(JUnit4TestSet.java:35)
	at org.apache.maven.surefire.junit4.JUnit4Provider.executeTestSet(JUnit4Provider.java:115)
	at org.apache.maven.surefire.junit4.JUnit4Provider.invoke(JUnit4Provider.java:97)
	at sun.reflect.NativeMethodAccessorImpl.invoke0(Native Method)
	at sun.reflect.NativeMethodAccessorImpl.invoke(NativeMethodAccessorImpl.java:39)
	at sun.reflect.DelegatingMethodAccessorImpl.invoke(DelegatingMethodAccessorImpl.java:25)
	at java.lang.reflect.Method.invoke(Method.java:597)
	at org.apache.maven.surefire.booter.ProviderFactory$ClassLoaderProxy.invoke(ProviderFactory.java:103)
	at $Proxy0.invoke(Unknown Source)
	at org.apache.maven.surefire.booter.SurefireStarter.invokeProvider(SurefireStarter.java:150)
	at org.apache.maven.surefire.booter.SurefireStarter.runSuitesInProcess(SurefireStarter.java:91)
	at org.apache.maven.surefire.booter.ForkedBooter.main(ForkedBooter.java:69)
Caused by: javax.naming.NamingException: [LDAP: error code 36 - ALIAS_DEREFERENCING_PROBLEM: failed for MessageType : SEARCH_REQUEST
Message ID : 2
    SearchRequest
        baseDn : 'ou=actors,ou=system'
        filter : '(objectClass=*:[15])'
        scope : single level
        typesOnly : false
        Size Limit : no limit
        Time Limit : no limit
        Deref Aliases : deref Always
        attributes : 
org.apache.directory.shared.ldap.model.message.SearchRequestImpl@c4b8a59    ManageDsaITImpl Control
        Type OID    : '2.16.840.1.113730.3.4.2'
        Criticality : 'false''
: ERR_333 Unexpected exception.]; remaining name 'ou=actors,ou=system'
	at com.sun.jndi.ldap.LdapCtx.mapErrorCode(LdapCtx.java:3017)
	at com.sun.jndi.ldap.LdapCtx.processReturnCode(LdapCtx.java:2987)
	at com.sun.jndi.ldap.LdapCtx.processReturnCode(LdapCtx.java:2794)
	at com.sun.jndi.ldap.LdapCtx.searchAux(LdapCtx.java:1826)
	at com.sun.jndi.ldap.LdapCtx.c_search(LdapCtx.java:1749)
	at com.sun.jndi.toolkit.ctx.ComponentDirContext.p_search(ComponentDirContext.java:368)
	at com.sun.jndi.toolkit.ctx.PartialCompositeDirContext.search(PartialCompositeDirContext.java:338)
	at com.sun.jndi.toolkit.ctx.PartialCompositeDirContext.search(PartialCompositeDirContext.java:321)
	at javax.naming.directory.InitialDirContext.search(InitialDirContext.java:248)
	at org.apache.directory.server.operations.search.SearchLimitsIT.getActorsWithLimitNonAdmin(SearchLimitsIT.java:479)
	at org.apache.directory.server.operations.search.SearchLimitsIT.testNonAdminRequestUnlimitedConfigurationLimitedSize(SearchLimitsIT.java:356)
	at sun.reflect.NativeMethodAccessorImpl.invoke0(Native Method)
	at sun.reflect.NativeMethodAccessorImpl.invoke(NativeMethodAccessorImpl.java:39)
	at sun.reflect.DelegatingMethodAccessorImpl.invoke(DelegatingMethodAccessorImpl.java:25)
	at java.lang.reflect.Method.invoke(Method.java:597)
	at org.junit.runners.model.FrameworkMethod$1.runReflectiveCall(FrameworkMethod.java:44)
	at org.junit.internal.runners.model.ReflectiveCallable.run(ReflectiveCallable.java:15)
	at org.junit.runners.model.FrameworkMethod.invokeExplosively(FrameworkMethod.java:41)
	at org.junit.internal.runners.statements.InvokeMethod.evaluate(InvokeMethod.java:20)
	at org.junit.internal.runners.statements.ExpectException.evaluate(ExpectException.java:21)
	... 35 more


    testRequestConstraintedLessThanExpectedSize :
  java.lang.Exception
  java.lang.Exception: Unexpected exception, expected<javax.naming.SizeLimitExceededException> but was<javax.naming.NamingException>
	at org.junit.internal.runners.statements.ExpectException.evaluate(ExpectException.java:28)
	at org.junit.internal.runners.statements.RunBefores.evaluate(RunBefores.java:28)
	at org.junit.internal.runners.statements.RunAfters.evaluate(RunAfters.java:31)
	at org.junit.runners.BlockJUnit4ClassRunner.runNotIgnored(BlockJUnit4ClassRunner.java:79)
	at org.junit.runners.BlockJUnit4ClassRunner.runChild(BlockJUnit4ClassRunner.java:71)
	at org.apache.directory.server.core.integ.FrameworkRunner.runChild(FrameworkRunner.java:433)
	at org.apache.directory.server.core.integ.FrameworkRunner.runChild(FrameworkRunner.java:56)
	at org.junit.runners.ParentRunner$3.run(ParentRunner.java:193)
	at org.junit.runners.ParentRunner$1.schedule(ParentRunner.java:52)
	at org.junit.runners.ParentRunner.runChildren(ParentRunner.java:191)
	at org.junit.runners.ParentRunner.access$000(ParentRunner.java:42)
	at org.junit.runners.ParentRunner$2.evaluate(ParentRunner.java:184)
	at org.junit.runners.ParentRunner.run(ParentRunner.java:236)
	at org.apache.directory.server.core.integ.FrameworkRunner.run(FrameworkRunner.java:222)
	at org.junit.runners.Suite.runChild(Suite.java:128)
	at org.apache.directory.server.core.integ.FrameworkSuite.runChild(FrameworkSuite.java:191)
	at org.apache.directory.server.core.integ.FrameworkSuite.runChild(FrameworkSuite.java:48)
	at org.junit.runners.ParentRunner$3.run(ParentRunner.java:193)
	at org.junit.runners.ParentRunner$1.schedule(ParentRunner.java:52)
	at org.junit.runners.ParentRunner.runChildren(ParentRunner.java:191)
	at org.junit.runners.ParentRunner.access$000(ParentRunner.java:42)
	at org.junit.runners.ParentRunner$2.evaluate(ParentRunner.java:184)
	at org.junit.runners.ParentRunner.run(ParentRunner.java:236)
	at org.apache.directory.server.core.integ.FrameworkSuite.run(FrameworkSuite.java:158)
	at org.apache.maven.surefire.junit4.JUnit4TestSet.execute(JUnit4TestSet.java:35)
	at org.apache.maven.surefire.junit4.JUnit4Provider.executeTestSet(JUnit4Provider.java:115)
	at org.apache.maven.surefire.junit4.JUnit4Provider.invoke(JUnit4Provider.java:97)
	at sun.reflect.NativeMethodAccessorImpl.invoke0(Native Method)
	at sun.reflect.NativeMethodAccessorImpl.invoke(NativeMethodAccessorImpl.java:39)
	at sun.reflect.DelegatingMethodAccessorImpl.invoke(DelegatingMethodAccessorImpl.java:25)
	at java.lang.reflect.Method.invoke(Method.java:597)
	at org.apache.maven.surefire.booter.ProviderFactory$ClassLoaderProxy.invoke(ProviderFactory.java:103)
	at $Proxy0.invoke(Unknown Source)
	at org.apache.maven.surefire.booter.SurefireStarter.invokeProvider(SurefireStarter.java:150)
	at org.apache.maven.surefire.booter.SurefireStarter.runSuitesInProcess(SurefireStarter.java:91)
	at org.apache.maven.surefire.booter.ForkedBooter.main(ForkedBooter.java:69)
Caused by: javax.naming.NamingException: [LDAP: error code 36 - ALIAS_DEREFERENCING_PROBLEM: failed for MessageType : SEARCH_REQUEST
Message ID : 2
    SearchRequest
        baseDn : 'ou=actors,ou=system'
        filter : '(objectClass=*:[15])'
        scope : single level
        typesOnly : false
        Size Limit : 3
        Time Limit : no limit
        Deref Aliases : deref Always
        attributes : 
org.apache.directory.shared.ldap.model.message.SearchRequestImpl@c8c894c    ManageDsaITImpl Control
        Type OID    : '2.16.840.1.113730.3.4.2'
        Criticality : 'false''
: ERR_333 Unexpected exception.]; remaining name 'ou=actors,ou=system'
	at com.sun.jndi.ldap.LdapCtx.mapErrorCode(LdapCtx.java:3017)
	at com.sun.jndi.ldap.LdapCtx.processReturnCode(LdapCtx.java:2987)
	at com.sun.jndi.ldap.LdapCtx.processReturnCode(LdapCtx.java:2794)
	at com.sun.jndi.ldap.LdapCtx.searchAux(LdapCtx.java:1826)
	at com.sun.jndi.ldap.LdapCtx.c_search(LdapCtx.java:1749)
	at com.sun.jndi.toolkit.ctx.ComponentDirContext.p_search(ComponentDirContext.java:368)
	at com.sun.jndi.toolkit.ctx.PartialCompositeDirContext.search(PartialCompositeDirContext.java:338)
	at com.sun.jndi.toolkit.ctx.PartialCompositeDirContext.search(PartialCompositeDirContext.java:321)
	at javax.naming.directory.InitialDirContext.search(InitialDirContext.java:248)
	at org.apache.directory.server.operations.search.SearchLimitsIT.getActorsWithLimit(SearchLimitsIT.java:454)
	at org.apache.directory.server.operations.search.SearchLimitsIT.testRequestConstraintedLessThanExpectedSize(SearchLimitsIT.java:377)
	at sun.reflect.NativeMethodAccessorImpl.invoke0(Native Method)
	at sun.reflect.NativeMethodAccessorImpl.invoke(NativeMethodAccessorImpl.java:39)
	at sun.reflect.DelegatingMethodAccessorImpl.invoke(DelegatingMethodAccessorImpl.java:25)
	at java.lang.reflect.Method.invoke(Method.java:597)
	at org.junit.runners.model.FrameworkMethod$1.runReflectiveCall(FrameworkMethod.java:44)
	at org.junit.internal.runners.model.ReflectiveCallable.run(ReflectiveCallable.java:15)
	at org.junit.runners.model.FrameworkMethod.invokeExplosively(FrameworkMethod.java:41)
	at org.junit.internal.runners.statements.InvokeMethod.evaluate(InvokeMethod.java:20)
	at org.junit.internal.runners.statements.ExpectException.evaluate(ExpectException.java:21)
	... 35 more


    testRequestConstraintedEqualToExpectedSize :
  javax.naming.NamingException
  javax.naming.NamingException: [LDAP: error code 36 - ALIAS_DEREFERENCING_PROBLEM: failed for MessageType : SEARCH_REQUEST
Message ID : 2
    SearchRequest
        baseDn : 'ou=actors,ou=system'
        filter : '(objectClass=*:[15])'
        scope : single level
        typesOnly : false
        Size Limit : 4
        Time Limit : no limit
        Deref Aliases : deref Always
        attributes : 
org.apache.directory.shared.ldap.model.message.SearchRequestImpl@ca2339d    ManageDsaITImpl Control
        Type OID    : '2.16.840.1.113730.3.4.2'
        Criticality : 'false''
: ERR_333 Unexpected exception.]; remaining name 'ou=actors,ou=system'
	at com.sun.jndi.ldap.LdapCtx.mapErrorCode(LdapCtx.java:3017)
	at com.sun.jndi.ldap.LdapCtx.processReturnCode(LdapCtx.java:2987)
	at com.sun.jndi.ldap.LdapCtx.processReturnCode(LdapCtx.java:2794)
	at com.sun.jndi.ldap.LdapCtx.searchAux(LdapCtx.java:1826)
	at com.sun.jndi.ldap.LdapCtx.c_search(LdapCtx.java:1749)
	at com.sun.jndi.toolkit.ctx.ComponentDirContext.p_search(ComponentDirContext.java:368)
	at com.sun.jndi.toolkit.ctx.PartialCompositeDirContext.search(PartialCompositeDirContext.java:338)
	at com.sun.jndi.toolkit.ctx.PartialCompositeDirContext.search(PartialCompositeDirContext.java:321)
	at javax.naming.directory.InitialDirContext.search(InitialDirContext.java:248)
	at org.apache.directory.server.operations.search.SearchLimitsIT.getActorsWithLimit(SearchLimitsIT.java:454)
	at org.apache.directory.server.operations.search.SearchLimitsIT.testRequestConstraintedEqualToExpectedSize(SearchLimitsIT.java:391)
	at sun.reflect.NativeMethodAccessorImpl.invoke0(Native Method)
	at sun.reflect.NativeMethodAccessorImpl.invoke(NativeMethodAccessorImpl.java:39)
	at sun.reflect.DelegatingMethodAccessorImpl.invoke(DelegatingMethodAccessorImpl.java:25)
	at java.lang.reflect.Method.invoke(Method.java:597)
	at org.junit.runners.model.FrameworkMethod$1.runReflectiveCall(FrameworkMethod.java:44)
	at org.junit.internal.runners.model.ReflectiveCallable.run(ReflectiveCallable.java:15)
	at org.junit.runners.model.FrameworkMethod.invokeExplosively(FrameworkMethod.java:41)
	at org.junit.internal.runners.statements.InvokeMethod.evaluate(InvokeMethod.java:20)
	at org.junit.internal.runners.statements.RunBefores.evaluate(RunBefores.java:28)
	at org.junit.internal.runners.statements.RunAfters.evaluate(RunAfters.java:31)
	at org.junit.runners.BlockJUnit4ClassRunner.runNotIgnored(BlockJUnit4ClassRunner.java:79)
	at org.junit.runners.BlockJUnit4ClassRunner.runChild(BlockJUnit4ClassRunner.java:71)
	at org.apache.directory.server.core.integ.FrameworkRunner.runChild(FrameworkRunner.java:433)
	at org.apache.directory.server.core.integ.FrameworkRunner.runChild(FrameworkRunner.java:56)
	at org.junit.runners.ParentRunner$3.run(ParentRunner.java:193)
	at org.junit.runners.ParentRunner$1.schedule(ParentRunner.java:52)
	at org.junit.runners.ParentRunner.runChildren(ParentRunner.java:191)
	at org.junit.runners.ParentRunner.access$000(ParentRunner.java:42)
	at org.junit.runners.ParentRunner$2.evaluate(ParentRunner.java:184)
	at org.junit.runners.ParentRunner.run(ParentRunner.java:236)
	at org.apache.directory.server.core.integ.FrameworkRunner.run(FrameworkRunner.java:222)
	at org.junit.runners.Suite.runChild(Suite.java:128)
	at org.apache.directory.server.core.integ.FrameworkSuite.runChild(FrameworkSuite.java:191)
	at org.apache.directory.server.core.integ.FrameworkSuite.runChild(FrameworkSuite.java:48)
	at org.junit.runners.ParentRunner$3.run(ParentRunner.java:193)
	at org.junit.runners.ParentRunner$1.schedule(ParentRunner.java:52)
	at org.junit.runners.ParentRunner.runChildren(ParentRunner.java:191)
	at org.junit.runners.ParentRunner.access$000(ParentRunner.java:42)
	at org.junit.runners.ParentRunner$2.evaluate(ParentRunner.java:184)
	at org.junit.runners.ParentRunner.run(ParentRunner.java:236)
	at org.apache.directory.server.core.integ.FrameworkSuite.run(FrameworkSuite.java:158)
	at org.apache.maven.surefire.junit4.JUnit4TestSet.execute(JUnit4TestSet.java:35)
	at org.apache.maven.surefire.junit4.JUnit4Provider.executeTestSet(JUnit4Provider.java:115)
	at org.apache.maven.surefire.junit4.JUnit4Provider.invoke(JUnit4Provider.java:97)
	at sun.reflect.NativeMethodAccessorImpl.invoke0(Native Method)
	at sun.reflect.NativeMethodAccessorImpl.invoke(NativeMethodAccessorImpl.java:39)
	at sun.reflect.DelegatingMethodAccessorImpl.invoke(DelegatingMethodAccessorImpl.java:25)
	at java.lang.reflect.Method.invoke(Method.java:597)
	at org.apache.maven.surefire.booter.ProviderFactory$ClassLoaderProxy.invoke(ProviderFactory.java:103)
	at $Proxy0.invoke(Unknown Source)
	at org.apache.maven.surefire.booter.SurefireStarter.invokeProvider(SurefireStarter.java:150)
	at org.apache.maven.surefire.booter.SurefireStarter.runSuitesInProcess(SurefireStarter.java:91)
	at org.apache.maven.surefire.booter.ForkedBooter.main(ForkedBooter.java:69)

    testRequestConstraintedGreaterThanExpectedSize :
  javax.naming.NamingException
  javax.naming.NamingException: [LDAP: error code 36 - ALIAS_DEREFERENCING_PROBLEM: failed for MessageType : SEARCH_REQUEST
Message ID : 2
    SearchRequest
        baseDn : 'ou=actors,ou=system'
        filter : '(objectClass=*:[15])'
        scope : single level
        typesOnly : false
        Size Limit : 5
        Time Limit : no limit
        Deref Aliases : deref Always
        attributes : 
org.apache.directory.shared.ldap.model.message.SearchRequestImpl@cb7ddee    ManageDsaITImpl Control
        Type OID    : '2.16.840.1.113730.3.4.2'
        Criticality : 'false''
: ERR_333 Unexpected exception.]; remaining name 'ou=actors,ou=system'
	at com.sun.jndi.ldap.LdapCtx.mapErrorCode(LdapCtx.java:3017)
	at com.sun.jndi.ldap.LdapCtx.processReturnCode(LdapCtx.java:2987)
	at com.sun.jndi.ldap.LdapCtx.processReturnCode(LdapCtx.java:2794)
	at com.sun.jndi.ldap.LdapCtx.searchAux(LdapCtx.java:1826)
	at com.sun.jndi.ldap.LdapCtx.c_search(LdapCtx.java:1749)
	at com.sun.jndi.toolkit.ctx.ComponentDirContext.p_search(ComponentDirContext.java:368)
	at com.sun.jndi.toolkit.ctx.PartialCompositeDirContext.search(PartialCompositeDirContext.java:338)
	at com.sun.jndi.toolkit.ctx.PartialCompositeDirContext.search(PartialCompositeDirContext.java:321)
	at javax.naming.directory.InitialDirContext.search(InitialDirContext.java:248)
	at org.apache.directory.server.operations.search.SearchLimitsIT.getActorsWithLimit(SearchLimitsIT.java:454)
	at org.apache.directory.server.operations.search.SearchLimitsIT.testRequestConstraintedGreaterThanExpectedSize(SearchLimitsIT.java:406)
	at sun.reflect.NativeMethodAccessorImpl.invoke0(Native Method)
	at sun.reflect.NativeMethodAccessorImpl.invoke(NativeMethodAccessorImpl.java:39)
	at sun.reflect.DelegatingMethodAccessorImpl.invoke(DelegatingMethodAccessorImpl.java:25)
	at java.lang.reflect.Method.invoke(Method.java:597)
	at org.junit.runners.model.FrameworkMethod$1.runReflectiveCall(FrameworkMethod.java:44)
	at org.junit.internal.runners.model.ReflectiveCallable.run(ReflectiveCallable.java:15)
	at org.junit.runners.model.FrameworkMethod.invokeExplosively(FrameworkMethod.java:41)
	at org.junit.internal.runners.statements.InvokeMethod.evaluate(InvokeMethod.java:20)
	at org.junit.internal.runners.statements.RunBefores.evaluate(RunBefores.java:28)
	at org.junit.internal.runners.statements.RunAfters.evaluate(RunAfters.java:31)
	at org.junit.runners.BlockJUnit4ClassRunner.runNotIgnored(BlockJUnit4ClassRunner.java:79)
	at org.junit.runners.BlockJUnit4ClassRunner.runChild(BlockJUnit4ClassRunner.java:71)
	at org.apache.directory.server.core.integ.FrameworkRunner.runChild(FrameworkRunner.java:433)
	at org.apache.directory.server.core.integ.FrameworkRunner.runChild(FrameworkRunner.java:56)
	at org.junit.runners.ParentRunner$3.run(ParentRunner.java:193)
	at org.junit.runners.ParentRunner$1.schedule(ParentRunner.java:52)
	at org.junit.runners.ParentRunner.runChildren(ParentRunner.java:191)
	at org.junit.runners.ParentRunner.access$000(ParentRunner.java:42)
	at org.junit.runners.ParentRunner$2.evaluate(ParentRunner.java:184)
	at org.junit.runners.ParentRunner.run(ParentRunner.java:236)
	at org.apache.directory.server.core.integ.FrameworkRunner.run(FrameworkRunner.java:222)
	at org.junit.runners.Suite.runChild(Suite.java:128)
	at org.apache.directory.server.core.integ.FrameworkSuite.runChild(FrameworkSuite.java:191)
	at org.apache.directory.server.core.integ.FrameworkSuite.runChild(FrameworkSuite.java:48)
	at org.junit.runners.ParentRunner$3.run(ParentRunner.java:193)
	at org.junit.runners.ParentRunner$1.schedule(ParentRunner.java:52)
	at org.junit.runners.ParentRunner.runChildren(ParentRunner.java:191)
	at org.junit.runners.ParentRunner.access$000(ParentRunner.java:42)
	at org.junit.runners.ParentRunner$2.evaluate(ParentRunner.java:184)
	at org.junit.runners.ParentRunner.run(ParentRunner.java:236)
	at org.apache.directory.server.core.integ.FrameworkSuite.run(FrameworkSuite.java:158)
	at org.apache.maven.surefire.junit4.JUnit4TestSet.execute(JUnit4TestSet.java:35)
	at org.apache.maven.surefire.junit4.JUnit4Provider.executeTestSet(JUnit4Provider.java:115)
	at org.apache.maven.surefire.junit4.JUnit4Provider.invoke(JUnit4Provider.java:97)
	at sun.reflect.NativeMethodAccessorImpl.invoke0(Native Method)
	at sun.reflect.NativeMethodAccessorImpl.invoke(NativeMethodAccessorImpl.java:39)
	at sun.reflect.DelegatingMethodAccessorImpl.invoke(DelegatingMethodAccessorImpl.java:25)
	at java.lang.reflect.Method.invoke(Method.java:597)
	at org.apache.maven.surefire.booter.ProviderFactory$ClassLoaderProxy.invoke(ProviderFactory.java:103)
	at $Proxy0.invoke(Unknown Source)
	at org.apache.maven.surefire.booter.SurefireStarter.invokeProvider(SurefireStarter.java:150)
	at org.apache.maven.surefire.booter.SurefireStarter.runSuitesInProcess(SurefireStarter.java:91)
	at org.apache.maven.surefire.booter.ForkedBooter.main(ForkedBooter.java:69)

    testRequestObjectScopeAndSizeLimit :
  javax.naming.NamingException
  javax.naming.NamingException: [LDAP: error code 36 - ALIAS_DEREFERENCING_PROBLEM: failed for MessageType : SEARCH_REQUEST
Message ID : 2
    SearchRequest
        baseDn : 'ou=actors,ou=system'
        filter : '(objectClass=*:[15])'
        scope : base object
        typesOnly : false
        Size Limit : 1
        Time Limit : no limit
        Deref Aliases : deref Always
        attributes : 
org.apache.directory.shared.ldap.model.message.SearchRequestImpl@e0488872    ManageDsaITImpl Control
        Type OID    : '2.16.840.1.113730.3.4.2'
        Criticality : 'false''
: ERR_333 Unexpected exception.]; remaining name 'ou=actors,ou=system'
	at com.sun.jndi.ldap.LdapCtx.mapErrorCode(LdapCtx.java:3017)
	at com.sun.jndi.ldap.LdapCtx.processReturnCode(LdapCtx.java:2987)
	at com.sun.jndi.ldap.LdapCtx.processReturnCode(LdapCtx.java:2794)
	at com.sun.jndi.ldap.LdapCtx.searchAux(LdapCtx.java:1826)
	at com.sun.jndi.ldap.LdapCtx.c_search(LdapCtx.java:1749)
	at com.sun.jndi.toolkit.ctx.ComponentDirContext.p_search(ComponentDirContext.java:368)
	at com.sun.jndi.toolkit.ctx.PartialCompositeDirContext.search(PartialCompositeDirContext.java:338)
	at com.sun.jndi.toolkit.ctx.PartialCompositeDirContext.search(PartialCompositeDirContext.java:321)
	at javax.naming.directory.InitialDirContext.search(InitialDirContext.java:248)
	at org.apache.directory.server.operations.search.SearchLimitsIT.testRequestObjectScopeAndSizeLimit(SearchLimitsIT.java:428)
	at sun.reflect.NativeMethodAccessorImpl.invoke0(Native Method)
	at sun.reflect.NativeMethodAccessorImpl.invoke(NativeMethodAccessorImpl.java:39)
	at sun.reflect.DelegatingMethodAccessorImpl.invoke(DelegatingMethodAccessorImpl.java:25)
	at java.lang.reflect.Method.invoke(Method.java:597)
	at org.junit.runners.model.FrameworkMethod$1.runReflectiveCall(FrameworkMethod.java:44)
	at org.junit.internal.runners.model.ReflectiveCallable.run(ReflectiveCallable.java:15)
	at org.junit.runners.model.FrameworkMethod.invokeExplosively(FrameworkMethod.java:41)
	at org.junit.internal.runners.statements.InvokeMethod.evaluate(InvokeMethod.java:20)
	at org.junit.internal.runners.statements.RunBefores.evaluate(RunBefores.java:28)
	at org.junit.internal.runners.statements.RunAfters.evaluate(RunAfters.java:31)
	at org.junit.runners.BlockJUnit4ClassRunner.runNotIgnored(BlockJUnit4ClassRunner.java:79)
	at org.junit.runners.BlockJUnit4ClassRunner.runChild(BlockJUnit4ClassRunner.java:71)
	at org.apache.directory.server.core.integ.FrameworkRunner.runChild(FrameworkRunner.java:433)
	at org.apache.directory.server.core.integ.FrameworkRunner.runChild(FrameworkRunner.java:56)
	at org.junit.runners.ParentRunner$3.run(ParentRunner.java:193)
	at org.junit.runners.ParentRunner$1.schedule(ParentRunner.java:52)
	at org.junit.runners.ParentRunner.runChildren(ParentRunner.java:191)
	at org.junit.runners.ParentRunner.access$000(ParentRunner.java:42)
	at org.junit.runners.ParentRunner$2.evaluate(ParentRunner.java:184)
	at org.junit.runners.ParentRunner.run(ParentRunner.java:236)
	at org.apache.directory.server.core.integ.FrameworkRunner.run(FrameworkRunner.java:222)
	at org.junit.runners.Suite.runChild(Suite.java:128)
	at org.apache.directory.server.core.integ.FrameworkSuite.runChild(FrameworkSuite.java:191)
	at org.apache.directory.server.core.integ.FrameworkSuite.runChild(FrameworkSuite.java:48)
	at org.junit.runners.ParentRunner$3.run(ParentRunner.java:193)
	at org.junit.runners.ParentRunner$1.schedule(ParentRunner.java:52)
	at org.junit.runners.ParentRunner.runChildren(ParentRunner.java:191)
	at org.junit.runners.ParentRunner.access$000(ParentRunner.java:42)
	at org.junit.runners.ParentRunner$2.evaluate(ParentRunner.java:184)
	at org.junit.runners.ParentRunner.run(ParentRunner.java:236)
	at org.apache.directory.server.core.integ.FrameworkSuite.run(FrameworkSuite.java:158)
	at org.apache.maven.surefire.junit4.JUnit4TestSet.execute(JUnit4TestSet.java:35)
	at org.apache.maven.surefire.junit4.JUnit4Provider.executeTestSet(JUnit4Provider.java:115)
	at org.apache.maven.surefire.junit4.JUnit4Provider.invoke(JUnit4Provider.java:97)
	at sun.reflect.NativeMethodAccessorImpl.invoke0(Native Method)
	at sun.reflect.NativeMethodAccessorImpl.invoke(NativeMethodAccessorImpl.java:39)
	at sun.reflect.DelegatingMethodAccessorImpl.invoke(DelegatingMethodAccessorImpl.java:25)
	at java.lang.reflect.Method.invoke(Method.java:597)
	at org.apache.maven.surefire.booter.ProviderFactory$ClassLoaderProxy.invoke(ProviderFactory.java:103)
	at $Proxy0.invoke(Unknown Source)
	at org.apache.maven.surefire.booter.SurefireStarter.invokeProvider(SurefireStarter.java:150)
	at org.apache.maven.surefire.booter.SurefireStarter.runSuitesInProcess(SurefireStarter.java:91)
	at org.apache.maven.surefire.booter.ForkedBooter.main(ForkedBooter.java:69)

    testLdaps :
  java.lang.NoClassDefFoundError
  java.lang.NoClassDefFoundError: org/apache/directory/server/ssl/SSLSocketFactory
	at org.apache.directory.server.ssl.LdapsIT.getSecureConnectionSystem(LdapsIT.java:99)
	at org.apache.directory.server.ssl.LdapsIT.testLdaps(LdapsIT.java:122)
	at sun.reflect.NativeMethodAccessorImpl.invoke0(Native Method)
	at sun.reflect.NativeMethodAccessorImpl.invoke(NativeMethodAccessorImpl.java:39)
	at sun.reflect.DelegatingMethodAccessorImpl.invoke(DelegatingMethodAccessorImpl.java:25)
	at java.lang.reflect.Method.invoke(Method.java:597)
	at org.junit.runners.model.FrameworkMethod$1.runReflectiveCall(FrameworkMethod.java:44)
	at org.junit.internal.runners.model.ReflectiveCallable.run(ReflectiveCallable.java:15)
	at org.junit.runners.model.FrameworkMethod.invokeExplosively(FrameworkMethod.java:41)
	at org.junit.internal.runners.statements.InvokeMethod.evaluate(InvokeMethod.java:20)
	at org.apache.directory.junit.tools.MultiThreadedMultiInvoker$1$1.run(MultiThreadedMultiInvoker.java:160)
	at java.util.concurrent.ThreadPoolExecutor$Worker.runTask(ThreadPoolExecutor.java:886)
	at java.util.concurrent.ThreadPoolExecutor$Worker.run(ThreadPoolExecutor.java:908)
	at java.lang.Thread.run(Thread.java:662)
Caused by: java.lang.ClassNotFoundException: org.apache.directory.server.ssl.SSLSocketFactory
	at java.net.URLClassLoader$1.run(URLClassLoader.java:202)
	at java.security.AccessController.doPrivileged(Native Method)
	at java.net.URLClassLoader.findClass(URLClassLoader.java:190)
	at java.lang.ClassLoader.loadClass(ClassLoader.java:307)
	at sun.misc.Launcher$AppClassLoader.loadClass(Launcher.java:301)
	at java.lang.ClassLoader.loadClass(ClassLoader.java:248)
	... 14 more


    testUpdateCertificate :
  java.lang.NoClassDefFoundError
  java.lang.NoClassDefFoundError: org/apache/directory/server/ssl/SSLSocketFactory
	at org.apache.directory.server.ssl.LdapsUpdateCertificateIT.testUpdateCertificate(LdapsUpdateCertificateIT.java:118)
	at sun.reflect.NativeMethodAccessorImpl.invoke0(Native Method)
	at sun.reflect.NativeMethodAccessorImpl.invoke(NativeMethodAccessorImpl.java:39)
	at sun.reflect.DelegatingMethodAccessorImpl.invoke(DelegatingMethodAccessorImpl.java:25)
	at java.lang.reflect.Method.invoke(Method.java:597)
	at org.junit.runners.model.FrameworkMethod$1.runReflectiveCall(FrameworkMethod.java:44)
	at org.junit.internal.runners.model.ReflectiveCallable.run(ReflectiveCallable.java:15)
	at org.junit.runners.model.FrameworkMethod.invokeExplosively(FrameworkMethod.java:41)
	at org.junit.internal.runners.statements.InvokeMethod.evaluate(InvokeMethod.java:20)
	at org.apache.directory.junit.tools.MultiThreadedMultiInvoker$1$1.run(MultiThreadedMultiInvoker.java:160)
	at java.util.concurrent.ThreadPoolExecutor$Worker.runTask(ThreadPoolExecutor.java:886)
	at java.util.concurrent.ThreadPoolExecutor$Worker.run(ThreadPoolExecutor.java:908)
	at java.lang.Thread.run(Thread.java:662)
Caused by: java.lang.ClassNotFoundException: org.apache.directory.server.ssl.SSLSocketFactory
	at java.net.URLClassLoader$1.run(URLClassLoader.java:202)
	at java.security.AccessController.doPrivileged(Native Method)
	at java.net.URLClassLoader.findClass(URLClassLoader.java:190)
	at java.lang.ClassLoader.loadClass(ClassLoader.java:307)
	at sun.misc.Launcher$AppClassLoader.loadClass(Launcher.java:301)
	at java.lang.ClassLoader.loadClass(ClassLoader.java:248)
	... 13 more

    testConfidentiality :
  java.lang.NoClassDefFoundError
  java.lang.NoClassDefFoundError: org/apache/directory/server/ssl/StartTlsConfidentialityIT$1
	at org.apache.directory.server.ssl.StartTlsConfidentialityIT.getSecuredContext(StartTlsConfidentialityIT.java:183)
	at org.apache.directory.server.ssl.StartTlsConfidentialityIT.testConfidentiality(StartTlsConfidentialityIT.java:220)
	at sun.reflect.NativeMethodAccessorImpl.invoke0(Native Method)
	at sun.reflect.NativeMethodAccessorImpl.invoke(NativeMethodAccessorImpl.java:39)
	at sun.reflect.DelegatingMethodAccessorImpl.invoke(DelegatingMethodAccessorImpl.java:25)
	at java.lang.reflect.Method.invoke(Method.java:597)
	at org.junit.runners.model.FrameworkMethod$1.runReflectiveCall(FrameworkMethod.java:44)
	at org.junit.internal.runners.model.ReflectiveCallable.run(ReflectiveCallable.java:15)
	at org.junit.runners.model.FrameworkMethod.invokeExplosively(FrameworkMethod.java:41)
	at org.junit.internal.runners.statements.InvokeMethod.evaluate(InvokeMethod.java:20)
	at org.junit.internal.runners.statements.RunBefores.evaluate(RunBefores.java:28)
	at org.junit.internal.runners.statements.RunAfters.evaluate(RunAfters.java:31)
	at org.apache.directory.junit.tools.MultiThreadedMultiInvoker$1$1.run(MultiThreadedMultiInvoker.java:160)
	at java.util.concurrent.ThreadPoolExecutor$Worker.runTask(ThreadPoolExecutor.java:886)
	at java.util.concurrent.ThreadPoolExecutor$Worker.run(ThreadPoolExecutor.java:908)
	at java.lang.Thread.run(Thread.java:662)
Caused by: java.lang.ClassNotFoundException: org.apache.directory.server.ssl.StartTlsConfidentialityIT$1
	at java.net.URLClassLoader$1.run(URLClassLoader.java:202)
	at java.security.AccessController.doPrivileged(Native Method)
	at java.net.URLClassLoader.findClass(URLClassLoader.java:190)
	at java.lang.ClassLoader.loadClass(ClassLoader.java:307)
	at sun.misc.Launcher$AppClassLoader.loadClass(Launcher.java:301)
	at java.lang.ClassLoader.loadClass(ClassLoader.java:248)
	... 16 more

    testStartTls :
  java.lang.NoClassDefFoundError
  java.lang.NoClassDefFoundError: org/apache/directory/server/ssl/StartTlsIT$1
	at org.apache.directory.server.ssl.StartTlsIT.testStartTls(StartTlsIT.java:235)
	at sun.reflect.NativeMethodAccessorImpl.invoke0(Native Method)
	at sun.reflect.NativeMethodAccessorImpl.invoke(NativeMethodAccessorImpl.java:39)
	at sun.reflect.DelegatingMethodAccessorImpl.invoke(DelegatingMethodAccessorImpl.java:25)
	at java.lang.reflect.Method.invoke(Method.java:597)
	at org.junit.runners.model.FrameworkMethod$1.runReflectiveCall(FrameworkMethod.java:44)
	at org.junit.internal.runners.model.ReflectiveCallable.run(ReflectiveCallable.java:15)
	at org.junit.runners.model.FrameworkMethod.invokeExplosively(FrameworkMethod.java:41)
	at org.junit.internal.runners.statements.InvokeMethod.evaluate(InvokeMethod.java:20)
	at org.junit.internal.runners.statements.RunBefores.evaluate(RunBefores.java:28)
	at org.junit.internal.runners.statements.RunAfters.evaluate(RunAfters.java:31)
	at org.apache.directory.junit.tools.MultiThreadedMultiInvoker$1$1.run(MultiThreadedMultiInvoker.java:160)
	at java.util.concurrent.ThreadPoolExecutor$Worker.runTask(ThreadPoolExecutor.java:886)
	at java.util.concurrent.ThreadPoolExecutor$Worker.run(ThreadPoolExecutor.java:908)
	at java.lang.Thread.run(Thread.java:662)
Caused by: java.lang.ClassNotFoundException: org.apache.directory.server.ssl.StartTlsIT$1
	at java.net.URLClassLoader$1.run(URLClassLoader.java:202)
	at java.security.AccessController.doPrivileged(Native Method)
	at java.net.URLClassLoader.findClass(URLClassLoader.java:190)
	at java.lang.ClassLoader.loadClass(ClassLoader.java:307)
	at sun.misc.Launcher$AppClassLoader.loadClass(Launcher.java:301)
	at java.lang.ClassLoader.loadClass(ClassLoader.java:248)
	... 15 more

    testUpdateCertificate :
  java.lang.NoClassDefFoundError
  java.lang.NoClassDefFoundError: org/apache/directory/server/ssl/StartTlsUpdateCertificateIT$1
	at org.apache.directory.server.ssl.StartTlsUpdateCertificateIT.testUpdateCertificate(StartTlsUpdateCertificateIT.java:166)
	at sun.reflect.NativeMethodAccessorImpl.invoke0(Native Method)
	at sun.reflect.NativeMethodAccessorImpl.invoke(NativeMethodAccessorImpl.java:39)
	at sun.reflect.DelegatingMethodAccessorImpl.invoke(DelegatingMethodAccessorImpl.java:25)
	at java.lang.reflect.Method.invoke(Method.java:597)
	at org.junit.runners.model.FrameworkMethod$1.runReflectiveCall(FrameworkMethod.java:44)
	at org.junit.internal.runners.model.ReflectiveCallable.run(ReflectiveCallable.java:15)
	at org.junit.runners.model.FrameworkMethod.invokeExplosively(FrameworkMethod.java:41)
	at org.junit.internal.runners.statements.InvokeMethod.evaluate(InvokeMethod.java:20)
	at org.junit.internal.runners.statements.RunBefores.evaluate(RunBefores.java:28)
	at org.junit.internal.runners.statements.RunAfters.evaluate(RunAfters.java:31)
	at org.apache.directory.junit.tools.MultiThreadedMultiInvoker$1$1.run(MultiThreadedMultiInvoker.java:160)
	at java.util.concurrent.ThreadPoolExecutor$Worker.runTask(ThreadPoolExecutor.java:886)
	at java.util.concurrent.ThreadPoolExecutor$Worker.run(ThreadPoolExecutor.java:908)
	at java.lang.Thread.run(Thread.java:662)
Caused by: java.lang.ClassNotFoundException: org.apache.directory.server.ssl.StartTlsUpdateCertificateIT$1
	at java.net.URLClassLoader$1.run(URLClassLoader.java:202)
	at java.security.AccessController.doPrivileged(Native Method)
	at java.net.URLClassLoader.findClass(URLClassLoader.java:190)
	at java.lang.ClassLoader.loadClass(ClassLoader.java:307)
	at sun.misc.Launcher$AppClassLoader.loadClass(Launcher.java:301)
	at java.lang.ClassLoader.loadClass(ClassLoader.java:248)
	... 15 more

  



Mime
View raw message