directory-commits mailing list archives

Site index · List index
Message view « Date » · « Thread »
Top « Date » · « Thread »
From "Continuum@vmbuild" <contin...@apache.org>
Subject [continuum] BUILD FAILURE: Directory - ApacheDS 1.5 Build With Dependencies - Default Maven 2 Build Definition
Date Wed, 26 Jan 2011 14:04:16 GMT
Online report : http://vmbuild.apache.org/continuum/buildResult.action?buildId=2806&projectId=10

Build statistics:
  State: Failed
  Previous State: Failed
  Started at: Wed 26 Jan 2011 14:01:59 +0000
  Finished at: Wed 26 Jan 2011 14:03:39 +0000
  Total time: 1m 40s
  Build Trigger: Schedule
  Build Number: 414
  Exit code: 1
  Building machine hostname: vmbuild
  Operating system : Linux(unknown)
  Java Home version : 
          java version "1.6.0_22"
          Java(TM) SE Runtime Environment (build 1.6.0_22-b04)
          Java HotSpot(TM) 64-Bit Server VM (build 17.1-b03, mixed mode)
        
  Builder version :
          Apache Maven 2.2.1 (r801777; 2009-08-06 19:16:01+0000)
          Java version: 1.6.0_22
          Java home: /usr/lib/jvm/java-6-sun-1.6.0.22/jre
          Default locale: en_US, platform encoding: ANSI_X3.4-1968
          OS name: "linux" version: "2.6.32-27-server" arch: "amd64" Family: "unix"
    
****************************************************************************
SCM Changes:
****************************************************************************
Changed: no author @ no date
Comment: no comment
Files changed:
  apacheds/protocol-ldap/src/main/java/org/apache/directory/server/ldap/LdapProtocolHandler.java
( no revision )
  apacheds/protocol-ldap/src/main/java/org/apache/directory/server/ldap/handlers/SearchHandler.java
( no revision )
  apacheds/protocol-ldap/src/main/java/org/apache/directory/server/ldap/handlers/BindHandler.java
( no revision )
  apacheds/protocol-ldap/src/main/java/org/apache/directory/server/ldap/handlers/extended/StartTlsHandler.java
( no revision )
  apacheds/protocol-ldap/src/main/java/org/apache/directory/server/ldap/handlers/LdapRequestHandler.java
( no revision )
  apacheds/protocol-ldap/src/main/java/org/apache/directory/server/ldap/handlers/PersistentSearchListener.java
( no revision )
  apacheds/protocol-ldap/src/main/java/org/apache/directory/server/ldap/LdapServer.java (
no revision )
  apacheds/protocol-ldap/src/main/java/org/apache/directory/server/ldap/replication/SyncReplProvider.java
( no revision )
  apacheds/protocol-ldap/src/main/java/org/apache/directory/server/ldap/replication/SyncReplConsumer.java
( no revision )
  apacheds/protocol-ldap/src/main/java/org/apache/directory/server/ldap/replication/SyncReplSearchListener.java
( no revision )
  apacheds/jdbm-partition/src/main/java/org/apache/directory/server/core/partition/impl/btree/jdbm/DupsCursor.java
( no revision )
  apacheds/kerberos-codec/src/main/java/org/apache/directory/server/kerberos/shared/store/operations/ChangePassword.java
( no revision )
  apacheds/kerberos-codec/src/main/java/org/apache/directory/shared/kerberos/codec/actions/AbstractReadPvno.java
( no revision )
  apacheds/core/src/main/java/org/apache/directory/server/core/authn/AuthenticationInterceptor.java
( no revision )
  apacheds/core/src/main/java/org/apache/directory/server/core/DefaultOperationManager.java
( no revision )
  apacheds/core/src/main/java/org/apache/directory/server/core/DefaultCoreSession.java ( no
revision )
  apacheds/core/src/main/java/org/apache/directory/server/core/event/LeafEvaluator.java (
no revision )
  apacheds/core/src/main/java/org/apache/directory/server/core/hash/PasswordHashingInterceptor.java
( no revision )
  apacheds/core/src/main/java/org/apache/directory/server/core/normalization/FilterNormalizingVisitor.java
( no revision )
  apacheds/core/src/main/java/org/apache/directory/server/core/normalization/NormalizationInterceptor.java
( no revision )
  apacheds/core/src/main/java/org/apache/directory/server/core/normalization/ExpandingVisitor.java
( no revision )
  apacheds/core/src/main/java/org/apache/directory/server/core/collective/CollectiveAttributeInterceptor.java
( no revision )
  apacheds/core/src/main/java/org/apache/directory/server/core/authz/TupleCache.java ( no
revision )
  apacheds/core/src/main/java/org/apache/directory/server/core/exception/ExceptionInterceptor.java
( no revision )
  apacheds/core/src/main/java/org/apache/directory/server/core/schema/SchemaInterceptor.java
( no revision )
  apacheds/core/src/main/java/org/apache/directory/server/core/partition/DefaultPartitionNexus.java
( no revision )
  apacheds/core/src/main/java/org/apache/directory/server/core/subtree/SubentryInterceptor.java
( no revision )
  apacheds/server-jndi/src/main/java/org/apache/directory/server/configuration/ApacheDS.java
( no revision )
  apacheds/core-api/src/main/java/org/apache/directory/server/core/LdapCoreSessionConnection.java
( no revision )
  apacheds/core-api/src/main/java/org/apache/directory/server/core/interceptor/context/ModifyOperationContext.java
( no revision )
  apacheds/core-api/src/main/java/org/apache/directory/server/core/schema/SchemaPartitionDaoImpl.java
( no revision )
  apacheds/core-api/src/main/java/org/apache/directory/server/core/schema/registries/synchronizers/AbstractRegistrySynchronizer.java
( no revision )
  apacheds/core-api/src/main/java/org/apache/directory/server/core/schema/registries/synchronizers/SchemaSynchronizer.java
( no revision )
  apacheds/core-api/src/main/java/org/apache/directory/server/core/schema/DescriptionParsers.java
( no revision )
  apacheds/core-api/src/main/java/org/apache/directory/server/core/schema/SchemaPartition.java
( no revision )
  apacheds/core-api/src/main/java/org/apache/directory/server/core/schema/SchemaPartitionDao.java
( no revision )
  apacheds/core-api/src/main/java/org/apache/directory/server/core/entry/ClonedServerEntry.java
( no revision )
  apacheds/core-api/src/main/java/org/apache/directory/server/core/EntryToResponseCursor.java
( no revision )
  apacheds/core-api/src/main/java/org/apache/directory/server/core/CoreSession.java ( no revision
)
  apacheds/xdbm-partition/src/main/java/org/apache/directory/server/xdbm/AbstractStore.java
( no revision )
  apacheds/xdbm-partition/src/main/java/org/apache/directory/server/xdbm/impl/avl/AvlTableDupsCursor.java
( no revision )
  apacheds/xdbm-partition/src/main/java/org/apache/directory/server/xdbm/impl/avl/AvlTable.java
( no revision )
  apacheds/xdbm-partition/src/main/java/org/apache/directory/server/xdbm/search/impl/DefaultSearchEngine.java
( no revision )
  apacheds/xdbm-partition/src/main/java/org/apache/directory/server/xdbm/search/impl/EvaluatorBuilder.java
( no revision )
  apacheds/xdbm-partition/src/main/java/org/apache/directory/server/xdbm/search/impl/DefaultOptimizer.java
( no revision )
  apacheds/interceptor-kerberos/src/main/java/org/apache/directory/server/core/kerberos/KeyDerivationInterceptor.java
( no revision )
  apacheds/service/ApacheDS.launch ( no revision )
  apacheds/service/src/main/java/org/apache/directory/server/ApacheDsService.java ( no revision
)
  apacheds/core-jndi/src/main/java/org/apache/directory/server/core/jndi/ServerDirContext.java
( no revision )
  apacheds/protocol-kerberos/src/main/java/org/apache/directory/server/kerberos/sam/TimestampChecker.java
( no revision )
  apacheds/http-directory-bridge/src/main/java/org/apache/directory/server/HttpDirectoryService.java
( no revision )
  shared/ldap/src/test/java/org/apache/directory/shared/ldap/codec/search/SearchRequestSubstringTest.java
( no revision )
  shared/ldap/src/test/java/org/apache/directory/shared/ldap/codec/search/SearchRequestMatchingRuleAssertionTest.java
( no revision )

****************************************************************************
Dependencies Changes:
****************************************************************************
No dependencies changed


****************************************************************************
Build Definition:
****************************************************************************
POM filename: pom.xml
Goals: clean install -Dintegration   
Arguments: --batch-mode
Build Fresh: false
Always Build: false
Default Build Definition: true
Schedule: DEFAULT_SCHEDULE
Profile Name: Maven 2.2.1
Description: Default Maven 2 Build Definition

****************************************************************************
Test Summary:
****************************************************************************
Tests: 5201
Failures: 4
Errors: 0
Success Rate: 99
Total time: 830.6804

****************************************************************************
Test Failures:
****************************************************************************

EntryChangeControlTest
    testEncodeEntryChangeControl :
  org.junit.ComparisonFailure
  org.junit.ComparisonFailure: expected:<0x30 0x[28 0x04 0x17 0x32 0x2E 0x31 0x36 0x2E
0x38 0x34 0x30 0x2E 0x31 0x2E 0x31 0x31 0x33 0x37 0x33 0x30 0x2E 0x33 0x2E 0x34 0x2E 0x37]
0x04 0x0D 0x30 0x0B...> but was:<0x30 0x[11 0x04 0x00] 0x04 0x0D 0x30 0x0B...>
	at org.junit.Assert.assertEquals(Assert.java:123)
	at org.junit.Assert.assertEquals(Assert.java:145)
	at org.apache.directory.shared.ldap.codec.search.controls.EntryChangeControlTest.testEncodeEntryChangeControl(EntryChangeControlTest.java:358)
	at sun.reflect.NativeMethodAccessorImpl.invoke0(Native Method)
	at sun.reflect.NativeMethodAccessorImpl.invoke(NativeMethodAccessorImpl.java:39)
	at sun.reflect.DelegatingMethodAccessorImpl.invoke(DelegatingMethodAccessorImpl.java:25)
	at java.lang.reflect.Method.invoke(Method.java:597)
	at org.junit.runners.model.FrameworkMethod$1.runReflectiveCall(FrameworkMethod.java:44)
	at org.junit.internal.runners.model.ReflectiveCallable.run(ReflectiveCallable.java:15)
	at org.junit.runners.model.FrameworkMethod.invokeExplosively(FrameworkMethod.java:41)
	at org.junit.internal.runners.statements.InvokeMethod.evaluate(InvokeMethod.java:20)
	at org.junit.runners.BlockJUnit4ClassRunner.runNotIgnored(BlockJUnit4ClassRunner.java:79)
	at org.junit.runners.BlockJUnit4ClassRunner.runChild(BlockJUnit4ClassRunner.java:71)
	at org.junit.runners.BlockJUnit4ClassRunner.runChild(BlockJUnit4ClassRunner.java:49)
	at org.junit.runners.ParentRunner$3.run(ParentRunner.java:193)
	at java.util.concurrent.Executors$RunnableAdapter.call(Executors.java:441)
	at java.util.concurrent.FutureTask$Sync.innerRun(FutureTask.java:303)
	at java.util.concurrent.FutureTask.run(FutureTask.java:138)
	at java.util.concurrent.Executors$RunnableAdapter.call(Executors.java:441)
	at java.util.concurrent.FutureTask$Sync.innerRun(FutureTask.java:303)
	at java.util.concurrent.FutureTask.run(FutureTask.java:138)
	at java.util.concurrent.ThreadPoolExecutor$Worker.runTask(ThreadPoolExecutor.java:886)
	at java.util.concurrent.ThreadPoolExecutor$Worker.run(ThreadPoolExecutor.java:908)
	at java.lang.Thread.run(Thread.java:662)

    testEncodeEntryChangeControlLong :
  org.junit.ComparisonFailure
  org.junit.ComparisonFailure: expected:<0x30 0x[2E 0x04 0x17 0x32 0x2E 0x31 0x36 0x2E
0x38 0x34 0x30 0x2E 0x31 0x2E 0x31 0x31 0x33 0x37 0x33 0x30 0x2E 0x33 0x2E 0x34 0x2E 0x37]
0x04 0x13 0x30 0x11...> but was:<0x30 0x[17 0x04 0x00] 0x04 0x13 0x30 0x11...>
	at org.junit.Assert.assertEquals(Assert.java:123)
	at org.junit.Assert.assertEquals(Assert.java:145)
	at org.apache.directory.shared.ldap.codec.search.controls.EntryChangeControlTest.testEncodeEntryChangeControlLong(EntryChangeControlTest.java:397)
	at sun.reflect.NativeMethodAccessorImpl.invoke0(Native Method)
	at sun.reflect.NativeMethodAccessorImpl.invoke(NativeMethodAccessorImpl.java:39)
	at sun.reflect.DelegatingMethodAccessorImpl.invoke(DelegatingMethodAccessorImpl.java:25)
	at java.lang.reflect.Method.invoke(Method.java:597)
	at org.junit.runners.model.FrameworkMethod$1.runReflectiveCall(FrameworkMethod.java:44)
	at org.junit.internal.runners.model.ReflectiveCallable.run(ReflectiveCallable.java:15)
	at org.junit.runners.model.FrameworkMethod.invokeExplosively(FrameworkMethod.java:41)
	at org.junit.internal.runners.statements.InvokeMethod.evaluate(InvokeMethod.java:20)
	at org.junit.runners.BlockJUnit4ClassRunner.runNotIgnored(BlockJUnit4ClassRunner.java:79)
	at org.junit.runners.BlockJUnit4ClassRunner.runChild(BlockJUnit4ClassRunner.java:71)
	at org.junit.runners.BlockJUnit4ClassRunner.runChild(BlockJUnit4ClassRunner.java:49)
	at org.junit.runners.ParentRunner$3.run(ParentRunner.java:193)
	at java.util.concurrent.Executors$RunnableAdapter.call(Executors.java:441)
	at java.util.concurrent.FutureTask$Sync.innerRun(FutureTask.java:303)
	at java.util.concurrent.FutureTask.run(FutureTask.java:138)
	at java.util.concurrent.Executors$RunnableAdapter.call(Executors.java:441)
	at java.util.concurrent.FutureTask$Sync.innerRun(FutureTask.java:303)
	at java.util.concurrent.FutureTask.run(FutureTask.java:138)
	at java.util.concurrent.ThreadPoolExecutor$Worker.runTask(ThreadPoolExecutor.java:886)
	at java.util.concurrent.ThreadPoolExecutor$Worker.run(ThreadPoolExecutor.java:908)
	at java.lang.Thread.run(Thread.java:662)

  PSearchControlTest
    testEncodePSearchControl :
  org.junit.ComparisonFailure
  org.junit.ComparisonFailure: expected:<0x30 0x[26 0x04 0x17 0x32 0x2E 0x31 0x36 0x2E
0x38 0x34 0x30 0x2E 0x31 0x2E 0x31 0x31 0x33 0x37 0x33 0x30 0x2E 0x33 0x2E 0x34 0x2E 0x33]
0x04 0x0B 0x30 0x09...> but was:<0x30 0x[0F 0x04 0x00] 0x04 0x0B 0x30 0x09...>
	at org.junit.Assert.assertEquals(Assert.java:123)
	at org.junit.Assert.assertEquals(Assert.java:145)
	at org.apache.directory.shared.ldap.codec.search.controls.PSearchControlTest.testEncodePSearchControl(PSearchControlTest.java:82)
	at sun.reflect.NativeMethodAccessorImpl.invoke0(Native Method)
	at sun.reflect.NativeMethodAccessorImpl.invoke(NativeMethodAccessorImpl.java:39)
	at sun.reflect.DelegatingMethodAccessorImpl.invoke(DelegatingMethodAccessorImpl.java:25)
	at java.lang.reflect.Method.invoke(Method.java:597)
	at org.junit.runners.model.FrameworkMethod$1.runReflectiveCall(FrameworkMethod.java:44)
	at org.junit.internal.runners.model.ReflectiveCallable.run(ReflectiveCallable.java:15)
	at org.junit.runners.model.FrameworkMethod.invokeExplosively(FrameworkMethod.java:41)
	at org.junit.internal.runners.statements.InvokeMethod.evaluate(InvokeMethod.java:20)
	at org.junit.runners.BlockJUnit4ClassRunner.runNotIgnored(BlockJUnit4ClassRunner.java:79)
	at org.junit.runners.BlockJUnit4ClassRunner.runChild(BlockJUnit4ClassRunner.java:71)
	at org.junit.runners.BlockJUnit4ClassRunner.runChild(BlockJUnit4ClassRunner.java:49)
	at org.junit.runners.ParentRunner$3.run(ParentRunner.java:193)
	at java.util.concurrent.Executors$RunnableAdapter.call(Executors.java:441)
	at java.util.concurrent.FutureTask$Sync.innerRun(FutureTask.java:303)
	at java.util.concurrent.FutureTask.run(FutureTask.java:138)
	at java.util.concurrent.Executors$RunnableAdapter.call(Executors.java:441)
	at java.util.concurrent.FutureTask$Sync.innerRun(FutureTask.java:303)
	at java.util.concurrent.FutureTask.run(FutureTask.java:138)
	at java.util.concurrent.ThreadPoolExecutor$Worker.runTask(ThreadPoolExecutor.java:886)
	at java.util.concurrent.ThreadPoolExecutor$Worker.run(ThreadPoolExecutor.java:908)
	at java.lang.Thread.run(Thread.java:662)

    testDecodeModifyDNRequestSuccessChangeTypesAddModDN :
  java.lang.AssertionError
  java.lang.AssertionError: expected:<false> but was:<true>
	at org.junit.Assert.fail(Assert.java:91)
	at org.junit.Assert.failNotEquals(Assert.java:645)
	at org.junit.Assert.assertEquals(Assert.java:126)
	at org.junit.Assert.assertEquals(Assert.java:145)
	at org.apache.directory.shared.ldap.codec.search.controls.PSearchControlTest.testDecodeModifyDNRequestSuccessChangeTypesAddModDN(PSearchControlTest.java:119)
	at sun.reflect.NativeMethodAccessorImpl.invoke0(Native Method)
	at sun.reflect.NativeMethodAccessorImpl.invoke(NativeMethodAccessorImpl.java:39)
	at sun.reflect.DelegatingMethodAccessorImpl.invoke(DelegatingMethodAccessorImpl.java:25)
	at java.lang.reflect.Method.invoke(Method.java:597)
	at org.junit.runners.model.FrameworkMethod$1.runReflectiveCall(FrameworkMethod.java:44)
	at org.junit.internal.runners.model.ReflectiveCallable.run(ReflectiveCallable.java:15)
	at org.junit.runners.model.FrameworkMethod.invokeExplosively(FrameworkMethod.java:41)
	at org.junit.internal.runners.statements.InvokeMethod.evaluate(InvokeMethod.java:20)
	at org.junit.runners.BlockJUnit4ClassRunner.runNotIgnored(BlockJUnit4ClassRunner.java:79)
	at org.junit.runners.BlockJUnit4ClassRunner.runChild(BlockJUnit4ClassRunner.java:71)
	at org.junit.runners.BlockJUnit4ClassRunner.runChild(BlockJUnit4ClassRunner.java:49)
	at org.junit.runners.ParentRunner$3.run(ParentRunner.java:193)
	at java.util.concurrent.Executors$RunnableAdapter.call(Executors.java:441)
	at java.util.concurrent.FutureTask$Sync.innerRun(FutureTask.java:303)
	at java.util.concurrent.FutureTask.run(FutureTask.java:138)
	at java.util.concurrent.Executors$RunnableAdapter.call(Executors.java:441)
	at java.util.concurrent.FutureTask$Sync.innerRun(FutureTask.java:303)
	at java.util.concurrent.FutureTask.run(FutureTask.java:138)
	at java.util.concurrent.ThreadPoolExecutor$Worker.runTask(ThreadPoolExecutor.java:886)
	at java.util.concurrent.ThreadPoolExecutor$Worker.run(ThreadPoolExecutor.java:908)
	at java.lang.Thread.run(Thread.java:662)

  



Mime
View raw message