directory-commits mailing list archives

Site index · List index
Message view « Date » · « Thread »
Top « Date » · « Thread »
From "Continuum@vmbuild" <contin...@apache.org>
Subject [continuum] BUILD FAILURE: Directory - ApacheDS 1.5 Build With Dependencies - Default Maven 2 Build Definition
Date Tue, 25 Jan 2011 05:04:29 GMT
Online report : http://vmbuild.apache.org/continuum/buildResult.action?buildId=2756&projectId=10

Build statistics:
  State: Failed
  Previous State: Ok
  Started at: Tue 25 Jan 2011 05:02:22 +0000
  Finished at: Tue 25 Jan 2011 05:04:00 +0000
  Total time: 1m 37s
  Build Trigger: Schedule
  Build Number: 411
  Exit code: 1
  Building machine hostname: vmbuild
  Operating system : Linux(unknown)
  Java Home version : 
          java version "1.6.0_22"
          Java(TM) SE Runtime Environment (build 1.6.0_22-b04)
          Java HotSpot(TM) 64-Bit Server VM (build 17.1-b03, mixed mode)
        
  Builder version :
          Apache Maven 2.2.1 (r801777; 2009-08-06 19:16:01+0000)
          Java version: 1.6.0_22
          Java home: /usr/lib/jvm/java-6-sun-1.6.0.22/jre
          Default locale: en_US, platform encoding: ANSI_X3.4-1968
          OS name: "linux" version: "2.6.32-27-server" arch: "amd64" Family: "unix"
    
****************************************************************************
SCM Changes:
****************************************************************************
Changed: no author @ no date
Comment: no comment
Files changed:
  apacheds/server-integ/src/test/java/org/apache/directory/server/operations/bind/SaslBindIT.java
( no revision )
  shared/ldap/src/test/java/org/apache/directory/shared/ldap/model/message/ExtendedResponseImplTest.java
( no revision )
  shared/ldap/src/test/java/org/apache/directory/shared/ldap/model/message/LdapResultImplTest.java
( no revision )
  shared/ldap/src/test/java/org/apache/directory/shared/ldap/model/message/SearchResponseDoneImplTest.java
( no revision )
  shared/ldap/src/test/java/org/apache/directory/shared/ldap/model/message/BindResponseImplTest.java
( no revision )
  shared/ldap/src/test/java/org/apache/directory/shared/ldap/message/LdapResultImplTest.java
( no revision )
  shared/ldap/src/test/java/org/apache/directory/shared/ldap/codec/unbind/UnBindRequestTest.java
( no revision )
  shared/ldap/src/test/java/org/apache/directory/shared/ldap/codec/compare/CompareRequestTest.java
( no revision )
  shared/ldap/src/test/java/org/apache/directory/shared/ldap/codec/compare/CompareResponseTest.java
( no revision )
  shared/ldap/src/test/java/org/apache/directory/shared/ldap/codec/modify/ModifyRequestTest.java
( no revision )
  shared/ldap/src/test/java/org/apache/directory/shared/ldap/codec/modify/ModifyResponseTest.java
( no revision )
  shared/ldap/src/test/java/org/apache/directory/shared/ldap/codec/add/AddRequestTest.java
( no revision )
  shared/ldap/src/test/java/org/apache/directory/shared/ldap/codec/add/AddResponseTest.java
( no revision )
  shared/ldap/src/test/java/org/apache/directory/shared/ldap/codec/LdapResultTest.java ( no
revision )
  shared/ldap/src/test/java/org/apache/directory/shared/ldap/codec/extended/ExtendedResponseTest.java
( no revision )
  shared/ldap/src/test/java/org/apache/directory/shared/ldap/codec/extended/ExtendedRequestTest.java
( no revision )
  shared/ldap/src/test/java/org/apache/directory/shared/ldap/codec/LdapControlTest.java (
no revision )
  shared/ldap/src/test/java/org/apache/directory/shared/ldap/codec/abandon/AbandonRequestTest.java
( no revision )
  shared/ldap/src/test/java/org/apache/directory/shared/ldap/codec/del/DelResponseTest.java
( no revision )
  shared/ldap/src/test/java/org/apache/directory/shared/ldap/codec/del/DelRequestTest.java
( no revision )
  shared/ldap/src/test/java/org/apache/directory/shared/ldap/codec/LdapMessageTest.java (
no revision )
  shared/ldap/src/test/java/org/apache/directory/shared/ldap/codec/search/SearchRequestSubstringTest.java
( no revision )
  shared/ldap/src/test/java/org/apache/directory/shared/ldap/codec/search/SearchResultReferenceTest.java
( no revision )
  shared/ldap/src/test/java/org/apache/directory/shared/ldap/codec/search/SearchResultEntryTest.java
( no revision )
  shared/ldap/src/test/java/org/apache/directory/shared/ldap/codec/search/SearchRequestMatchingRuleAssertionTest.java
( no revision )
  shared/ldap/src/test/java/org/apache/directory/shared/ldap/codec/search/SearchResultDoneTest.java
( no revision )
  shared/ldap/src/test/java/org/apache/directory/shared/ldap/codec/search/SearchRequestTest.java
( no revision )
  shared/ldap/src/test/java/org/apache/directory/shared/ldap/codec/modifyDn/ModifyDNRequestTest.java
( no revision )
  shared/ldap/src/test/java/org/apache/directory/shared/ldap/codec/modifyDn/ModifyDNResponseTest.java
( no revision )
  shared/ldap/src/test/java/org/apache/directory/shared/ldap/codec/intermediate/IntermediateResponseTest.java
( no revision )
  shared/ldap/src/test/java/org/apache/directory/shared/ldap/codec/bind/BindRequestPerfTest.java
( no revision )
  shared/ldap/src/test/java/org/apache/directory/shared/ldap/codec/bind/BindRequestTest.java
( no revision )
  shared/ldap/src/test/java/org/apache/directory/shared/ldap/codec/bind/BindResponseTest.java
( no revision )
  shared/ldap/src/main/java/org/apache/directory/shared/ldap/model/message/LdapResultImpl.java
( no revision )
  shared/ldap/src/main/java/org/apache/directory/shared/ldap/model/message/AbstractResultResponse.java
( no revision )
  shared/ldap/src/main/java/org/apache/directory/shared/ldap/message/LdapEncoder.java ( no
revision )
  shared/ldap/src/main/java/org/apache/directory/shared/ldap/message/LdapResultImpl.java (
no revision )
  shared/ldap/src/main/java/org/apache/directory/shared/ldap/message/decorators ( no revision
)
  shared/ldap/src/main/java/org/apache/directory/shared/ldap/message/SearchRequestImpl.java
( no revision )
  shared/ldap/src/main/java/org/apache/directory/shared/ldap/codec/LdapEncoder.java ( no revision
)
  shared/ldap/src/main/java/org/apache/directory/shared/ldap/codec/decorators/CompareRequestDecorator.java
( no revision )
  shared/ldap/src/main/java/org/apache/directory/shared/ldap/codec/decorators/ModifyRequestDecorator.java
( no revision )
  shared/ldap/src/main/java/org/apache/directory/shared/ldap/codec/decorators/AddRequestDecorator.java
( no revision )
  shared/ldap/src/main/java/org/apache/directory/shared/ldap/codec/decorators/CompareResponseDecorator.java
( no revision )
  shared/ldap/src/main/java/org/apache/directory/shared/ldap/codec/decorators/ModifyResponseDecorator.java
( no revision )
  shared/ldap/src/main/java/org/apache/directory/shared/ldap/codec/decorators/AddResponseDecorator.java
( no revision )
  shared/ldap/src/main/java/org/apache/directory/shared/ldap/codec/decorators/ExtendedRequestDecorator.java
( no revision )
  shared/ldap/src/main/java/org/apache/directory/shared/ldap/codec/decorators/SearchResultDoneDecorator.java
( no revision )
  shared/ldap/src/main/java/org/apache/directory/shared/ldap/codec/decorators/SearchRequestDecorator.java
( no revision )
  shared/ldap/src/main/java/org/apache/directory/shared/ldap/codec/decorators/ExtendedResponseDecorator.java
( no revision )
  shared/ldap/src/main/java/org/apache/directory/shared/ldap/codec/decorators/LdapResultDecorator.java
( no revision )
  shared/ldap/src/main/java/org/apache/directory/shared/ldap/codec/decorators/DeleteResponseDecorator.java
( no revision )
  shared/ldap/src/main/java/org/apache/directory/shared/ldap/codec/decorators/ModifyDnRequestDecorator.java
( no revision )
  shared/ldap/src/main/java/org/apache/directory/shared/ldap/codec/decorators/SearchResultReferenceDecorator.java
( no revision )
  shared/ldap/src/main/java/org/apache/directory/shared/ldap/codec/decorators/MessageDecorator.java
( no revision )
  shared/ldap/src/main/java/org/apache/directory/shared/ldap/codec/decorators/BindRequestDecorator.java
( no revision )
  shared/ldap/src/main/java/org/apache/directory/shared/ldap/codec/decorators/SearchResultEntryDecorator.java
( no revision )
  shared/ldap/src/main/java/org/apache/directory/shared/ldap/codec/decorators/ModifyDnResponseDecorator.java
( no revision )
  shared/ldap/src/main/java/org/apache/directory/shared/ldap/codec/decorators/IntermediateResponseDecorator.java
( no revision )
  shared/ldap/src/main/java/org/apache/directory/shared/ldap/codec/decorators/BindResponseDecorator.java
( no revision )
  shared/ldap-client-api/src/main/java/org/apache/directory/ldap/client/api/protocol/LdapProtocolEncoder.java
( no revision )

****************************************************************************
Dependencies Changes:
****************************************************************************
No dependencies changed


****************************************************************************
Build Definition:
****************************************************************************
POM filename: pom.xml
Goals: clean install -Dintegration   
Arguments: --batch-mode
Build Fresh: false
Always Build: false
Default Build Definition: true
Schedule: DEFAULT_SCHEDULE
Profile Name: Maven 2.2.1
Description: Default Maven 2 Build Definition

****************************************************************************
Test Summary:
****************************************************************************
Tests: 5662
Failures: 2
Errors: 0
Success Rate: 99
Total time: 769.1989

****************************************************************************
Test Failures:
****************************************************************************

DelResponseTest
    testDecodeDelResponseSuccess :
  java.lang.AssertionError
  java.lang.AssertionError: expected:<45> but was:<14>	at org.junit.Assert.fail(Assert.java:91)
	at org.junit.Assert.failNotEquals(Assert.java:645)
	at org.junit.Assert.assertEquals(Assert.java:126)
	at org.junit.Assert.assertEquals(Assert.java:470)
	at org.junit.Assert.assertEquals(Assert.java:454)
	at org.apache.directory.shared.ldap.codec.del.DelResponseTest.testDecodeDelResponseSuccess(DelResponseTest.java:123)
	at sun.reflect.NativeMethodAccessorImpl.invoke0(Native Method)
	at sun.reflect.NativeMethodAccessorImpl.invoke(NativeMethodAccessorImpl.java:39)
	at sun.reflect.DelegatingMethodAccessorImpl.invoke(DelegatingMethodAccessorImpl.java:25)
	at java.lang.reflect.Method.invoke(Method.java:597)
	at org.junit.runners.model.FrameworkMethod$1.runReflectiveCall(FrameworkMethod.java:44)
	at org.junit.internal.runners.model.ReflectiveCallable.run(ReflectiveCallable.java:15)
	at org.junit.runners.model.FrameworkMethod.invokeExplosively(FrameworkMethod.java:41)
	at org.junit.internal.runners.statements.InvokeMethod.evaluate(InvokeMethod.java:20)
	at org.junit.runners.BlockJUnit4ClassRunner.runNotIgnored(BlockJUnit4ClassRunner.java:79)
	at org.junit.runners.BlockJUnit4ClassRunner.runChild(BlockJUnit4ClassRunner.java:71)
	at org.junit.runners.BlockJUnit4ClassRunner.runChild(BlockJUnit4ClassRunner.java:49)
	at org.junit.runners.ParentRunner$3.run(ParentRunner.java:193)
	at java.util.concurrent.Executors$RunnableAdapter.call(Executors.java:441)
	at java.util.concurrent.FutureTask$Sync.innerRun(FutureTask.java:303)
	at java.util.concurrent.FutureTask.run(FutureTask.java:138)
	at java.util.concurrent.Executors$RunnableAdapter.call(Executors.java:441)
	at java.util.concurrent.FutureTask$Sync.innerRun(FutureTask.java:303)
	at java.util.concurrent.FutureTask.run(FutureTask.java:138)
	at java.util.concurrent.ThreadPoolExecutor$Worker.runTask(ThreadPoolExecutor.java:886)
	at java.util.concurrent.ThreadPoolExecutor$Worker.run(ThreadPoolExecutor.java:908)
	at java.lang.Thread.run(Thread.java:662)

    testDecodeDelResponseSuccessWithControls :
  java.lang.AssertionError
  java.lang.AssertionError: expected:<74> but was:<43>
	at org.junit.Assert.fail(Assert.java:91)
	at org.junit.Assert.failNotEquals(Assert.java:645)
	at org.junit.Assert.assertEquals(Assert.java:126)
	at org.junit.Assert.assertEquals(Assert.java:470)
	at org.junit.Assert.assertEquals(Assert.java:454)
	at org.apache.directory.shared.ldap.codec.del.DelResponseTest.testDecodeDelResponseSuccessWithControls(DelResponseTest.java:256)
	at sun.reflect.NativeMethodAccessorImpl.invoke0(Native Method)
	at sun.reflect.NativeMethodAccessorImpl.invoke(NativeMethodAccessorImpl.java:39)
	at sun.reflect.DelegatingMethodAccessorImpl.invoke(DelegatingMethodAccessorImpl.java:25)
	at java.lang.reflect.Method.invoke(Method.java:597)
	at org.junit.runners.model.FrameworkMethod$1.runReflectiveCall(FrameworkMethod.java:44)
	at org.junit.internal.runners.model.ReflectiveCallable.run(ReflectiveCallable.java:15)
	at org.junit.runners.model.FrameworkMethod.invokeExplosively(FrameworkMethod.java:41)
	at org.junit.internal.runners.statements.InvokeMethod.evaluate(InvokeMethod.java:20)
	at org.junit.runners.BlockJUnit4ClassRunner.runNotIgnored(BlockJUnit4ClassRunner.java:79)
	at org.junit.runners.BlockJUnit4ClassRunner.runChild(BlockJUnit4ClassRunner.java:71)
	at org.junit.runners.BlockJUnit4ClassRunner.runChild(BlockJUnit4ClassRunner.java:49)
	at org.junit.runners.ParentRunner$3.run(ParentRunner.java:193)
	at java.util.concurrent.Executors$RunnableAdapter.call(Executors.java:441)
	at java.util.concurrent.FutureTask$Sync.innerRun(FutureTask.java:303)
	at java.util.concurrent.FutureTask.run(FutureTask.java:138)
	at java.util.concurrent.Executors$RunnableAdapter.call(Executors.java:441)
	at java.util.concurrent.FutureTask$Sync.innerRun(FutureTask.java:303)
	at java.util.concurrent.FutureTask.run(FutureTask.java:138)
	at java.util.concurrent.ThreadPoolExecutor$Worker.runTask(ThreadPoolExecutor.java:886)
	at java.util.concurrent.ThreadPoolExecutor$Worker.run(ThreadPoolExecutor.java:908)
	at java.lang.Thread.run(Thread.java:662)

  



Mime
View raw message