directory-commits mailing list archives

Site index · List index
Message view « Date » · « Thread »
Top « Date » · « Thread »
From "Continuum@vmbuild" <contin...@apache.org>
Subject [continuum] BUILD FAILURE: Directory - ApacheDS 1.5 Build With Dependencies - Default Maven 2 Build Definition
Date Sat, 13 Nov 2010 09:00:01 GMT
Online report : http://vmbuild.apache.org/continuum/buildResult.action?buildId=1571&projectId=10

Build statistics:
  State: Failed
  Previous State: Building
  Started at: Sat 13 Nov 2010 07:17:04 +0000
  Finished at: Sat 13 Nov 2010 08:57:48 +0000
  Total time: 1h 40m 43s
  Build Trigger: Schedule
  Build Number: 193
  Exit code: 1
  Building machine hostname: vmbuild
  Operating system : Linux(unknown)
  Java Home version : 
          java version "1.6.0_20"
          Java(TM) SE Runtime Environment (build 1.6.0_20-b02)
          Java HotSpot(TM) 64-Bit Server VM (build 16.3-b01, mixed mode)
        
  Builder version :
          Apache Maven 2.2.1 (r801777; 2009-08-06 19:16:01+0000)
          Java version: 1.6.0_20
          Java home: /usr/lib/jvm/java-6-sun-1.6.0.20/jre
          Default locale: en_US, platform encoding: ANSI_X3.4-1968
          OS name: "linux" version: "2.6.32-24-server" arch: "amd64" Family: "unix"
    
****************************************************************************
SCM Changes:
****************************************************************************
Changed: no author @ no date
Comment: no comment
Files changed:
  apacheds/kerberos-codec/src/main/java/org/apache/directory/shared/kerberos/components/EncryptionKey.java ( no revision )

Changed: no author @ no date
Comment: no comment
Files changed:
  apacheds/kerberos-codec/src/main/java/org/apache/directory/shared/kerberos/codec/kdcReqBody/KdcReqBodyStatesEnum.java ( no revision )
  apacheds/kerberos-codec/src/main/java/org/apache/directory/shared/kerberos/codec/kdcReqBody/actions/StoreAddresses.java ( no revision )
  apacheds/kerberos-codec/src/main/java/org/apache/directory/shared/kerberos/codec/kdcReqBody/actions/StoreEncAuthorizationData.java ( no revision )
  apacheds/kerberos-codec/src/main/java/org/apache/directory/shared/kerberos/codec/kdcReqBody/KdcReqBodyGrammar.java ( no revision )
  apacheds/kerberos-codec/src/main/java/org/apache/directory/shared/kerberos/codec/hostAddresses/actions/AddHostAddress.java ( no revision )

Changed: no author @ no date
Comment: no comment
Files changed:
  apacheds/kerberos-codec/src/test/java/org/apache/directory/shared/kerberos/codec/PaDataDecoderTest.java ( no revision )
  apacheds/kerberos-codec/src/main/java/org/apache/directory/shared/kerberos/components/PaData.java ( no revision )
  apacheds/kerberos-codec/src/main/java/org/apache/directory/shared/kerberos/KerberosConstants.java ( no revision )
  apacheds/kerberos-codec/src/main/java/org/apache/directory/shared/kerberos/codec/types/PaDataType.java ( no revision )
  apacheds/kerberos-codec/src/main/java/org/apache/directory/shared/kerberos/codec/padata/actions/PaDataDataType.java ( no revision )
  apacheds/kerberos-codec/src/main/java/org/apache/directory/shared/kerberos/codec/padata/actions/PaDataValue.java ( no revision )
  apacheds/kerberos-codec/src/main/java/org/apache/directory/shared/kerberos/codec/padata/actions/PaDataInit.java ( no revision )
  apacheds/kerberos-codec/src/main/java/org/apache/directory/shared/kerberos/codec/padata/PaDataGrammar.java ( no revision )
  apacheds/kerberos-codec/src/main/java/org/apache/directory/shared/kerberos/codec/padata/PaDataStatesEnum.java ( no revision )
  apacheds/kerberos-codec/src/main/java/org/apache/directory/shared/kerberos/codec/padata/PaDataContainer.java ( no revision )

Changed: no author @ no date
Comment: no comment
Files changed:
  apacheds/kerberos-codec/src/test/java/org/apache/directory/shared/kerberos/codec/AuthorizationDataDecoderTest.java ( no revision )
  apacheds/kerberos-codec/src/test/java/org/apache/directory/shared/kerberos/codec/ChecksumDecoderTest.java ( no revision )
  apacheds/kerberos-codec/src/main/java/org/apache/directory/shared/kerberos/crypto/checksum/ChecksumType.java ( no revision )
  apacheds/kerberos-codec/src/main/java/org/apache/directory/shared/kerberos/components/Checksum.java ( no revision )
  apacheds/kerberos-codec/src/main/java/org/apache/directory/shared/kerberos/components/PaData.java ( no revision )
  apacheds/kerberos-codec/src/main/java/org/apache/directory/shared/kerberos/KerberosConstants.java ( no revision )
  apacheds/kerberos-codec/src/main/java/org/apache/directory/shared/kerberos/codec/checksum/actions/ChecksumValue.java ( no revision )
  apacheds/kerberos-codec/src/main/java/org/apache/directory/shared/kerberos/codec/checksum/actions/ChecksumInit.java ( no revision )
  apacheds/kerberos-codec/src/main/java/org/apache/directory/shared/kerberos/codec/checksum/actions/ChecksumCksumType.java ( no revision )
  apacheds/kerberos-codec/src/main/java/org/apache/directory/shared/kerberos/codec/checksum/ChecksumContainer.java ( no revision )
  apacheds/kerberos-codec/src/main/java/org/apache/directory/shared/kerberos/codec/checksum/ChecksumGrammar.java ( no revision )
  apacheds/kerberos-codec/src/main/java/org/apache/directory/shared/kerberos/codec/checksum/ChecksumStatesEnum.java ( no revision )
  apacheds/kerberos-codec/src/main/java/org/apache/directory/shared/kerberos/codec/types/PaDataType.java ( no revision )

Changed: no author @ no date
Comment: no comment
Files changed:
  apacheds/kerberos-codec/src/test/java/org/apache/directory/shared/kerberos/codec/HostAddressesDecoderTest.java ( no revision )
  apacheds/kerberos-codec/src/test/java/org/apache/directory/shared/kerberos/codec/HostAddressDecoderTest.java ( no revision )
  apacheds/kerberos-codec/src/main/java/org/apache/directory/shared/kerberos/components/HostAddresses.java ( no revision )
  apacheds/kerberos-codec/src/main/java/org/apache/directory/shared/kerberos/codec/kdcReqBody/actions/ETypeSequence.java ( no revision )
  apacheds/kerberos-codec/src/main/java/org/apache/directory/shared/kerberos/codec/hostAddresses/actions/AddHostAddress.java ( no revision )
  apacheds/kerberos-codec/src/main/java/org/apache/directory/shared/kerberos/codec/hostAddresses/HostAddressesGrammar.java ( no revision )
  apacheds/kerberos-codec/src/main/java/org/apache/directory/shared/kerberos/codec/hostAddresses/HostAddressesStatesEnum.java ( no revision )
  apacheds/kerberos-codec/src/main/java/org/apache/directory/shared/kerberos/codec/hostAddresses/HostAddressesContainer.java ( no revision )

Changed: no author @ no date
Comment: no comment
Files changed:
  apacheds/kerberos-codec/src/main/java/org/apache/directory/shared/kerberos/codec/kdcReqBody/KdcReqBodyStatesEnum.java ( no revision )
  apacheds/kerberos-codec/src/main/java/org/apache/directory/shared/kerberos/codec/kdcReqBody/actions/AddEType.java ( no revision )
  apacheds/kerberos-codec/src/main/java/org/apache/directory/shared/kerberos/codec/kdcReqBody/actions/ETypeSequence.java ( no revision )
  apacheds/kerberos-codec/src/main/java/org/apache/directory/shared/kerberos/codec/kdcReqBody/KdcReqBodyGrammar.java ( no revision )

Changed: no author @ no date
Comment: no comment
Files changed:
  apacheds/kerberos-codec/src/main/java/org/apache/directory/shared/kerberos/codec/kdcReqBody/KdcReqBodyStatesEnum.java ( no revision )
  apacheds/kerberos-codec/src/main/java/org/apache/directory/shared/kerberos/codec/kdcReqBody/actions/StoreNonce.java ( no revision )
  apacheds/kerberos-codec/src/main/java/org/apache/directory/shared/kerberos/codec/kdcReqBody/KdcReqBodyGrammar.java ( no revision )
  apacheds/kerberos-codec/src/main/java/org/apache/directory/shared/kerberos/codec/options/KdcOptions.java ( no revision )

Changed: no author @ no date
Comment: no comment
Files changed:
  apacheds/kerberos-codec/src/main/java/org/apache/directory/shared/kerberos/codec/kdcReqBody/KdcReqBodyStatesEnum.java ( no revision )
  apacheds/kerberos-codec/src/main/java/org/apache/directory/shared/kerberos/codec/kdcReqBody/KdcReqBodyGrammar.java ( no revision )

Changed: no author @ no date
Comment: no comment
Files changed:
  apacheds/kerberos-codec/src/main/java/org/apache/directory/shared/kerberos/crypto/checksum/ChecksumType.java ( no revision )
  apacheds/kerberos-codec/src/main/java/org/apache/directory/shared/kerberos/components/Checksum.java ( no revision )

Changed: no author @ no date
Comment: no comment
Files changed:
  apacheds/server-config/src/test/java/org/apache/directory/server/config/HttpServerConfigReaderTest.java ( no revision )
  apacheds/server-config/src/test/java/org/apache/directory/server/config/LdapServerConfigReaderTest.java ( no revision )
  apacheds/server-config/src/test/java/org/apache/directory/server/config/ChangePasswordConfigReaderTest.java ( no revision )
  apacheds/server-config/src/test/java/org/apache/directory/server/config/NtpServerConfigReaderTest.java ( no revision )
  apacheds/server-config/src/test/java/org/apache/directory/server/config/ConfigPartitionReaderTest.java ( no revision )
  apacheds/server-config/src/test/java/org/apache/directory/server/config/DnsServerConfigReaderTest.java ( no revision )
  apacheds/server-config/src/test/java/org/apache/directory/server/config/KerberosServerConfigReaderTest.java ( no revision )
  apacheds/server-config/src/test/java/org/apache/directory/server/config/DhcpServerConfigReaderTest.java ( no revision )
  apacheds/server-annotations/src/test/java/org/apache/directory/server/factory/CreateKdcServerAnnotationTest.java ( no revision )

Changed: no author @ no date
Comment: no comment
Files changed:
  shared/ldap/src/test/java/org/apache/directory/shared/ldap/codec/LdapDecoderTest.java ( no revision )
  shared/ldap/src/test/java/org/apache/directory/shared/ldap/codec/LdapMessageTest.java ( no revision )
  shared/ldap/src/test/java/org/apache/directory/shared/ldap/codec/bind/BindRequestTest.java ( no revision )

Changed: no author @ no date
Comment: no comment
Files changed:
  apacheds/kerberos-codec/src/main/java/org/apache/directory/shared/kerberos/components/KdcReqBody.java ( no revision )
  apacheds/kerberos-codec/src/main/java/org/apache/directory/shared/kerberos/KerberosTime.java ( no revision )
  apacheds/kerberos-codec/src/main/java/org/apache/directory/shared/kerberos/codec/kdcReqBody/KdcReqBodyStatesEnum.java ( no revision )
  apacheds/kerberos-codec/src/main/java/org/apache/directory/shared/kerberos/codec/kdcReqBody/actions/StoreCName.java ( no revision )
  apacheds/kerberos-codec/src/main/java/org/apache/directory/shared/kerberos/codec/kdcReqBody/actions/StoreFrom.java ( no revision )
  apacheds/kerberos-codec/src/main/java/org/apache/directory/shared/kerberos/codec/kdcReqBody/actions/StoreSName.java ( no revision )
  apacheds/kerberos-codec/src/main/java/org/apache/directory/shared/kerberos/codec/kdcReqBody/actions/StoreTill.java ( no revision )
  apacheds/kerberos-codec/src/main/java/org/apache/directory/shared/kerberos/codec/kdcReqBody/actions/StoreKdcOptions.java ( no revision )
  apacheds/kerberos-codec/src/main/java/org/apache/directory/shared/kerberos/codec/kdcReqBody/actions/StoreRTime.java ( no revision )
  apacheds/kerberos-codec/src/main/java/org/apache/directory/shared/kerberos/codec/kdcReqBody/KdcReqBodyGrammar.java ( no revision )
  apacheds/kerberos-shared/src/main/java/org/apache/directory/server/kerberos/shared/io/encoder/EncTicketPartEncoder.java ( no revision )
  apacheds/kerberos-shared/src/main/java/org/apache/directory/server/kerberos/shared/io/encoder/EncryptionKeyEncoder.java ( no revision )
  apacheds/kerberos-shared/src/main/java/org/apache/directory/server/kerberos/shared/io/encoder/TransitedEncodingEncoder.java ( no revision )
  apacheds/kerberos-shared/src/main/java/org/apache/directory/server/kerberos/shared/io/encoder/AuthenticatorEncoder.java ( no revision )
  apacheds/kerberos-shared/src/main/java/org/apache/directory/server/kerberos/shared/io/encoder/HostAddressesEncoder.java ( no revision )
  apacheds/kerberos-shared/src/main/java/org/apache/directory/server/kerberos/shared/io/encoder/PrivateMessageEncoder.java ( no revision )
  apacheds/kerberos-shared/src/main/java/org/apache/directory/server/kerberos/shared/io/encoder/PreAuthenticationDataEncoder.java ( no revision )
  apacheds/kerberos-shared/src/main/java/org/apache/directory/server/kerberos/shared/io/encoder/PrincipalNameEncoder.java ( no revision )
  apacheds/kerberos-shared/src/main/java/org/apache/directory/server/kerberos/shared/io/encoder/TicketEncoder.java ( no revision )
  apacheds/kerberos-shared/src/main/java/org/apache/directory/server/kerberos/shared/io/encoder/EncryptedDataEncoder.java ( no revision )
  apacheds/kerberos-shared/src/main/java/org/apache/directory/server/kerberos/shared/io/encoder/AuthorizationDataEncoder.java ( no revision )
  apacheds/kerberos-shared/src/main/java/org/apache/directory/server/kerberos/shared/io/encoder/ErrorMessageEncoder.java ( no revision )
  shared/ldap/src/main/java/org/apache/directory/shared/asn1/ber/grammar/AbstractGrammar.java ( no revision )

Changed: no author @ no date
Comment: no comment
Files changed:
  shared/ldap/src/test/java/org/apache/directory/shared/ldap/codec/controls/ppolicy/PasswordPolicyResponseControlTest.java ( no revision )
  shared/ldap/src/main/java/org/apache/directory/shared/ldap/codec/controls/ppolicy/PasswordPolicyResponseControlTags.java ( no revision )
  shared/ldap/src/main/java/org/apache/directory/shared/ldap/codec/controls/ppolicy/PasswordPolicyResponseControl.java ( no revision )
  shared/ldap/src/main/java/org/apache/directory/shared/ldap/codec/controls/ppolicy/PasswordPolicyResponseControlStates.java ( no revision )
  shared/ldap/src/main/java/org/apache/directory/shared/ldap/codec/controls/ppolicy/PasswordPolicyResponseControlGrammar.java ( no revision )

Changed: no author @ no date
Comment: no comment
Files changed:
  apacheds/kerberos-codec/src/main/java/org/apache/directory/shared/kerberos/components/PrincipalName.java ( no revision )
  apacheds/kerberos-codec/src/main/java/org/apache/directory/shared/kerberos/components/HostAddress.java ( no revision )
  apacheds/kerberos-codec/src/main/java/org/apache/directory/shared/kerberos/components/EncryptedData.java ( no revision )
  apacheds/kerberos-codec/src/main/java/org/apache/directory/shared/kerberos/KerberosUtils.java ( no revision )
  apacheds/kerberos-codec/src/main/java/org/apache/directory/shared/kerberos/codec/principalName/actions/PrincipalNameNameType.java ( no revision )
  apacheds/kerberos-codec/src/main/java/org/apache/directory/shared/kerberos/codec/types/PrincipalNameType.java ( no revision )
  apacheds/kerberos-codec/src/main/java/org/apache/directory/shared/kerberos/codec/types/HostAddrType.java ( no revision )
  apacheds/kerberos-codec/src/main/java/org/apache/directory/shared/kerberos/codec/types/EncryptionType.java ( no revision )
  apacheds/kerberos-codec/src/main/java/org/apache/directory/shared/kerberos/codec/kdcReqBody/KdcReqBodyStatesEnum.java ( no revision )
  apacheds/kerberos-codec/src/main/java/org/apache/directory/shared/kerberos/codec/kdcReqBody/actions/StoreCName.java ( no revision )
  apacheds/kerberos-codec/src/main/java/org/apache/directory/shared/kerberos/codec/kdcReqBody/actions/StoreKdcOptions.java ( no revision )
  apacheds/kerberos-codec/src/main/java/org/apache/directory/shared/kerberos/codec/kdcReqBody/actions/KdcReqBodyInit.java ( no revision )
  apacheds/kerberos-codec/src/main/java/org/apache/directory/shared/kerberos/codec/kdcReqBody/actions/StoreRealm.java ( no revision )
  apacheds/kerberos-codec/src/main/java/org/apache/directory/shared/kerberos/codec/kdcReqBody/KdcReqBodyContainer.java ( no revision )
  apacheds/kerberos-codec/src/main/java/org/apache/directory/shared/kerberos/codec/kdcReqBody/KdcReqBodyGrammar.java ( no revision )

Changed: no author @ no date
Comment: no comment
Files changed:
  apacheds/kerberos-codec/src/main/java/org/apache/directory/shared/kerberos/codec/options/KdcOptions.java ( no revision )

Changed: no author @ no date
Comment: no comment
Files changed:
  apacheds/protocol-changepw/src/test/java/org/apache/directory/server/changepw/protocol/ChangepwProtocolHandlerTest.java ( no revision )

Changed: no author @ no date
Comment: no comment
Files changed:
  apacheds/kerberos-codec/src/test/java/org/apache/directory/shared/kerberos/codec/AuthorizationDataDecoderTest.java ( no revision )

Changed: no author @ no date
Comment: no comment
Files changed:
  apacheds/kerberos-codec/src/test/java/org/apache/directory/shared/kerberos/codec/AuthorizationDataDecoderTest.java ( no revision )
  apacheds/kerberos-codec/src/main/java/org/apache/directory/shared/kerberos/components/AuthorizationData.java ( no revision )
  apacheds/kerberos-codec/src/main/java/org/apache/directory/shared/kerberos/codec/authorizationData/actions/AuthorizationDataAdType.java ( no revision )
  apacheds/kerberos-codec/src/main/java/org/apache/directory/shared/kerberos/codec/authorizationData/actions/AuthorizationDataAdData.java ( no revision )
  apacheds/kerberos-codec/src/main/java/org/apache/directory/shared/kerberos/codec/authorizationData/actions/AuthorizationDataInit.java ( no revision )
  apacheds/kerberos-codec/src/main/java/org/apache/directory/shared/kerberos/codec/authorizationData/AuthorizationDataGrammar.java ( no revision )
  apacheds/kerberos-codec/src/main/java/org/apache/directory/shared/kerberos/codec/authorizationData/AuthorizationDataStatesEnum.java ( no revision )

Changed: no author @ no date
Comment: no comment
Files changed:
  apacheds/kerberos-codec/src/test/java/org/apache/directory/shared/kerberos/codec/KdcReqBodyDecoderTest.java ( no revision )
  apacheds/kerberos-codec/src/main/java/org/apache/directory/shared/kerberos/components/KdcReqBody.java ( no revision )
  apacheds/kerberos-codec/src/main/java/org/apache/directory/shared/kerberos/KerberosTime.java ( no revision )

Changed: no author @ no date
Comment: no comment
Files changed:
  apacheds/kerberos-codec/src/test/java/org/apache/directory/shared/kerberos/codec/options/OptionsTest.java ( no revision )
  apacheds/kerberos-codec/src/main/java/org/apache/directory/shared/kerberos/codec/options/Options.java ( no revision )
  shared/ldap/src/main/java/org/apache/directory/shared/asn1/ber/tlv/Value.java ( no revision )
  shared/ldap/src/main/java/org/apache/directory/shared/asn1/primitives/BitString.java ( no revision )

Changed: no author @ no date
Comment: no comment
Files changed:
  shared/ldap/src/test/java/org/apache/directory/shared/asn1/primitives/BitStringTest.java ( no revision )
  shared/ldap/src/main/java/org/apache/directory/shared/asn1/primitives/BitString.java ( no revision )

Changed: no author @ no date
Comment: no comment
Files changed:
  apacheds/kerberos-codec/src/test/java/org/apache/directory/shared/kerberos/codec/AuthorizationDataDecoderTest.java ( no revision )
  apacheds/kerberos-codec/src/main/java/org/apache/directory/shared/kerberos/components/AuthorizationData.java ( no revision )
  apacheds/kerberos-codec/src/main/java/org/apache/directory/shared/kerberos/KerberosConstants.java ( no revision )
  apacheds/kerberos-codec/src/main/java/org/apache/directory/shared/kerberos/codec/authorizationData/actions/AuthorizationDataAdType.java ( no revision )
  apacheds/kerberos-codec/src/main/java/org/apache/directory/shared/kerberos/codec/authorizationData/actions/AuthorizationDataAdData.java ( no revision )
  apacheds/kerberos-codec/src/main/java/org/apache/directory/shared/kerberos/codec/authorizationData/actions/AuthorizationDataInit.java ( no revision )
  apacheds/kerberos-codec/src/main/java/org/apache/directory/shared/kerberos/codec/authorizationData/AuthorizationDataGrammar.java ( no revision )
  apacheds/kerberos-codec/src/main/java/org/apache/directory/shared/kerberos/codec/authorizationData/AuthorizationDataStatesEnum.java ( no revision )
  apacheds/kerberos-codec/src/main/java/org/apache/directory/shared/kerberos/codec/authorizationData/AuthorizationDataContainer.java ( no revision )

Changed: no author @ no date
Comment: no comment
Files changed:
  apacheds/kerberos-codec/src/main/java/org/apache/directory/shared/kerberos/codec/encryptedData/actions/EncryptedDataCipher.java ( no revision )
  apacheds/kerberos-codec/src/main/java/org/apache/directory/shared/kerberos/codec/encryptedData/actions/EncryptedDataKvno.java ( no revision )
  apacheds/kerberos-codec/src/main/java/org/apache/directory/shared/kerberos/codec/encryptedData/actions/EncryptedDataInit.java ( no revision )
  apacheds/kerberos-codec/src/main/java/org/apache/directory/shared/kerberos/codec/encryptedData/actions/EncryptedDataEType.java ( no revision )

Changed: no author @ no date
Comment: no comment
Files changed:
  apacheds/pom.xml ( no revision )
  apacheds/all/pom.xml ( no revision )

Changed: no author @ no date
Comment: no comment
Files changed:
  apacheds/kerberos-codec/src/main/java/org/apache/directory/shared/kerberos/components/KdcReqBody.java ( no revision )
  apacheds/kerberos-codec/src/main/java/org/apache/directory/shared/kerberos/codec/options/Options.java ( no revision )
  apacheds/kerberos-shared/src/main/java/org/apache/directory/server/kerberos/shared/messages/value/HostAddresses.java ( no revision )
  apacheds/core-annotations/src/main/java/org/apache/directory/server/core/factory/DefaultDirectoryServiceFactory.java ( no revision )
  shared/ldap/src/main/java/org/apache/directory/shared/asn1/primitives/BitString.java ( no revision )

Changed: no author @ no date
Comment: no comment
Files changed:
  apacheds/core/src/main/java/org/apache/directory/server/core/schema/SchemaInterceptor.java ( no revision )
  apacheds/core/src/main/java/org/apache/directory/server/core/schema/SchemaSubentryManager.java ( no revision )
  apacheds/core/src/main/java/org/apache/directory/server/core/partition/DefaultPartitionNexus.java ( no revision )
  apacheds/core/src/main/java/org/apache/directory/server/core/operational/OperationalAttributeInterceptor.java ( no revision )
  apacheds/ldap-client-test/src/test/java/org/apache/directory/shared/client/api/operations/ClientModifyRequestTest.java ( no revision )

Changed: no author @ no date
Comment: no comment
Files changed:
  apacheds/kerberos-codec/src/test/java/org/apache/directory/shared/kerberos/codec/TicketDecoderTest.java ( no revision )
  apacheds/kerberos-codec/src/test/java/org/apache/directory/shared/kerberos/codec/KdcReqBodyDecoderTest.java ( no revision )
  apacheds/kerberos-codec/src/main/java/org/apache/directory/shared/kerberos/components/KdcReqBody.java ( no revision )
  apacheds/kerberos-codec/src/main/java/org/apache/directory/shared/kerberos/messages/Ticket.java ( no revision )
  apacheds/kerberos-codec/src/main/java/org/apache/directory/shared/kerberos/KerberosConstants.java ( no revision )

Changed: no author @ no date
Comment: no comment
Files changed:
  apacheds/kerberos-codec/src/test/java/org/apache/directory/shared/kerberos/codec/KdcReqBodyDecoderTest.java ( no revision )
  apacheds/kerberos-codec/src/main/java/org/apache/directory/shared/kerberos/components/PrincipalName.java ( no revision )
  apacheds/kerberos-codec/src/main/java/org/apache/directory/shared/kerberos/components/HostAddress.java ( no revision )
  apacheds/kerberos-codec/src/main/java/org/apache/directory/shared/kerberos/components/KdcReqBody.java ( no revision )
  apacheds/kerberos-codec/src/main/java/org/apache/directory/shared/kerberos/messages/Ticket.java ( no revision )

Changed: no author @ no date
Comment: no comment
Files changed:
  apacheds/pom.xml ( no revision )

Changed: no author @ no date
Comment: no comment
Files changed:
  apacheds/kerberos-codec/src/main/java/org/apache/directory/shared/kerberos/components/KdcReqBody.java ( no revision )

Changed: no author @ no date
Comment: no comment
Files changed:
  apacheds/kerberos-codec/src/test/java/org/apache/directory/shared/kerberos/codec/EncryptedDecoderTest.java ( no revision )
  apacheds/kerberos-codec/src/test/java/org/apache/directory/shared/kerberos/codec/PrincipalNameDecoderTest.java ( no revision )
  apacheds/kerberos-codec/src/test/java/org/apache/directory/shared/kerberos/codec/HostAddressDecoderTest.java ( no revision )
  apacheds/kerberos-codec/src/test/java/org/apache/directory/shared/kerberos/codec/TicketDecoderTest.java ( no revision )
  apacheds/kerberos-codec/src/test/java/org/apache/directory/shared/kerberos/codec/options/OptionsTest.java ( no revision )
  apacheds/kerberos-codec/src/main/java/org/apache/directory/shared/kerberos/components/PrincipalNameType.java ( no revision )
  apacheds/kerberos-codec/src/main/java/org/apache/directory/shared/kerberos/components/HostAddrType.java ( no revision )
  apacheds/kerberos-codec/src/main/java/org/apache/directory/shared/kerberos/components/EncryptionType.java ( no revision )
  apacheds/kerberos-codec/src/main/java/org/apache/directory/shared/kerberos/components/PrincipalName.java ( no revision )
  apacheds/kerberos-codec/src/main/java/org/apache/directory/shared/kerberos/components/HostAddress.java ( no revision )
  apacheds/kerberos-codec/src/main/java/org/apache/directory/shared/kerberos/components/EncryptedData.java ( no revision )
  apacheds/kerberos-codec/src/main/java/org/apache/directory/shared/kerberos/KerberosUtils.java ( no revision )
  apacheds/kerberos-codec/src/main/java/org/apache/directory/shared/kerberos/codec/principalName/actions/PrincipalNameNameType.java ( no revision )
  apacheds/kerberos-codec/src/main/java/org/apache/directory/shared/kerberos/codec/hostAddress/actions/HostAddressAddrType.java ( no revision )
  apacheds/kerberos-codec/src/main/java/org/apache/directory/shared/kerberos/codec/types/PrincipalNameType.java ( no revision )
  apacheds/kerberos-codec/src/main/java/org/apache/directory/shared/kerberos/codec/types/HostAddrType.java ( no revision )
  apacheds/kerberos-codec/src/main/java/org/apache/directory/shared/kerberos/codec/types/EncryptionType.java ( no revision )
  apacheds/kerberos-codec/src/main/java/org/apache/directory/shared/kerberos/codec/encryptedData/actions/EncryptedDataEType.java ( no revision )
  apacheds/kerberos-codec/src/main/java/org/apache/directory/shared/kerberos/codec/options/Options.java ( no revision )
  apacheds/kerberos-codec/src/main/java/org/apache/directory/shared/kerberos/codec/options/KdcOptions.java ( no revision )

Changed: no author @ no date
Comment: no comment
Files changed:
  apacheds/kerberos-codec/src/test/java/org/apache/directory/shared/kerberos/codec/EncryptedDecoderTest.java ( no revision )
  apacheds/kerberos-codec/src/test/java/org/apache/directory/shared/kerberos/codec/HostAddressDecoderTest.java ( no revision )
  apacheds/kerberos-codec/src/main/java/org/apache/directory/shared/kerberos/components/HostAddress.java ( no revision )
  apacheds/kerberos-codec/src/main/java/org/apache/directory/shared/kerberos/components/HostAddrType.java ( no revision )
  apacheds/kerberos-codec/src/main/java/org/apache/directory/shared/kerberos/components/HostAddresses.java ( no revision )
  apacheds/kerberos-codec/src/main/java/org/apache/directory/shared/kerberos/KerberosConstants.java ( no revision )
  apacheds/kerberos-codec/src/main/java/org/apache/directory/shared/kerberos/codec/hostAddress/actions/HostAddressAddrType.java ( no revision )
  apacheds/kerberos-codec/src/main/java/org/apache/directory/shared/kerberos/codec/hostAddress/actions/HostAddressInit.java ( no revision )
  apacheds/kerberos-codec/src/main/java/org/apache/directory/shared/kerberos/codec/hostAddress/actions/HostAddressAddress.java ( no revision )
  apacheds/kerberos-codec/src/main/java/org/apache/directory/shared/kerberos/codec/hostAddress/HostAddressContainer.java ( no revision )
  apacheds/kerberos-codec/src/main/java/org/apache/directory/shared/kerberos/codec/hostAddress/HostAddressGrammar.java ( no revision )
  apacheds/kerberos-codec/src/main/java/org/apache/directory/shared/kerberos/codec/hostAddress/HostAddressStatesEnum.java ( no revision )
  apacheds/kerberos-codec/src/main/java/org/apache/directory/shared/kerberos/codec/encryptedData/actions/EncryptedPartCipher.java ( no revision )
  apacheds/kerberos-codec/src/main/java/org/apache/directory/shared/kerberos/codec/encryptedData/actions/EncryptedPartKvno.java ( no revision )
  apacheds/kerberos-codec/src/main/java/org/apache/directory/shared/kerberos/codec/encryptedData/actions/EncryptedPartInit.java ( no revision )
  apacheds/kerberos-codec/src/main/java/org/apache/directory/shared/kerberos/codec/encryptedData/actions/EncryptedPartEType.java ( no revision )
  apacheds/kerberos-codec/src/main/java/org/apache/directory/shared/kerberos/codec/encryptedData/actions/EncryptedDataCipher.java ( no revision )
  apacheds/kerberos-codec/src/main/java/org/apache/directory/shared/kerberos/codec/encryptedData/actions/EncryptedDataKvno.java ( no revision )
  apacheds/kerberos-codec/src/main/java/org/apache/directory/shared/kerberos/codec/encryptedData/actions/EncryptedDataInit.java ( no revision )
  apacheds/kerberos-codec/src/main/java/org/apache/directory/shared/kerberos/codec/encryptedData/actions/EncryptedDataEType.java ( no revision )
  apacheds/kerberos-codec/src/main/java/org/apache/directory/shared/kerberos/codec/encryptedData/EncryptedDataGrammar.java ( no revision )

Changed: no author @ no date
Comment: no comment
Files changed:
  apacheds/kerberos-codec/src/main/java/org/apache/directory/shared/kerberos/codec/principalName/PrincipalNameGrammar.java ( no revision )
  apacheds/kerberos-codec/src/main/java/org/apache/directory/shared/kerberos/codec/ticket/actions/TicketEncPart.java ( no revision )
  apacheds/kerberos-codec/src/main/java/org/apache/directory/shared/kerberos/codec/ticket/actions/TicketRealm.java ( no revision )
  apacheds/kerberos-codec/src/main/java/org/apache/directory/shared/kerberos/codec/ticket/actions/TicketInit.java ( no revision )
  apacheds/kerberos-codec/src/main/java/org/apache/directory/shared/kerberos/codec/ticket/actions/TicketSName.java ( no revision )
  apacheds/kerberos-codec/src/main/java/org/apache/directory/shared/kerberos/codec/ticket/actions/TicketTktVno.java ( no revision )
  apacheds/kerberos-codec/src/main/java/org/apache/directory/shared/kerberos/codec/encryptedData/actions/EncryptedPartCipher.java ( no revision )
  apacheds/kerberos-codec/src/main/java/org/apache/directory/shared/kerberos/codec/encryptedData/actions/EncryptedPartKvno.java ( no revision )
  apacheds/kerberos-codec/src/main/java/org/apache/directory/shared/kerberos/codec/encryptedData/actions/EncryptedPartInit.java ( no revision )
  apacheds/kerberos-codec/src/main/java/org/apache/directory/shared/kerberos/codec/encryptedData/actions/EncryptedPartEType.java ( no revision )
  apacheds/kerberos-codec/src/main/java/org/apache/directory/shared/kerberos/codec/encryptedData/EncryptedDataGrammar.java ( no revision )
  apacheds/kerberos-codec/src/main/java/org/apache/directory/shared/kerberos/codec/KerberosMessageGrammar.java ( no revision )

Changed: no author @ no date
Comment: no comment
Files changed:
  apacheds/kerberos-codec/src/test/java/org/apache/directory/shared/kerberos/codec/TicketDecoderTest.java ( no revision )
  apacheds/kerberos-codec/src/main/java/org/apache/directory/shared/kerberos/codec/KerberosMessageGrammar.java ( no revision )

Changed: no author @ no date
Comment: no comment
Files changed:
  apacheds/kerberos-codec/src/test/java/org/apache/directory/shared/kerberos/codec/EncryptedDecoderTest.java ( no revision )
  apacheds/kerberos-codec/src/test/java/org/apache/directory/shared/kerberos/codec/PrincipalNameDecoderTest.java ( no revision )
  apacheds/kerberos-codec/src/main/java/org/apache/directory/shared/kerberos/components/EncryptedData.java ( no revision )
  apacheds/kerberos-codec/src/main/java/org/apache/directory/shared/kerberos/KerberosConstants.java ( no revision )
  apacheds/kerberos-codec/src/main/java/org/apache/directory/shared/kerberos/codec/actions/CheckNotNullLength.java ( no revision )
  apacheds/kerberos-codec/src/main/java/org/apache/directory/shared/kerberos/codec/principalName/actions/CheckNotNullLength.java ( no revision )
  apacheds/kerberos-codec/src/main/java/org/apache/directory/shared/kerberos/codec/principalName/PrincipalNameGrammar.java ( no revision )
  apacheds/kerberos-codec/src/main/java/org/apache/directory/shared/kerberos/codec/ticket/actions/CheckNotNullLength.java ( no revision )
  apacheds/kerberos-codec/src/main/java/org/apache/directory/shared/kerberos/codec/encryptedData/EncryptedDataStatesEnum.java ( no revision )
  apacheds/kerberos-codec/src/main/java/org/apache/directory/shared/kerberos/codec/encryptedData/EncryptedDataContainer.java ( no revision )
  apacheds/kerberos-codec/src/main/java/org/apache/directory/shared/kerberos/codec/encryptedData/EncryptedDataGrammar.java ( no revision )
  apacheds/kerberos-codec/src/main/java/org/apache/directory/shared/kerberos/codec/KerberosMessageGrammar.java ( no revision )

Changed: no author @ no date
Comment: no comment
Files changed:
  apacheds/kerberos-codec/src/test/java/org/apache/directory/shared/kerberos/codec/TicketDecoderTest.java ( no revision )
  apacheds/kerberos-codec/src/main/java/org/apache/directory/shared/kerberos/components/PrincipalName.java ( no revision )
  apacheds/kerberos-codec/src/main/java/org/apache/directory/shared/kerberos/codec/actions/CheckNotNullLength.java ( no revision )
  apacheds/kerberos-codec/src/main/java/org/apache/directory/shared/kerberos/codec/ticket/actions/CheckNotNullLength.java ( no revision )
  apacheds/kerberos-codec/src/main/java/org/apache/directory/shared/kerberos/codec/KerberosMessageGrammar.java ( no revision )

Changed: no author @ no date
Comment: no comment
Files changed:
  apacheds/kerberos-codec/src/test/java/org/apache/directory/shared/kerberos/codec/PrincipalNameDecoderTest.java ( no revision )
  apacheds/kerberos-codec/src/main/java/org/apache/directory/shared/kerberos/KerberosUtils.java ( no revision )
  apacheds/kerberos-codec/src/main/java/org/apache/directory/shared/kerberos/codec/principalName/actions/PrincipalNameNameString.java ( no revision )

Changed: no author @ no date
Comment: no comment
Files changed:
  apacheds/kerberos-codec/.classpath ( no revision )
  apacheds/kerberos-codec/src/test/java/org/apache/directory/shared/kerberos/codec/PrincipalNameDecoderTest.java ( no revision )
  apacheds/kerberos-codec/src/main/java/org/apache/directory/shared/kerberos/components/PrincipalName.java ( no revision )
  apacheds/kerberos-codec/src/main/java/org/apache/directory/shared/kerberos/components/PrincipalNameType.java ( no revision )
  apacheds/kerberos-codec/src/main/java/org/apache/directory/shared/kerberos/KerberosConstants.java ( no revision )
  apacheds/kerberos-codec/src/main/java/org/apache/directory/shared/kerberos/codec/actions/CheckNotNullLength.java ( no revision )
  apacheds/kerberos-codec/src/main/java/org/apache/directory/shared/kerberos/codec/principalName/actions/PrincipalNameNameType.java ( no revision )
  apacheds/kerberos-codec/src/main/java/org/apache/directory/shared/kerberos/codec/principalName/actions/PrincipalNameInit.java ( no revision )
  apacheds/kerberos-codec/src/main/java/org/apache/directory/shared/kerberos/codec/principalName/actions/PrincipalNameNameString.java ( no revision )
  apacheds/kerberos-codec/src/main/java/org/apache/directory/shared/kerberos/codec/principalName/actions/CheckNotNullLength.java ( no revision )
  apacheds/kerberos-codec/src/main/java/org/apache/directory/shared/kerberos/codec/principalName/PrincipalNameContainer.java ( no revision )
  apacheds/kerberos-codec/src/main/java/org/apache/directory/shared/kerberos/codec/principalName/PrincipalNameGrammar.java ( no revision )
  apacheds/kerberos-codec/src/main/java/org/apache/directory/shared/kerberos/codec/principalName/PrincipalNameStatesEnum.java ( no revision )
  apacheds/kerberos-codec/src/main/java/org/apache/directory/shared/kerberos/codec/KerberosMessageContainer.java ( no revision )
  apacheds/kerberos-codec/src/main/java/org/apache/directory/shared/kerberos/codec/KerberosStatesEnum.java ( no revision )
  apacheds/kerberos-codec/src/main/java/org/apache/directory/shared/kerberos/codec/KerberosMessageGrammar.java ( no revision )

Changed: no author @ no date
Comment: no comment
Files changed:
  apacheds/core/src/test/java/org/apache/directory/server/core/normalization/NormalizationVisitorTest.java ( no revision )
  apacheds/xdbm-partition/src/main/java/org/apache/directory/server/xdbm/search/impl/DefaultOptimizer.java ( no revision )

Changed: no author @ no date
Comment: no comment
Files changed:
  shared/ldap/src/main/java/org/apache/directory/shared/ldap/codec/LdapMessageContainer.java ( no revision )

Changed: no author @ no date
Comment: no comment
Files changed:
  apacheds/core-integ/src/test/java/org/apache/directory/server/core/operational/OperationalAttributeServiceIT.java ( no revision )
  apacheds/core-api/src/main/java/org/apache/directory/server/core/LdapCoreSessionConnection.java ( no revision )
  shared/ldap/src/test/java/org/apache/directory/shared/ldap/name/DNTest.java ( no revision )
  shared/ldap/src/main/java/org/apache/directory/shared/ldap/name/DN.java ( no revision )

Changed: no author @ no date
Comment: no comment
Files changed:
  shared/ldap-schema/src/main/resources/schema/ou=schema/cn=adsconfig/ou=attributetypes/m-oid=1.3.6.1.4.1.18060.0.4.1.2.154.ldif ( no revision )

Changed: no author @ no date
Comment: no comment
Files changed:
  apacheds/server-config/src/main/java/org/apache/directory/server/config/ConfigBuilder.java ( no revision )
  apacheds/server-config/src/main/resources/config.ldif ( no revision )
  apacheds/http-integration/src/main/java/org/apache/directory/server/integration/http/HttpServer.java ( no revision )
  apacheds/http-integration/pom.xml ( no revision )
  apacheds/service/src/main/java/org/apache/directory/server/ApacheDsService.java ( no revision )

Changed: no author @ no date
Comment: no comment
Files changed:
  apacheds/server-config/src/main/java/org/apache/directory/server/config/ConfigPartitionReader.java ( no revision )
  apacheds/service/ApacheDS.launch ( no revision )

Changed: no author @ no date
Comment: no comment
Files changed:
  apacheds/service/src/main/java/org/apache/directory/server/ApacheDsService.java ( no revision )

Changed: no author @ no date
Comment: no comment
Files changed:
  apacheds/server-config/src/main/resources/config.ldif ( no revision )

Changed: no author @ no date
Comment: no comment
Files changed:
  apacheds/core/src/main/java/org/apache/directory/server/core/authn/AuthenticationInterceptor.java ( no revision )
  apacheds/interceptor-kerberos/src/main/java/org/apache/directory/server/core/kerberos/PasswordPolicyInterceptor.java ( no revision )
  apacheds/server-config/src/main/java/org/apache/directory/server/config/beans/DirectoryServiceBean.java ( no revision )
  apacheds/server-config/src/main/java/org/apache/directory/server/config/beans/AdsBaseBean.java ( no revision )
  apacheds/server-config/src/main/java/org/apache/directory/server/config/ConfigBuilder.java ( no revision )
  apacheds/server-config/src/main/resources/config.ldif ( no revision )
  apacheds/server-integ/src/test/java/org/apache/directory/server/kerberos/PasswordPolicyServiceIT.java ( no revision )
  apacheds/kerberos-shared/src/main/java/org/apache/directory/server/kerberos/shared/crypto/encryption/EncryptionType.java ( no revision )

Changed: no author @ no date
Comment: no comment
Files changed:
  apacheds/xdbm-partition/src/main/java/org/apache/directory/server/xdbm/GenericIndex.java ( no revision )

Changed: no author @ no date
Comment: no comment
Files changed:
  apacheds/jdbm-partition/src/test/java/org/apache/directory/server/core/partition/impl/btree/jdbm/JdbmIndexTest.java ( no revision )
  apacheds/jdbm-partition/src/main/java/org/apache/directory/server/core/partition/impl/btree/jdbm/JdbmIndex.java ( no revision )
  apacheds/jdbm-partition/src/main/java/org/apache/directory/server/core/partition/impl/btree/jdbm/JdbmRdnIndex.java ( no revision )
  apacheds/xdbm-partition/src/test/java/org/apache/directory/server/xdbm/impl/avl/AvlRdnIndexTest.java ( no revision )
  apacheds/xdbm-partition/src/main/java/org/apache/directory/server/xdbm/GenericIndex.java ( no revision )
  apacheds/xdbm-partition/src/main/java/org/apache/directory/server/xdbm/impl/avl/AvlIndex.java ( no revision )
  apacheds/xdbm-partition/src/main/java/org/apache/directory/server/xdbm/AbstractIndex.java ( no revision )
  apacheds/server-config/src/main/java/org/apache/directory/server/config/ConfigBuilder.java ( no revision )

Changed: no author @ no date
Comment: no comment
Files changed:
  apacheds/core/src/main/java/org/apache/directory/server/core/hash/PasswordHashingInterceptor.java ( no revision )
  apacheds/core/src/main/java/org/apache/directory/server/core/hash/Md5PasswordHashingInterceptor.java ( no revision )
  apacheds/core-integ/src/test/java/org/apache/directory/server/core/operations/add/PasswordHashingInterceptorTest.java ( no revision )

Changed: no author @ no date
Comment: no comment
Files changed:
  apacheds/core-integ/src/test/java/org/apache/directory/server/core/operations/moveAndRename/MoveAndRenamePerfIT.java ( no revision )
  apacheds/core-integ/src/test/java/org/apache/directory/server/core/operations/delete/DeletePerfIT.java ( no revision )
  apacheds/core-integ/src/test/java/org/apache/directory/server/core/operations/search/SearchBinaryIT.java ( no revision )
  apacheds/core-integ/src/test/java/org/apache/directory/server/core/operations/compare/ComparePerfIT.java ( no revision )
  apacheds/core-integ/src/test/java/org/apache/directory/server/core/operations/move/MovePerfIT.java ( no revision )
  apacheds/core-integ/src/test/java/org/apache/directory/server/core/operations/modify/ModifyPerfIT.java ( no revision )
  apacheds/core-integ/src/test/java/org/apache/directory/server/core/operations/rename/RenamePerfIT.java ( no revision )
  apacheds/core-integ/src/test/java/org/apache/directory/server/core/operations/add/AddPerfIT.java ( no revision )

Changed: no author @ no date
Comment: no comment
Files changed:
  apacheds/xdbm-partition/src/main/java/org/apache/directory/server/core/partition/impl/btree/IndexCursorAdaptor.java ( no revision )
  apacheds/xdbm-partition/src/main/java/org/apache/directory/server/xdbm/Index.java ( no revision )
  apacheds/xdbm-partition/src/main/java/org/apache/directory/server/xdbm/AbstractIndexEntry.java ( no revision )
  apacheds/xdbm-partition/src/main/java/org/apache/directory/server/xdbm/ForwardIndexEntry.java ( no revision )
  apacheds/xdbm-partition/src/main/java/org/apache/directory/server/xdbm/ReverseIndexEntry.java ( no revision )
  apacheds/xdbm-partition/src/main/java/org/apache/directory/server/xdbm/IndexEntry.java ( no revision )
  shared/ldap/src/main/java/org/apache/directory/shared/ldap/cursor/Tuple.java ( no revision )

Changed: no author @ no date
Comment: no comment
Files changed:
  apacheds/jdbm-partition/src/main/java/org/apache/directory/server/core/partition/impl/btree/jdbm/JdbmIndex.java ( no revision )
  apacheds/xdbm-partition/src/main/java/org/apache/directory/server/xdbm/Index.java ( no revision )
  apacheds/xdbm-partition/src/main/java/org/apache/directory/server/xdbm/AbstractStore.java ( no revision )
  apacheds/core-annotations/src/main/java/org/apache/directory/server/core/factory/DefaultDirectoryServiceFactory.java ( no revision )

Changed: no author @ no date
Comment: no comment
Files changed:
  apacheds/jdbm-partition/src/test/java/org/apache/directory/server/core/schema/PartitionSchemaLoaderTest.java ( no revision )
  apacheds/core-api/src/main/resources/directory-cacheservice.xml ( no revision )
  apacheds/xdbm-partition/src/test/java/org/apache/directory/server/xdbm/AbstractStoreTest.java ( no revision )
  apacheds/xdbm-partition/src/test/java/org/apache/directory/server/xdbm/impl/avl/AvlStoreTest.java ( no revision )
  apacheds/server-config/src/test/java/org/apache/directory/server/config/ChangePasswordConfigReaderTest.java ( no revision )
  apacheds/server-annotations/src/test/java/org/apache/directory/server/factory/CreateKdcServerAnnotationTest.java ( no revision )

Changed: no author @ no date
Comment: no comment
Files changed:
  apacheds/server-config/src/main/java/org/apache/directory/server/config/ConfigPartitionReader.java ( no revision )

Changed: no author @ no date
Comment: no comment
Files changed:
  shared/ldap-client-api/src/main/java/org/apache/directory/ldap/client/api/SearchCursorImpl.java ( no revision )
  shared/dsml-parser/src/test/java/org/apache/directory/shared/dsmlv2/AbstractTest.java ( no revision )
  shared/dsml-parser/src/test/java/org/apache/directory/shared/dsmlv2/searchResponse/SearchResponseTest.java ( no revision )
  shared/dsml-parser/src/test/java/org/apache/directory/shared/dsmlv2/AbstractResponseTest.java ( no revision )
  shared/dsml-parser/src/test/java/org/apache/directory/shared/dsmlv2/AllTests.java ( no revision )
  shared/dsml-parser/src/test/resources/org/apache/directory/shared/dsmlv2/searchResponse/response_with_0_SRD.xml ( no revision )
  shared/dsml-parser/src/test/resources/org/apache/directory/shared/dsmlv2/searchResponse/response_with_1_SRE_1_SRR_1_SRD.xml ( no revision )
  shared/dsml-parser/src/test/resources/org/apache/directory/shared/dsmlv2/searchResponse/response_with_1_SRD.xml ( no revision )
  shared/dsml-parser/src/test/resources/org/apache/directory/shared/dsmlv2/searchResponse/response_with_requestID_attribute.xml ( no revision )
  shared/dsml-parser/src/test/resources/org/apache/directory/shared/dsmlv2/searchResponse/response_with_2_SRE_2_SRR_1_SRD.xml ( no revision )
  shared/dsml-parser/src/test/resources/org/apache/directory/shared/dsmlv2/searchResponse/response_with_1_SRR_0_SRD.xml ( no revision )
  shared/dsml-parser/src/test/resources/org/apache/directory/shared/dsmlv2/searchResponse/response_with_1_SRR_1_SRD.xml ( no revision )
  shared/dsml-parser/src/test/resources/org/apache/directory/shared/dsmlv2/searchResponse/response_with_requestID_equals_0.xml ( no revision )
  shared/dsml-parser/src/test/resources/org/apache/directory/shared/dsmlv2/searchResponse/response_with_2_SRR_1_SRD.xml ( no revision )
  shared/dsml-parser/src/test/resources/org/apache/directory/shared/dsmlv2/searchResponse/response_with_1_SRE_0_SRD.xml ( no revision )
  shared/dsml-parser/src/test/resources/org/apache/directory/shared/dsmlv2/searchResponse/response_with_1_SRE_1_SRD.xml ( no revision )
  shared/dsml-parser/src/test/resources/org/apache/directory/shared/dsmlv2/searchResponse/response_with_2_SRE_1_SRD.xml ( no revision )
  shared/dsml-parser/src/test/resources/org/apache/directory/shared/dsmlv2/searchRequest/request_with_attributes_but_no_attribute.xml ( no revision )
  shared/dsml-parser/src/test/resources/org/apache/directory/shared/dsmlv2/searchRequest/request_with_typesOnly_0.xml ( no revision )
  shared/dsml-parser/src/test/resources/org/apache/directory/shared/dsmlv2/searchRequest/request_with_typesOnly_1.xml ( no revision )
  shared/dsml-parser/src/test/resources/org/apache/directory/shared/dsmlv2/searchRequest/request_with_requestID_attribute.xml ( no revision )
  shared/dsml-parser/src/test/resources/org/apache/directory/shared/dsmlv2/searchRequest/request_with_attributes_1_attribute.xml ( no revision )
  shared/dsml-parser/src/test/resources/org/apache/directory/shared/dsmlv2/searchRequest/request_with_attributes_2_attribute.xml ( no revision )
  shared/dsml-parser/src/test/resources/org/apache/directory/shared/dsmlv2/searchRequest/request_with_derefAliases_neverDerefAliases.xml ( no revision )
  shared/dsml-parser/src/test/resources/org/apache/directory/shared/dsmlv2/searchRequest/request_with_1_control.xml ( no revision )
  shared/dsml-parser/src/test/resources/org/apache/directory/shared/dsmlv2/searchRequest/request_with_derefAliases_error.xml ( no revision )
  shared/dsml-parser/src/test/resources/org/apache/directory/shared/dsmlv2/searchRequest/request_without_derefAliases_attribute.xml ( no revision )
  shared/dsml-parser/src/test/resources/org/apache/directory/shared/dsmlv2/searchRequest/request_with_2_attributes_elements.xml ( no revision )
  shared/dsml-parser/src/test/resources/org/apache/directory/shared/dsmlv2/searchRequest/request_with_typesOnly_true.xml ( no revision )
  shared/dsml-parser/src/test/resources/org/apache/directory/shared/dsmlv2/searchRequest/request_with_timeLimit_error.xml ( no revision )
  shared/dsml-parser/src/test/resources/org/apache/directory/shared/dsmlv2/searchRequest/request_without_dn_attribute.xml ( no revision )
  shared/dsml-parser/src/test/resources/org/apache/directory/shared/dsmlv2/searchRequest/request_without_filter.xml ( no revision )
  shared/dsml-parser/src/test/resources/org/apache/directory/shared/dsmlv2/searchRequest/request_with_derefAliases_derefAlways.xml ( no revision )
  shared/dsml-parser/src/test/resources/org/apache/directory/shared/dsmlv2/searchRequest/request_with_typesOnly_error.xml ( no revision )
  shared/dsml-parser/src/test/resources/org/apache/directory/shared/dsmlv2/searchRequest/request_with_typesOnly_false.xml ( no revision )
  shared/dsml-parser/src/test/resources/org/apache/directory/shared/dsmlv2/searchRequest/request_with_timeLimit_attribute.xml ( no revision )
  shared/dsml-parser/src/test/resources/org/apache/directory/shared/dsmlv2/searchRequest/request_with_derefAliases_derefFindingBaseObj.xml ( no revision )
  shared/dsml-parser/src/test/resources/org/apache/directory/shared/dsmlv2/searchRequest/request_with_scope_error.xml ( no revision )
  shared/dsml-parser/src/test/resources/org/apache/directory/shared/dsmlv2/searchRequest/request_with_sizeLimit_error.xml ( no revision )
  shared/dsml-parser/src/test/resources/org/apache/directory/shared/dsmlv2/searchRequest/request_without_scope_attribute.xml ( no revision )
  shared/dsml-parser/src/test/resources/org/apache/directory/shared/dsmlv2/searchRequest/request_with_2_controls.xml ( no revision )
  shared/dsml-parser/src/test/resources/org/apache/directory/shared/dsmlv2/searchRequest/request_with_dn_attribute.xml ( no revision )
  shared/dsml-parser/src/test/resources/org/apache/directory/shared/dsmlv2/searchRequest/request_with_2_filters.xml ( no revision )
  shared/dsml-parser/src/test/resources/org/apache/directory/shared/dsmlv2/searchRequest/request_with_scope_baseObject.xml ( no revision )
  shared/dsml-parser/src/test/resources/org/apache/directory/shared/dsmlv2/searchRequest/request_with_sizeLimit_attribute.xml ( no revision )
  shared/dsml-parser/src/test/resources/org/apache/directory/shared/dsmlv2/searchRequest/request_with_requestID_equals_0.xml ( no revision )
  shared/dsml-parser/src/test/resources/org/apache/directory/shared/dsmlv2/searchRequest/request_with_1_control_base64_value.xml ( no revision )
  shared/dsml-parser/src/test/resources/org/apache/directory/shared/dsmlv2/searchRequest/request_with_scope_wholeSubtree.xml ( no revision )
  shared/dsml-parser/src/test/resources/org/apache/directory/shared/dsmlv2/searchRequest/request_with_scope_singleLevel.xml ( no revision )
  shared/dsml-parser/src/test/resources/org/apache/directory/shared/dsmlv2/searchRequest/request_with_empty_filter.xml ( no revision )
  shared/dsml-parser/src/test/resources/org/apache/directory/shared/dsmlv2/searchRequest/request_with_3_controls_without_value.xml ( no revision )
  shared/dsml-parser/src/test/resources/org/apache/directory/shared/dsmlv2/searchRequest/request_with_derefAliases_derefInSearching.xml ( no revision )
  shared/dsml-parser/src/test/resources/org/apache/directory/shared/dsmlv2/searchRequest/request_with_needed_requestID.xml ( no revision )
  shared/dsml-parser/src/test/resources/org/apache/directory/shared/dsmlv2/searchRequest/request_with_attribute_without_name_attribute.xml ( no revision )
  shared/dsml-parser/src/test/resources/org/apache/directory/shared/dsmlv2/searchRequest/request_with_1_control_empty_value.xml ( no revision )
  shared/dsml-parser/src/main/java/org/apache/directory/shared/dsmlv2/IGrammar.java ( no revision )
  shared/dsml-parser/src/main/java/org/apache/directory/shared/dsmlv2/GrammarTransition.java ( no revision )
  shared/dsml-parser/src/main/java/org/apache/directory/shared/dsmlv2/DsmlDecorator.java ( no revision )
  shared/dsml-parser/src/main/java/org/apache/directory/shared/dsmlv2/Dsmlv2ResponseParser.java ( no revision )
  shared/dsml-parser/src/main/java/org/apache/directory/shared/dsmlv2/AbstractGrammar.java ( no revision )
  shared/dsml-parser/src/main/java/org/apache/directory/shared/dsmlv2/Dsmlv2Container.java ( no revision )
  shared/dsml-parser/src/main/java/org/apache/directory/shared/dsmlv2/Tag.java ( no revision )
  shared/dsml-parser/src/main/java/org/apache/directory/shared/dsmlv2/ParserUtils.java ( no revision )
  shared/dsml-parser/src/main/java/org/apache/directory/shared/dsmlv2/Dsmlv2StatesEnum.java ( no revision )
  shared/dsml-parser/src/main/java/org/apache/directory/shared/dsmlv2/Container.java ( no revision )
  shared/dsml-parser/src/main/java/org/apache/directory/shared/dsmlv2/Dsmlv2Parser.java ( no revision )
  shared/dsml-parser/src/main/java/org/apache/directory/shared/dsmlv2/GrammarAction.java ( no revision )
  shared/dsml-parser/src/main/java/org/apache/directory/shared/dsmlv2/IAction.java ( no revision )
  shared/dsml-parser/src/main/java/org/apache/directory/shared/dsmlv2/LdapMessageDecorator.java ( no revision )

Changed: no author @ no date
Comment: no comment
Files changed:
  shared/i18n/src/main/resources/org/apache/directory/shared/i18n/errors.properties ( no revision )
  shared/ldap/src/test/java/org/apache/directory/shared/ldap/filter/FilterToStringTest.java ( no revision )
  shared/ldap/src/main/java/org/apache/directory/shared/ldap/filter/ApproximateNode.java ( no revision )
  shared/ldap/src/main/java/org/apache/directory/shared/ldap/filter/LessEqNode.java ( no revision )
  shared/ldap/src/main/java/org/apache/directory/shared/ldap/filter/EqualityNode.java ( no revision )
  shared/ldap/src/main/java/org/apache/directory/shared/ldap/filter/AbstractExprNode.java ( no revision )
  shared/ldap/src/main/java/org/apache/directory/shared/ldap/filter/GreaterEqNode.java ( no revision )

Changed: no author @ no date
Comment: no comment
Files changed:
  apacheds/ldap-client-test/src/test/java/org/apache/directory/shared/client/api/LdapSSLConnectionTest.java ( no revision )
  shared/ldap-client-api/src/main/java/org/apache/directory/ldap/client/api/LdapNetworkConnection.java ( no revision )

Changed: no author @ no date
Comment: no comment
Files changed:
  shared/ldap/src/main/java/org/apache/directory/shared/ldap/codec/extended/operations/gracefulDisconnect/GracefulDisconnectContainer.java ( no revision )
  shared/ldap/src/main/java/org/apache/directory/shared/ldap/codec/extended/operations/gracefulDisconnect/GracefulDisconnectGrammar.java ( no revision )
  shared/ldap/src/main/java/org/apache/directory/shared/ldap/codec/extended/operations/gracefulDisconnect/GracefulDisconnectStatesEnum.java ( no revision )
  shared/ldap/src/main/java/org/apache/directory/shared/ldap/codec/extended/operations/gracefulShutdown/GracefulShutdownContainer.java ( no revision )
  shared/ldap/src/main/java/org/apache/directory/shared/ldap/codec/extended/operations/gracefulShutdown/GracefulShutdownGrammar.java ( no revision )
  shared/ldap/src/main/java/org/apache/directory/shared/ldap/codec/extended/operations/gracefulShutdown/GracefulShutdownStatesEnum.java ( no revision )
  shared/ldap/src/main/java/org/apache/directory/shared/ldap/codec/extended/operations/cancel/CancelContainer.java ( no revision )
  shared/ldap/src/main/java/org/apache/directory/shared/ldap/codec/extended/operations/cancel/CancelGrammar.java ( no revision )
  shared/ldap/src/main/java/org/apache/directory/shared/ldap/codec/extended/operations/cancel/CancelStatesEnum.java ( no revision )
  shared/ldap/src/main/java/org/apache/directory/shared/ldap/codec/extended/operations/certGeneration/CertGenerationGrammar.java ( no revision )
  shared/ldap/src/main/java/org/apache/directory/shared/ldap/codec/extended/operations/certGeneration/CertGenerationStatesEnum.java ( no revision )
  shared/ldap/src/main/java/org/apache/directory/shared/ldap/codec/extended/operations/certGeneration/CertGenerationContainer.java ( no revision )
  shared/ldap/src/main/java/org/apache/directory/shared/ldap/codec/extended/operations/storedProcedure/StoredProcedureGrammar.java ( no revision )
  shared/ldap/src/main/java/org/apache/directory/shared/ldap/codec/extended/operations/storedProcedure/StoredProcedureStatesEnum.java ( no revision )
  shared/ldap/src/main/java/org/apache/directory/shared/ldap/codec/extended/operations/storedProcedure/StoredProcedureContainer.java ( no revision )
  shared/ldap/src/main/java/org/apache/directory/shared/ldap/codec/controls/ppolicy/PasswordPolicyResponseControlContainer.java ( no revision )
  shared/ldap/src/main/java/org/apache/directory/shared/ldap/codec/controls/ppolicy/PasswordPolicyResponseControlStates.java ( no revision )
  shared/ldap/src/main/java/org/apache/directory/shared/ldap/codec/controls/ppolicy/PasswordPolicyResponseControlGrammar.java ( no revision )
  shared/ldap/src/main/java/org/apache/directory/shared/ldap/codec/controls/replication/syncDoneValue/SyncDoneValueControlContainer.java ( no revision )
  shared/ldap/src/main/java/org/apache/directory/shared/ldap/codec/controls/replication/syncDoneValue/SyncDoneValueControlGrammar.java ( no revision )
  shared/ldap/src/main/java/org/apache/directory/shared/ldap/codec/controls/replication/syncDoneValue/SyncDoneValueControlStatesEnum.java ( no revision )
  shared/ldap/src/main/java/org/apache/directory/shared/ldap/codec/controls/replication/syncRequestValue/SyncRequestValueControlContainer.java ( no revision )
  shared/ldap/src/main/java/org/apache/directory/shared/ldap/codec/controls/replication/syncRequestValue/SyncRequestValueControlGrammar.java ( no revision )
  shared/ldap/src/main/java/org/apache/directory/shared/ldap/codec/controls/replication/syncRequestValue/SyncRequestValueControlStatesEnum.java ( no revision )
  shared/ldap/src/main/java/org/apache/directory/shared/ldap/codec/controls/replication/syncInfoValue/SyncInfoValueControlStatesEnum.java ( no revision )
  shared/ldap/src/main/java/org/apache/directory/shared/ldap/codec/controls/replication/syncInfoValue/SyncInfoValueControlContainer.java ( no revision )
  shared/ldap/src/main/java/org/apache/directory/shared/ldap/codec/controls/replication/syncInfoValue/SyncInfoValueControlGrammar.java ( no revision )
  shared/ldap/src/main/java/org/apache/directory/shared/ldap/codec/controls/replication/syncmodifydn/SyncModifyDnControlStatesEnum.java ( no revision )
  shared/ldap/src/main/java/org/apache/directory/shared/ldap/codec/controls/replication/syncmodifydn/SyncModifyDnControlContainer.java ( no revision )
  shared/ldap/src/main/java/org/apache/directory/shared/ldap/codec/controls/replication/syncmodifydn/SyncModifyDnControlGrammar.java ( no revision )
  shared/ldap/src/main/java/org/apache/directory/shared/ldap/codec/controls/replication/syncStateValue/SyncStateValueControlGrammar.java ( no revision )
  shared/ldap/src/main/java/org/apache/directory/shared/ldap/codec/controls/replication/syncStateValue/SyncStateValueControlStatesEnum.java ( no revision )
  shared/ldap/src/main/java/org/apache/directory/shared/ldap/codec/controls/replication/syncStateValue/SyncStateValueControlContainer.java ( no revision )
  shared/ldap/src/main/java/org/apache/directory/shared/ldap/codec/search/controls/subentries/SubentriesControlContainer.java ( no revision )
  shared/ldap/src/main/java/org/apache/directory/shared/ldap/codec/search/controls/subentries/SubentriesControlGrammar.java ( no revision )
  shared/ldap/src/main/java/org/apache/directory/shared/ldap/codec/search/controls/subentries/SubentriesControlStatesEnum.java ( no revision )
  shared/ldap/src/main/java/org/apache/directory/shared/ldap/codec/search/controls/pagedSearch/PagedResultsControlContainer.java ( no revision )
  shared/ldap/src/main/java/org/apache/directory/shared/ldap/codec/search/controls/pagedSearch/PagedResultsControlGrammar.java ( no revision )
  shared/ldap/src/main/java/org/apache/directory/shared/ldap/codec/search/controls/pagedSearch/PagedResultsControlStatesEnum.java ( no revision )
  shared/ldap/src/main/java/org/apache/directory/shared/ldap/codec/search/controls/persistentSearch/PersistentSearchControlStatesEnum.java ( no revision )
  shared/ldap/src/main/java/org/apache/directory/shared/ldap/codec/search/controls/persistentSearch/PersistentSearchControlContainer.java ( no revision )
  shared/ldap/src/main/java/org/apache/directory/shared/ldap/codec/search/controls/persistentSearch/PersistentSearchControlGrammar.java ( no revision )
  shared/ldap/src/main/java/org/apache/directory/shared/ldap/codec/search/controls/entryChange/EntryChangeControlGrammar.java ( no revision )
  shared/ldap/src/main/java/org/apache/directory/shared/ldap/codec/search/controls/entryChange/EntryChangeControlStatesEnum.java ( no revision )
  shared/ldap/src/main/java/org/apache/directory/shared/ldap/codec/search/controls/entryChange/EntryChangeControlContainer.java ( no revision )
  shared/ldap/src/main/java/org/apache/directory/shared/ldap/codec/LdapMessageContainer.java ( no revision )
  shared/ldap/src/main/java/org/apache/directory/shared/ldap/codec/LdapStatesEnum.java ( no revision )
  shared/ldap/src/main/java/org/apache/directory/shared/ldap/codec/LdapMessageGrammar.java ( no revision )
  shared/ldap/src/main/java/org/apache/directory/shared/asn1/ber/grammar/States.java ( no revision )
  shared/ldap/src/main/java/org/apache/directory/shared/asn1/ber/grammar/AbstractGrammar.java ( no revision )
  shared/dsml-parser/src/main/java/org/apache/directory/shared/dsmlv2/Dsmlv2ResponseParser.java ( no revision )
  shared/dsml-parser/src/main/java/org/apache/directory/shared/dsmlv2/request/Dsmlv2Grammar.java ( no revision )
  shared/dsml-parser/src/main/java/org/apache/directory/shared/dsmlv2/AbstractGrammar.java ( no revision )
  shared/dsml-parser/src/main/java/org/apache/directory/shared/dsmlv2/Dsmlv2StatesEnum.java ( no revision )
  shared/dsml-parser/src/main/java/org/apache/directory/shared/dsmlv2/Dsmlv2Parser.java ( no revision )
  shared/dsml-parser/src/main/java/org/apache/directory/shared/dsmlv2/reponse/Dsmlv2ResponseGrammar.java ( no revision )

Changed: no author @ no date
Comment: no comment
Files changed:
  shared/dsml-parser/src/main/java/org/apache/directory/shared/dsmlv2/IStates.java ( no revision )
  shared/dsml-parser/src/main/java/org/apache/directory/shared/dsmlv2/IGrammar.java ( no revision )
  shared/dsml-parser/src/main/java/org/apache/directory/shared/dsmlv2/GrammarTransition.java ( no revision )
  shared/dsml-parser/src/main/java/org/apache/directory/shared/dsmlv2/request/Dsmlv2Grammar.java ( no revision )
  shared/dsml-parser/src/main/java/org/apache/directory/shared/dsmlv2/AbstractGrammar.java ( no revision )
  shared/dsml-parser/src/main/java/org/apache/directory/shared/dsmlv2/Dsmlv2Container.java ( no revision )
  shared/dsml-parser/src/main/java/org/apache/directory/shared/dsmlv2/Dsmlv2StatesEnum.java ( no revision )
  shared/dsml-parser/src/main/java/org/apache/directory/shared/dsmlv2/Container.java ( no revision )
  shared/dsml-parser/src/main/java/org/apache/directory/shared/dsmlv2/reponse/Dsmlv2ResponseGrammar.java ( no revision )

Changed: no author @ no date
Comment: no comment
Files changed:
  shared/ldap-client-api/src/main/java/org/apache/directory/ldap/client/api/LdapNetworkConnection.java ( no revision )
  shared/ldap-client-api/src/main/java/org/apache/directory/ldap/client/api/LdapConnectionConfig.java ( no revision )

Changed: no author @ no date
Comment: no comment
Files changed:
  shared/ldap-client-api/src/main/java/org/apache/directory/ldap/client/api/LdapNetworkConnection.java ( no revision )

Changed: no author @ no date
Comment: no comment
Files changed:
  apacheds/protocol-shared/src/main/java/org/apache/directory/server/protocol/shared/store/LdifFileLoader.java ( no revision )
  apacheds/server-config/src/main/java/org/apache/directory/server/config/ConfigPartitionReader.java ( no revision )
  apacheds/server-config/src/main/java/org/apache/directory/server/config/beans/DirectoryServiceBean.java ( no revision )
  apacheds/server-config/src/main/resources/config.ldif ( no revision )
  apacheds/server-config/src/main/resources/config/ou=config/ou=servers/ads-serverid=ldapserver/ou=extendedoperatiohandlers ( no revision )
  apacheds/server-config/src/main/resources/config/ou=config/ou=servers/ads-serverid=ldapserver/ou=extendedoperatiohandlers.ldif ( no revision )
  apacheds/server-config/src/main/resources/config/ou=config/ou=servers/ads-serverid=ldapserver/ou=extendedoperationhandlers/ads-id=starttlshandler.ldif ( no revision )
  apacheds/server-config/src/main/resources/config/ou=config/ou=servers/ads-serverid=ldapserver/ou=extendedoperationhandlers/ads-id=gracefulshutdownhandler.ldif ( no revision )
  apacheds/server-config/src/main/resources/config/ou=config/ou=servers/ads-serverid=ldapserver/ou=extendedoperationhandlers/ads-id=storedprochandler.ldif ( no revision )
  apacheds/server-tools/src/main/resources/config/config/ou=config/ou=servers/ads-serverid=ldapserver/ou=extendedoperatiohandlers/ads-id=launchdiagnosticuihandler.ldif ( no revision )

Changed: no author @ no date
Comment: no comment
Files changed:
  apacheds/core-integ/src/test/java/org/apache/directory/server/core/authn/ppolicy/PasswordPolicyTest.java ( no revision )

Changed: no author @ no date
Comment: no comment
Files changed:
  apacheds/core-api/src/main/java/org/apache/directory/server/core/LdapCoreSessionConnection.java ( no revision )
  apacheds/core-api/src/main/java/org/apache/directory/server/core/EntryToResponseCursor.java ( no revision )
  apacheds/ldap-client-test/src/test/java/org/apache/directory/shared/client/api/operations/search/ClientSearchRequestTest.java ( no revision )
  shared/ldap/src/main/java/org/apache/directory/shared/ldap/cursor/SearchCursor.java ( no revision )
  shared/ldap-client-api/src/main/java/org/apache/directory/ldap/client/api/SearchCursor.java ( no revision )
  shared/ldap-client-api/src/main/java/org/apache/directory/ldap/client/api/LdapConnection.java ( no revision )
  shared/ldap-client-api/src/main/java/org/apache/directory/ldap/client/api/LdapNetworkConnection.java ( no revision )
  shared/ldap-client-api/src/main/java/org/apache/directory/ldap/client/api/SearchCursorImpl.java ( no revision )

Changed: no author @ no date
Comment: no comment
Files changed:
  apacheds/core/src/main/java/org/apache/directory/server/core/authn/SimpleAuthenticator.java ( no revision )
  apacheds/core/src/main/java/org/apache/directory/server/core/authn/Authenticator.java ( no revision )
  apacheds/core/src/main/java/org/apache/directory/server/core/authn/AbstractAuthenticator.java ( no revision )
  apacheds/core/src/main/java/org/apache/directory/server/core/authn/AuthenticationInterceptor.java ( no revision )

Changed: no author @ no date
Comment: no comment
Files changed:
  apacheds/core/src/main/java/org/apache/directory/server/core/authn/PasswordPolicyConfiguration.java ( no revision )
  apacheds/core/src/main/java/org/apache/directory/server/core/authn/PasswordUtil.java ( no revision )
  apacheds/core/src/main/java/org/apache/directory/server/core/DefaultDirectoryService.java ( no revision )
  apacheds/core-api/src/test/java/org/apache/directory/server/core/MockDirectoryService.java ( no revision )
  apacheds/core-api/src/main/java/org/apache/directory/server/core/PpolicyConfigContainer.java ( no revision )
  apacheds/core-api/src/main/java/org/apache/directory/server/core/PasswordPolicyConfiguration.java ( no revision )
  apacheds/core-api/src/main/java/org/apache/directory/server/core/DirectoryService.java ( no revision )

Changed: no author @ no date
Comment: no comment
Files changed:
  apacheds/core/src/main/java/org/apache/directory/server/core/authn/PasswordUtil.java ( no revision )
  apacheds/core/src/main/java/org/apache/directory/server/core/authn/SimpleAuthenticator.java ( no revision )

Changed: no author @ no date
Comment: no comment
Files changed:
  shared/ldap/src/main/java/org/apache/directory/shared/ldap/codec/search/controls/pagedSearch/PagedResultsControlStatesEnum.java ( no revision )

Changed: no author @ no date
Comment: no comment
Files changed:
  apacheds/ldif-partition/src/main/java/org/apache/directory/server/core/partition/ldif/SingleFileLdifPartition.java ( no revision )

Changed: no author @ no date
Comment: no comment
Files changed:
  project/pom.xml ( no revision )

Changed: no author @ no date
Comment: no comment
Files changed:
  shared/ldap/src/main/java/org/apache/directory/shared/ldap/util/tree/DnNode.java ( no revision )

Changed: no author @ no date
Comment: no comment
Files changed:
  apacheds/core/src/main/java/org/apache/directory/server/core/operational/OperationalAttributeInterceptor.java ( no revision )
  apacheds/core-integ/src/test/java/org/apache/directory/server/core/operational/OperationalAttributeServiceIT.java ( no revision )
  apacheds/core-api/src/main/java/org/apache/directory/server/core/interceptor/InterceptorChain.java ( no revision )
  apacheds/xdbm-partition/src/main/java/org/apache/directory/server/core/partition/impl/xdbm/AbstractXdbmPartition.java ( no revision )
  apacheds/xdbm-partition/src/main/java/org/apache/directory/server/xdbm/AbstractStore.java ( no revision )

****************************************************************************
Dependencies Changes:
****************************************************************************
No dependencies changed


****************************************************************************
Build Definition:
****************************************************************************
POM filename: pom.xml
Goals: clean install -Dintegration   
Arguments: --batch-mode
Build Fresh: false
Always Build: false
Default Build Definition: true
Schedule: DEFAULT_SCHEDULE
Profile Name: Maven 2.2.1
Description: Default Maven 2 Build Definition

****************************************************************************
Test Summary:
****************************************************************************
Tests: 5053
Failures: 21
Errors: 26
Success Rate: 99
Total time: 4431.561

****************************************************************************
Test Failures:
****************************************************************************

EncTktInSkeyTest
    testEncTktInSkey :
  java.lang.AssertionError
  java.lang.AssertionError: KDC cannot accommodate requested option expected:<13> but was:<33>
	at org.junit.Assert.fail(Assert.java:91)
	at org.junit.Assert.failNotEquals(Assert.java:645)
	at org.junit.Assert.assertEquals(Assert.java:126)
	at org.junit.Assert.assertEquals(Assert.java:470)
	at org.apache.directory.server.kerberos.protocol.EncTktInSkeyTest.testEncTktInSkey(EncTktInSkeyTest.java:147)
	at sun.reflect.NativeMethodAccessorImpl.invoke0(Native Method)
	at sun.reflect.NativeMethodAccessorImpl.invoke(NativeMethodAccessorImpl.java:39)
	at sun.reflect.DelegatingMethodAccessorImpl.invoke(DelegatingMethodAccessorImpl.java:25)
	at java.lang.reflect.Method.invoke(Method.java:597)
	at org.junit.runners.model.FrameworkMethod$1.runReflectiveCall(FrameworkMethod.java:44)
	at org.junit.internal.runners.model.ReflectiveCallable.run(ReflectiveCallable.java:15)
	at org.junit.runners.model.FrameworkMethod.invokeExplosively(FrameworkMethod.java:41)
	at org.junit.internal.runners.statements.InvokeMethod.evaluate(InvokeMethod.java:20)
	at org.junit.internal.runners.statements.RunBefores.evaluate(RunBefores.java:28)
	at org.junit.internal.runners.statements.RunAfters.evaluate(RunAfters.java:31)
	at org.junit.runners.BlockJUnit4ClassRunner.runChild(BlockJUnit4ClassRunner.java:76)
	at org.junit.runners.BlockJUnit4ClassRunner.runChild(BlockJUnit4ClassRunner.java:50)
	at org.junit.runners.ParentRunner$3.run(ParentRunner.java:193)
	at org.junit.runners.ParentRunner$1.schedule(ParentRunner.java:52)
	at org.junit.runners.ParentRunner.runChildren(ParentRunner.java:191)
	at org.junit.runners.ParentRunner.access$000(ParentRunner.java:42)
	at org.junit.runners.ParentRunner$2.evaluate(ParentRunner.java:184)
	at org.junit.runners.ParentRunner.run(ParentRunner.java:236)
	at org.apache.maven.surefire.junit4.JUnit4TestSet.execute(JUnit4TestSet.java:59)
	at org.apache.maven.surefire.suite.AbstractDirectoryTestSuite.executeTestSet(AbstractDirectoryTestSuite.java:120)
	at org.apache.maven.surefire.suite.AbstractDirectoryTestSuite.execute(AbstractDirectoryTestSuite.java:103)
	at org.apache.maven.surefire.Surefire.run(Surefire.java:169)
	at sun.reflect.NativeMethodAccessorImpl.invoke0(Native Method)
	at sun.reflect.NativeMethodAccessorImpl.invoke(NativeMethodAccessorImpl.java:39)
	at sun.reflect.DelegatingMethodAccessorImpl.invoke(DelegatingMethodAccessorImpl.java:25)
	at java.lang.reflect.Method.invoke(Method.java:597)
	at org.apache.maven.surefire.booter.SurefireBooter.runSuitesInProcess(SurefireBooter.java:350)
	at org.apache.maven.surefire.booter.SurefireBooter.main(SurefireBooter.java:1021)

  TicketGrantingPolicyTest
    testForwardableTicket :
  java.lang.AssertionError
  java.lang.AssertionError: KDC policy rejects request expected:<12> but was:<33>
	at org.junit.Assert.fail(Assert.java:91)
	at org.junit.Assert.failNotEquals(Assert.java:645)
	at org.junit.Assert.assertEquals(Assert.java:126)
	at org.junit.Assert.assertEquals(Assert.java:470)
	at org.apache.directory.server.kerberos.protocol.TicketGrantingPolicyTest.testForwardableTicket(TicketGrantingPolicyTest.java:140)
	at sun.reflect.NativeMethodAccessorImpl.invoke0(Native Method)
	at sun.reflect.NativeMethodAccessorImpl.invoke(NativeMethodAccessorImpl.java:39)
	at sun.reflect.DelegatingMethodAccessorImpl.invoke(DelegatingMethodAccessorImpl.java:25)
	at java.lang.reflect.Method.invoke(Method.java:597)
	at org.junit.runners.model.FrameworkMethod$1.runReflectiveCall(FrameworkMethod.java:44)
	at org.junit.internal.runners.model.ReflectiveCallable.run(ReflectiveCallable.java:15)
	at org.junit.runners.model.FrameworkMethod.invokeExplosively(FrameworkMethod.java:41)
	at org.junit.internal.runners.statements.InvokeMethod.evaluate(InvokeMethod.java:20)
	at org.junit.internal.runners.statements.RunBefores.evaluate(RunBefores.java:28)
	at org.junit.internal.runners.statements.RunAfters.evaluate(RunAfters.java:31)
	at org.junit.runners.BlockJUnit4ClassRunner.runChild(BlockJUnit4ClassRunner.java:76)
	at org.junit.runners.BlockJUnit4ClassRunner.runChild(BlockJUnit4ClassRunner.java:50)
	at org.junit.runners.ParentRunner$3.run(ParentRunner.java:193)
	at org.junit.runners.ParentRunner$1.schedule(ParentRunner.java:52)
	at org.junit.runners.ParentRunner.runChildren(ParentRunner.java:191)
	at org.junit.runners.ParentRunner.access$000(ParentRunner.java:42)
	at org.junit.runners.ParentRunner$2.evaluate(ParentRunner.java:184)
	at org.junit.runners.ParentRunner.run(ParentRunner.java:236)
	at org.apache.maven.surefire.junit4.JUnit4TestSet.execute(JUnit4TestSet.java:59)
	at org.apache.maven.surefire.suite.AbstractDirectoryTestSuite.executeTestSet(AbstractDirectoryTestSuite.java:120)
	at org.apache.maven.surefire.suite.AbstractDirectoryTestSuite.execute(AbstractDirectoryTestSuite.java:103)
	at org.apache.maven.surefire.Surefire.run(Surefire.java:169)
	at sun.reflect.NativeMethodAccessorImpl.invoke0(Native Method)
	at sun.reflect.NativeMethodAccessorImpl.invoke(NativeMethodAccessorImpl.java:39)
	at sun.reflect.DelegatingMethodAccessorImpl.invoke(DelegatingMethodAccessorImpl.java:25)
	at java.lang.reflect.Method.invoke(Method.java:597)
	at org.apache.maven.surefire.booter.SurefireBooter.runSuitesInProcess(SurefireBooter.java:350)
	at org.apache.maven.surefire.booter.SurefireBooter.main(SurefireBooter.java:1021)

    testForwardedTicket :
  java.lang.AssertionError
  java.lang.AssertionError: KDC policy rejects request expected:<12> but was:<33>
	at org.junit.Assert.fail(Assert.java:91)
	at org.junit.Assert.failNotEquals(Assert.java:645)
	at org.junit.Assert.assertEquals(Assert.java:126)
	at org.junit.Assert.assertEquals(Assert.java:470)
	at org.apache.directory.server.kerberos.protocol.TicketGrantingPolicyTest.testForwardedTicket(TicketGrantingPolicyTest.java:190)
	at sun.reflect.NativeMethodAccessorImpl.invoke0(Native Method)
	at sun.reflect.NativeMethodAccessorImpl.invoke(NativeMethodAccessorImpl.java:39)
	at sun.reflect.DelegatingMethodAccessorImpl.invoke(DelegatingMethodAccessorImpl.java:25)
	at java.lang.reflect.Method.invoke(Method.java:597)
	at org.junit.runners.model.FrameworkMethod$1.runReflectiveCall(FrameworkMethod.java:44)
	at org.junit.internal.runners.model.ReflectiveCallable.run(ReflectiveCallable.java:15)
	at org.junit.runners.model.FrameworkMethod.invokeExplosively(FrameworkMethod.java:41)
	at org.junit.internal.runners.statements.InvokeMethod.evaluate(InvokeMethod.java:20)
	at org.junit.internal.runners.statements.RunBefores.evaluate(RunBefores.java:28)
	at org.junit.internal.runners.statements.RunAfters.evaluate(RunAfters.java:31)
	at org.junit.runners.BlockJUnit4ClassRunner.runChild(BlockJUnit4ClassRunner.java:76)
	at org.junit.runners.BlockJUnit4ClassRunner.runChild(BlockJUnit4ClassRunner.java:50)
	at org.junit.runners.ParentRunner$3.run(ParentRunner.java:193)
	at org.junit.runners.ParentRunner$1.schedule(ParentRunner.java:52)
	at org.junit.runners.ParentRunner.runChildren(ParentRunner.java:191)
	at org.junit.runners.ParentRunner.access$000(ParentRunner.java:42)
	at org.junit.runners.ParentRunner$2.evaluate(ParentRunner.java:184)
	at org.junit.runners.ParentRunner.run(ParentRunner.java:236)
	at org.apache.maven.surefire.junit4.JUnit4TestSet.execute(JUnit4TestSet.java:59)
	at org.apache.maven.surefire.suite.AbstractDirectoryTestSuite.executeTestSet(AbstractDirectoryTestSuite.java:120)
	at org.apache.maven.surefire.suite.AbstractDirectoryTestSuite.execute(AbstractDirectoryTestSuite.java:103)
	at org.apache.maven.surefire.Surefire.run(Surefire.java:169)
	at sun.reflect.NativeMethodAccessorImpl.invoke0(Native Method)
	at sun.reflect.NativeMethodAccessorImpl.invoke(NativeMethodAccessorImpl.java:39)
	at sun.reflect.DelegatingMethodAccessorImpl.invoke(DelegatingMethodAccessorImpl.java:25)
	at java.lang.reflect.Method.invoke(Method.java:597)
	at org.apache.maven.surefire.booter.SurefireBooter.runSuitesInProcess(SurefireBooter.java:350)
	at org.apache.maven.surefire.booter.SurefireBooter.main(SurefireBooter.java:1021)

    testForwardedNoAddressesTicket :
  java.lang.AssertionError
  java.lang.AssertionError: KDC policy rejects request expected:<12> but was:<33>
	at org.junit.Assert.fail(Assert.java:91)
	at org.junit.Assert.failNotEquals(Assert.java:645)
	at org.junit.Assert.assertEquals(Assert.java:126)
	at org.junit.Assert.assertEquals(Assert.java:470)
	at org.apache.directory.server.kerberos.protocol.TicketGrantingPolicyTest.testForwardedNoAddressesTicket(TicketGrantingPolicyTest.java:245)
	at sun.reflect.NativeMethodAccessorImpl.invoke0(Native Method)
	at sun.reflect.NativeMethodAccessorImpl.invoke(NativeMethodAccessorImpl.java:39)
	at sun.reflect.DelegatingMethodAccessorImpl.invoke(DelegatingMethodAccessorImpl.java:25)
	at java.lang.reflect.Method.invoke(Method.java:597)
	at org.junit.runners.model.FrameworkMethod$1.runReflectiveCall(FrameworkMethod.java:44)
	at org.junit.internal.runners.model.ReflectiveCallable.run(ReflectiveCallable.java:15)
	at org.junit.runners.model.FrameworkMethod.invokeExplosively(FrameworkMethod.java:41)
	at org.junit.internal.runners.statements.InvokeMethod.evaluate(InvokeMethod.java:20)
	at org.junit.internal.runners.statements.RunBefores.evaluate(RunBefores.java:28)
	at org.junit.internal.runners.statements.RunAfters.evaluate(RunAfters.java:31)
	at org.junit.runners.BlockJUnit4ClassRunner.runChild(BlockJUnit4ClassRunner.java:76)
	at org.junit.runners.BlockJUnit4ClassRunner.runChild(BlockJUnit4ClassRunner.java:50)
	at org.junit.runners.ParentRunner$3.run(ParentRunner.java:193)
	at org.junit.runners.ParentRunner$1.schedule(ParentRunner.java:52)
	at org.junit.runners.ParentRunner.runChildren(ParentRunner.java:191)
	at org.junit.runners.ParentRunner.access$000(ParentRunner.java:42)
	at org.junit.runners.ParentRunner$2.evaluate(ParentRunner.java:184)
	at org.junit.runners.ParentRunner.run(ParentRunner.java:236)
	at org.apache.maven.surefire.junit4.JUnit4TestSet.execute(JUnit4TestSet.java:59)
	at org.apache.maven.surefire.suite.AbstractDirectoryTestSuite.executeTestSet(AbstractDirectoryTestSuite.java:120)
	at org.apache.maven.surefire.suite.AbstractDirectoryTestSuite.execute(AbstractDirectoryTestSuite.java:103)
	at org.apache.maven.surefire.Surefire.run(Surefire.java:169)
	at sun.reflect.NativeMethodAccessorImpl.invoke0(Native Method)
	at sun.reflect.NativeMethodAccessorImpl.invoke(NativeMethodAccessorImpl.java:39)
	at sun.reflect.DelegatingMethodAccessorImpl.invoke(DelegatingMethodAccessorImpl.java:25)
	at java.lang.reflect.Method.invoke(Method.java:597)
	at org.apache.maven.surefire.booter.SurefireBooter.runSuitesInProcess(SurefireBooter.java:350)
	at org.apache.maven.surefire.booter.SurefireBooter.main(SurefireBooter.java:1021)

    testProxiableTicket :
  java.lang.AssertionError
  java.lang.AssertionError: KDC policy rejects request expected:<12> but was:<33>
	at org.junit.Assert.fail(Assert.java:91)
	at org.junit.Assert.failNotEquals(Assert.java:645)
	at org.junit.Assert.assertEquals(Assert.java:126)
	at org.junit.Assert.assertEquals(Assert.java:470)
	at org.apache.directory.server.kerberos.protocol.TicketGrantingPolicyTest.testProxiableTicket(TicketGrantingPolicyTest.java:295)
	at sun.reflect.NativeMethodAccessorImpl.invoke0(Native Method)
	at sun.reflect.NativeMethodAccessorImpl.invoke(NativeMethodAccessorImpl.java:39)
	at sun.reflect.DelegatingMethodAccessorImpl.invoke(DelegatingMethodAccessorImpl.java:25)
	at java.lang.reflect.Method.invoke(Method.java:597)
	at org.junit.runners.model.FrameworkMethod$1.runReflectiveCall(FrameworkMethod.java:44)
	at org.junit.internal.runners.model.ReflectiveCallable.run(ReflectiveCallable.java:15)
	at org.junit.runners.model.FrameworkMethod.invokeExplosively(FrameworkMethod.java:41)
	at org.junit.internal.runners.statements.InvokeMethod.evaluate(InvokeMethod.java:20)
	at org.junit.internal.runners.statements.RunBefores.evaluate(RunBefores.java:28)
	at org.junit.internal.runners.statements.RunAfters.evaluate(RunAfters.java:31)
	at org.junit.runners.BlockJUnit4ClassRunner.runChild(BlockJUnit4ClassRunner.java:76)
	at org.junit.runners.BlockJUnit4ClassRunner.runChild(BlockJUnit4ClassRunner.java:50)
	at org.junit.runners.ParentRunner$3.run(ParentRunner.java:193)
	at org.junit.runners.ParentRunner$1.schedule(ParentRunner.java:52)
	at org.junit.runners.ParentRunner.runChildren(ParentRunner.java:191)
	at org.junit.runners.ParentRunner.access$000(ParentRunner.java:42)
	at org.junit.runners.ParentRunner$2.evaluate(ParentRunner.java:184)
	at org.junit.runners.ParentRunner.run(ParentRunner.java:236)
	at org.apache.maven.surefire.junit4.JUnit4TestSet.execute(JUnit4TestSet.java:59)
	at org.apache.maven.surefire.suite.AbstractDirectoryTestSuite.executeTestSet(AbstractDirectoryTestSuite.java:120)
	at org.apache.maven.surefire.suite.AbstractDirectoryTestSuite.execute(AbstractDirectoryTestSuite.java:103)
	at org.apache.maven.surefire.Surefire.run(Surefire.java:169)
	at sun.reflect.NativeMethodAccessorImpl.invoke0(Native Method)
	at sun.reflect.NativeMethodAccessorImpl.invoke(NativeMethodAccessorImpl.java:39)
	at sun.reflect.DelegatingMethodAccessorImpl.invoke(DelegatingMethodAccessorImpl.java:25)
	at java.lang.reflect.Method.invoke(Method.java:597)
	at org.apache.maven.surefire.booter.SurefireBooter.runSuitesInProcess(SurefireBooter.java:350)
	at org.apache.maven.surefire.booter.SurefireBooter.main(SurefireBooter.java:1021)

    testProxyTicket :
  java.lang.AssertionError
  java.lang.AssertionError: KDC policy rejects request expected:<12> but was:<33>
	at org.junit.Assert.fail(Assert.java:91)
	at org.junit.Assert.failNotEquals(Assert.java:645)
	at org.junit.Assert.assertEquals(Assert.java:126)
	at org.junit.Assert.assertEquals(Assert.java:470)
	at org.apache.directory.server.kerberos.protocol.TicketGrantingPolicyTest.testProxyTicket(TicketGrantingPolicyTest.java:350)
	at sun.reflect.NativeMethodAccessorImpl.invoke0(Native Method)
	at sun.reflect.NativeMethodAccessorImpl.invoke(NativeMethodAccessorImpl.java:39)
	at sun.reflect.DelegatingMethodAccessorImpl.invoke(DelegatingMethodAccessorImpl.java:25)
	at java.lang.reflect.Method.invoke(Method.java:597)
	at org.junit.runners.model.FrameworkMethod$1.runReflectiveCall(FrameworkMethod.java:44)
	at org.junit.internal.runners.model.ReflectiveCallable.run(ReflectiveCallable.java:15)
	at org.junit.runners.model.FrameworkMethod.invokeExplosively(FrameworkMethod.java:41)
	at org.junit.internal.runners.statements.InvokeMethod.evaluate(InvokeMethod.java:20)
	at org.junit.internal.runners.statements.RunBefores.evaluate(RunBefores.java:28)
	at org.junit.internal.runners.statements.RunAfters.evaluate(RunAfters.java:31)
	at org.junit.runners.BlockJUnit4ClassRunner.runChild(BlockJUnit4ClassRunner.java:76)
	at org.junit.runners.BlockJUnit4ClassRunner.runChild(BlockJUnit4ClassRunner.java:50)
	at org.junit.runners.ParentRunner$3.run(ParentRunner.java:193)
	at org.junit.runners.ParentRunner$1.schedule(ParentRunner.java:52)
	at org.junit.runners.ParentRunner.runChildren(ParentRunner.java:191)
	at org.junit.runners.ParentRunner.access$000(ParentRunner.java:42)
	at org.junit.runners.ParentRunner$2.evaluate(ParentRunner.java:184)
	at org.junit.runners.ParentRunner.run(ParentRunner.java:236)
	at org.apache.maven.surefire.junit4.JUnit4TestSet.execute(JUnit4TestSet.java:59)
	at org.apache.maven.surefire.suite.AbstractDirectoryTestSuite.executeTestSet(AbstractDirectoryTestSuite.java:120)
	at org.apache.maven.surefire.suite.AbstractDirectoryTestSuite.execute(AbstractDirectoryTestSuite.java:103)
	at org.apache.maven.surefire.Surefire.run(Surefire.java:169)
	at sun.reflect.NativeMethodAccessorImpl.invoke0(Native Method)
	at sun.reflect.NativeMethodAccessorImpl.invoke(NativeMethodAccessorImpl.java:39)
	at sun.reflect.DelegatingMethodAccessorImpl.invoke(DelegatingMethodAccessorImpl.java:25)
	at java.lang.reflect.Method.invoke(Method.java:597)
	at org.apache.maven.surefire.booter.SurefireBooter.runSuitesInProcess(SurefireBooter.java:350)
	at org.apache.maven.surefire.booter.SurefireBooter.main(SurefireBooter.java:1021)

    testProxyNoAddressesTicket :
  java.lang.AssertionError
  java.lang.AssertionError: KDC policy rejects request expected:<12> but was:<33>
	at org.junit.Assert.fail(Assert.java:91)
	at org.junit.Assert.failNotEquals(Assert.java:645)
	at org.junit.Assert.assertEquals(Assert.java:126)
	at org.junit.Assert.assertEquals(Assert.java:470)
	at org.apache.directory.server.kerberos.protocol.TicketGrantingPolicyTest.testProxyNoAddressesTicket(TicketGrantingPolicyTest.java:405)
	at sun.reflect.NativeMethodAccessorImpl.invoke0(Native Method)
	at sun.reflect.NativeMethodAccessorImpl.invoke(NativeMethodAccessorImpl.java:39)
	at sun.reflect.DelegatingMethodAccessorImpl.invoke(DelegatingMethodAccessorImpl.java:25)
	at java.lang.reflect.Method.invoke(Method.java:597)
	at org.junit.runners.model.FrameworkMethod$1.runReflectiveCall(FrameworkMethod.java:44)
	at org.junit.internal.runners.model.ReflectiveCallable.run(ReflectiveCallable.java:15)
	at org.junit.runners.model.FrameworkMethod.invokeExplosively(FrameworkMethod.java:41)
	at org.junit.internal.runners.statements.InvokeMethod.evaluate(InvokeMethod.java:20)
	at org.junit.internal.runners.statements.RunBefores.evaluate(RunBefores.java:28)
	at org.junit.internal.runners.statements.RunAfters.evaluate(RunAfters.java:31)
	at org.junit.runners.BlockJUnit4ClassRunner.runChild(BlockJUnit4ClassRunner.java:76)
	at org.junit.runners.BlockJUnit4ClassRunner.runChild(BlockJUnit4ClassRunner.java:50)
	at org.junit.runners.ParentRunner$3.run(ParentRunner.java:193)
	at org.junit.runners.ParentRunner$1.schedule(ParentRunner.java:52)
	at org.junit.runners.ParentRunner.runChildren(ParentRunner.java:191)
	at org.junit.runners.ParentRunner.access$000(ParentRunner.java:42)
	at org.junit.runners.ParentRunner$2.evaluate(ParentRunner.java:184)
	at org.junit.runners.ParentRunner.run(ParentRunner.java:236)
	at org.apache.maven.surefire.junit4.JUnit4TestSet.execute(JUnit4TestSet.java:59)
	at org.apache.maven.surefire.suite.AbstractDirectoryTestSuite.executeTestSet(AbstractDirectoryTestSuite.java:120)
	at org.apache.maven.surefire.suite.AbstractDirectoryTestSuite.execute(AbstractDirectoryTestSuite.java:103)
	at org.apache.maven.surefire.Surefire.run(Surefire.java:169)
	at sun.reflect.NativeMethodAccessorImpl.invoke0(Native Method)
	at sun.reflect.NativeMethodAccessorImpl.invoke(NativeMethodAccessorImpl.java:39)
	at sun.reflect.DelegatingMethodAccessorImpl.invoke(DelegatingMethodAccessorImpl.java:25)
	at java.lang.reflect.Method.invoke(Method.java:597)
	at org.apache.maven.surefire.booter.SurefireBooter.runSuitesInProcess(SurefireBooter.java:350)
	at org.apache.maven.surefire.booter.SurefireBooter.main(SurefireBooter.java:1021)

    testAllowPostdate :
  java.lang.AssertionError
  java.lang.AssertionError: KDC policy rejects request expected:<12> but was:<33>
	at org.junit.Assert.fail(Assert.java:91)
	at org.junit.Assert.failNotEquals(Assert.java:645)
	at org.junit.Assert.assertEquals(Assert.java:126)
	at org.junit.Assert.assertEquals(Assert.java:470)
	at org.apache.directory.server.kerberos.protocol.TicketGrantingPolicyTest.testAllowPostdate(TicketGrantingPolicyTest.java:455)
	at sun.reflect.NativeMethodAccessorImpl.invoke0(Native Method)
	at sun.reflect.NativeMethodAccessorImpl.invoke(NativeMethodAccessorImpl.java:39)
	at sun.reflect.DelegatingMethodAccessorImpl.invoke(DelegatingMethodAccessorImpl.java:25)
	at java.lang.reflect.Method.invoke(Method.java:597)
	at org.junit.runners.model.FrameworkMethod$1.runReflectiveCall(FrameworkMethod.java:44)
	at org.junit.internal.runners.model.ReflectiveCallable.run(ReflectiveCallable.java:15)
	at org.junit.runners.model.FrameworkMethod.invokeExplosively(FrameworkMethod.java:41)
	at org.junit.internal.runners.statements.InvokeMethod.evaluate(InvokeMethod.java:20)
	at org.junit.internal.runners.statements.RunBefores.evaluate(RunBefores.java:28)
	at org.junit.internal.runners.statements.RunAfters.evaluate(RunAfters.java:31)
	at org.junit.runners.BlockJUnit4ClassRunner.runChild(BlockJUnit4ClassRunner.java:76)
	at org.junit.runners.BlockJUnit4ClassRunner.runChild(BlockJUnit4ClassRunner.java:50)
	at org.junit.runners.ParentRunner$3.run(ParentRunner.java:193)
	at org.junit.runners.ParentRunner$1.schedule(ParentRunner.java:52)
	at org.junit.runners.ParentRunner.runChildren(ParentRunner.java:191)
	at org.junit.runners.ParentRunner.access$000(ParentRunner.java:42)
	at org.junit.runners.ParentRunner$2.evaluate(ParentRunner.java:184)
	at org.junit.runners.ParentRunner.run(ParentRunner.java:236)
	at org.apache.maven.surefire.junit4.JUnit4TestSet.execute(JUnit4TestSet.java:59)
	at org.apache.maven.surefire.suite.AbstractDirectoryTestSuite.executeTestSet(AbstractDirectoryTestSuite.java:120)
	at org.apache.maven.surefire.suite.AbstractDirectoryTestSuite.execute(AbstractDirectoryTestSuite.java:103)
	at org.apache.maven.surefire.Surefire.run(Surefire.java:169)
	at sun.reflect.NativeMethodAccessorImpl.invoke0(Native Method)
	at sun.reflect.NativeMethodAccessorImpl.invoke(NativeMethodAccessorImpl.java:39)
	at sun.reflect.DelegatingMethodAccessorImpl.invoke(DelegatingMethodAccessorImpl.java:25)
	at java.lang.reflect.Method.invoke(Method.java:597)
	at org.apache.maven.surefire.booter.SurefireBooter.runSuitesInProcess(SurefireBooter.java:350)
	at org.apache.maven.surefire.booter.SurefireBooter.main(SurefireBooter.java:1021)

    testPostdated :
  java.lang.AssertionError
  java.lang.AssertionError: KDC policy rejects request expected:<12> but was:<33>
	at org.junit.Assert.fail(Assert.java:91)
	at org.junit.Assert.failNotEquals(Assert.java:645)
	at org.junit.Assert.assertEquals(Assert.java:126)
	at org.junit.Assert.assertEquals(Assert.java:470)
	at org.apache.directory.server.kerberos.protocol.TicketGrantingPolicyTest.testPostdated(TicketGrantingPolicyTest.java:505)
	at sun.reflect.NativeMethodAccessorImpl.invoke0(Native Method)
	at sun.reflect.NativeMethodAccessorImpl.invoke(NativeMethodAccessorImpl.java:39)
	at sun.reflect.DelegatingMethodAccessorImpl.invoke(DelegatingMethodAccessorImpl.java:25)
	at java.lang.reflect.Method.invoke(Method.java:597)
	at org.junit.runners.model.FrameworkMethod$1.runReflectiveCall(FrameworkMethod.java:44)
	at org.junit.internal.runners.model.ReflectiveCallable.run(ReflectiveCallable.java:15)
	at org.junit.runners.model.FrameworkMethod.invokeExplosively(FrameworkMethod.java:41)
	at org.junit.internal.runners.statements.InvokeMethod.evaluate(InvokeMethod.java:20)
	at org.junit.internal.runners.statements.RunBefores.evaluate(RunBefores.java:28)
	at org.junit.internal.runners.statements.RunAfters.evaluate(RunAfters.java:31)
	at org.junit.runners.BlockJUnit4ClassRunner.runChild(BlockJUnit4ClassRunner.java:76)
	at org.junit.runners.BlockJUnit4ClassRunner.runChild(BlockJUnit4ClassRunner.java:50)
	at org.junit.runners.ParentRunner$3.run(ParentRunner.java:193)
	at org.junit.runners.ParentRunner$1.schedule(ParentRunner.java:52)
	at org.junit.runners.ParentRunner.runChildren(ParentRunner.java:191)
	at org.junit.runners.ParentRunner.access$000(ParentRunner.java:42)
	at org.junit.runners.ParentRunner$2.evaluate(ParentRunner.java:184)
	at org.junit.runners.ParentRunner.run(ParentRunner.java:236)
	at org.apache.maven.surefire.junit4.JUnit4TestSet.execute(JUnit4TestSet.java:59)
	at org.apache.maven.surefire.suite.AbstractDirectoryTestSuite.executeTestSet(AbstractDirectoryTestSuite.java:120)
	at org.apache.maven.surefire.suite.AbstractDirectoryTestSuite.execute(AbstractDirectoryTestSuite.java:103)
	at org.apache.maven.surefire.Surefire.run(Surefire.java:169)
	at sun.reflect.NativeMethodAccessorImpl.invoke0(Native Method)
	at sun.reflect.NativeMethodAccessorImpl.invoke(NativeMethodAccessorImpl.java:39)
	at sun.reflect.DelegatingMethodAccessorImpl.invoke(DelegatingMethodAccessorImpl.java:25)
	at java.lang.reflect.Method.invoke(Method.java:597)
	at org.apache.maven.surefire.booter.SurefireBooter.runSuitesInProcess(SurefireBooter.java:350)
	at org.apache.maven.surefire.booter.SurefireBooter.main(SurefireBooter.java:1021)

    testRenewTicket :
  java.lang.AssertionError
  java.lang.AssertionError: KDC policy rejects request expected:<12> but was:<33>
	at org.junit.Assert.fail(Assert.java:91)
	at org.junit.Assert.failNotEquals(Assert.java:645)
	at org.junit.Assert.assertEquals(Assert.java:126)
	at org.junit.Assert.assertEquals(Assert.java:470)
	at org.apache.directory.server.kerberos.protocol.TicketGrantingPolicyTest.testRenewTicket(TicketGrantingPolicyTest.java:600)
	at sun.reflect.NativeMethodAccessorImpl.invoke0(Native Method)
	at sun.reflect.NativeMethodAccessorImpl.invoke(NativeMethodAccessorImpl.java:39)
	at sun.reflect.DelegatingMethodAccessorImpl.invoke(DelegatingMethodAccessorImpl.java:25)
	at java.lang.reflect.Method.invoke(Method.java:597)
	at org.junit.runners.model.FrameworkMethod$1.runReflectiveCall(FrameworkMethod.java:44)
	at org.junit.internal.runners.model.ReflectiveCallable.run(ReflectiveCallable.java:15)
	at org.junit.runners.model.FrameworkMethod.invokeExplosively(FrameworkMethod.java:41)
	at org.junit.internal.runners.statements.InvokeMethod.evaluate(InvokeMethod.java:20)
	at org.junit.internal.runners.statements.RunBefores.evaluate(RunBefores.java:28)
	at org.junit.internal.runners.statements.RunAfters.evaluate(RunAfters.java:31)
	at org.junit.runners.BlockJUnit4ClassRunner.runChild(BlockJUnit4ClassRunner.java:76)
	at org.junit.runners.BlockJUnit4ClassRunner.runChild(BlockJUnit4ClassRunner.java:50)
	at org.junit.runners.ParentRunner$3.run(ParentRunner.java:193)
	at org.junit.runners.ParentRunner$1.schedule(ParentRunner.java:52)
	at org.junit.runners.ParentRunner.runChildren(ParentRunner.java:191)
	at org.junit.runners.ParentRunner.access$000(ParentRunner.java:42)
	at org.junit.runners.ParentRunner$2.evaluate(ParentRunner.java:184)
	at org.junit.runners.ParentRunner.run(ParentRunner.java:236)
	at org.apache.maven.surefire.junit4.JUnit4TestSet.execute(JUnit4TestSet.java:59)
	at org.apache.maven.surefire.suite.AbstractDirectoryTestSuite.executeTestSet(AbstractDirectoryTestSuite.java:120)
	at org.apache.maven.surefire.suite.AbstractDirectoryTestSuite.execute(AbstractDirectoryTestSuite.java:103)
	at org.apache.maven.surefire.Surefire.run(Surefire.java:169)
	at sun.reflect.NativeMethodAccessorImpl.invoke0(Native Method)
	at sun.reflect.NativeMethodAccessorImpl.invoke(NativeMethodAccessorImpl.java:39)
	at sun.reflect.DelegatingMethodAccessorImpl.invoke(DelegatingMethodAccessorImpl.java:25)
	at java.lang.reflect.Method.invoke(Method.java:597)
	at org.apache.maven.surefire.booter.SurefireBooter.runSuitesInProcess(SurefireBooter.java:350)
	at org.apache.maven.surefire.booter.SurefireBooter.main(SurefireBooter.java:1021)

    testRenewableOk :
  java.lang.AssertionError
  java.lang.AssertionError: KDC policy rejects request expected:<12> but was:<33>
	at org.junit.Assert.fail(Assert.java:91)
	at org.junit.Assert.failNotEquals(Assert.java:645)
	at org.junit.Assert.assertEquals(Assert.java:126)
	at org.junit.Assert.assertEquals(Assert.java:470)
	at org.apache.directory.server.kerberos.protocol.TicketGrantingPolicyTest.testRenewableOk(TicketGrantingPolicyTest.java:650)
	at sun.reflect.NativeMethodAccessorImpl.invoke0(Native Method)
	at sun.reflect.NativeMethodAccessorImpl.invoke(NativeMethodAccessorImpl.java:39)
	at sun.reflect.DelegatingMethodAccessorImpl.invoke(DelegatingMethodAccessorImpl.java:25)
	at java.lang.reflect.Method.invoke(Method.java:597)
	at org.junit.runners.model.FrameworkMethod$1.runReflectiveCall(FrameworkMethod.java:44)
	at org.junit.internal.runners.model.ReflectiveCallable.run(ReflectiveCallable.java:15)
	at org.junit.runners.model.FrameworkMethod.invokeExplosively(FrameworkMethod.java:41)
	at org.junit.internal.runners.statements.InvokeMethod.evaluate(InvokeMethod.java:20)
	at org.junit.internal.runners.statements.RunBefores.evaluate(RunBefores.java:28)
	at org.junit.internal.runners.statements.RunAfters.evaluate(RunAfters.java:31)
	at org.junit.runners.BlockJUnit4ClassRunner.runChild(BlockJUnit4ClassRunner.java:76)
	at org.junit.runners.BlockJUnit4ClassRunner.runChild(BlockJUnit4ClassRunner.java:50)
	at org.junit.runners.ParentRunner$3.run(ParentRunner.java:193)
	at org.junit.runners.ParentRunner$1.schedule(ParentRunner.java:52)
	at org.junit.runners.ParentRunner.runChildren(ParentRunner.java:191)
	at org.junit.runners.ParentRunner.access$000(ParentRunner.java:42)
	at org.junit.runners.ParentRunner$2.evaluate(ParentRunner.java:184)
	at org.junit.runners.ParentRunner.run(ParentRunner.java:236)
	at org.apache.maven.surefire.junit4.JUnit4TestSet.execute(JUnit4TestSet.java:59)
	at org.apache.maven.surefire.suite.AbstractDirectoryTestSuite.executeTestSet(AbstractDirectoryTestSuite.java:120)
	at org.apache.maven.surefire.suite.AbstractDirectoryTestSuite.execute(AbstractDirectoryTestSuite.java:103)
	at org.apache.maven.surefire.Surefire.run(Surefire.java:169)
	at sun.reflect.NativeMethodAccessorImpl.invoke0(Native Method)
	at sun.reflect.NativeMethodAccessorImpl.invoke(NativeMethodAccessorImpl.java:39)
	at sun.reflect.DelegatingMethodAccessorImpl.invoke(DelegatingMethodAccessorImpl.java:25)
	at java.lang.reflect.Method.invoke(Method.java:597)
	at org.apache.maven.surefire.booter.SurefireBooter.runSuitesInProcess(SurefireBooter.java:350)
	at org.apache.maven.surefire.booter.SurefireBooter.main(SurefireBooter.java:1021)

    testRenewableTicket :
  java.lang.AssertionError
  java.lang.AssertionError: KDC policy rejects request expected:<12> but was:<33>
	at org.junit.Assert.fail(Assert.java:91)
	at org.junit.Assert.failNotEquals(Assert.java:645)
	at org.junit.Assert.assertEquals(Assert.java:126)
	at org.junit.Assert.assertEquals(Assert.java:470)
	at org.apache.directory.server.kerberos.protocol.TicketGrantingPolicyTest.testRenewableTicket(TicketGrantingPolicyTest.java:703)
	at sun.reflect.NativeMethodAccessorImpl.invoke0(Native Method)
	at sun.reflect.NativeMethodAccessorImpl.invoke(NativeMethodAccessorImpl.java:39)
	at sun.reflect.DelegatingMethodAccessorImpl.invoke(DelegatingMethodAccessorImpl.java:25)
	at java.lang.reflect.Method.invoke(Method.java:597)
	at org.junit.runners.model.FrameworkMethod$1.runReflectiveCall(FrameworkMethod.java:44)
	at org.junit.internal.runners.model.ReflectiveCallable.run(ReflectiveCallable.java:15)
	at org.junit.runners.model.FrameworkMethod.invokeExplosively(FrameworkMethod.java:41)
	at org.junit.internal.runners.statements.InvokeMethod.evaluate(InvokeMethod.java:20)
	at org.junit.internal.runners.statements.RunBefores.evaluate(RunBefores.java:28)
	at org.junit.internal.runners.statements.RunAfters.evaluate(RunAfters.java:31)
	at org.junit.runners.BlockJUnit4ClassRunner.runChild(BlockJUnit4ClassRunner.java:76)
	at org.junit.runners.BlockJUnit4ClassRunner.runChild(BlockJUnit4ClassRunner.java:50)
	at org.junit.runners.ParentRunner$3.run(ParentRunner.java:193)
	at org.junit.runners.ParentRunner$1.schedule(ParentRunner.java:52)
	at org.junit.runners.ParentRunner.runChildren(ParentRunner.java:191)
	at org.junit.runners.ParentRunner.access$000(ParentRunner.java:42)
	at org.junit.runners.ParentRunner$2.evaluate(ParentRunner.java:184)
	at org.junit.runners.ParentRunner.run(ParentRunner.java:236)
	at org.apache.maven.surefire.junit4.JUnit4TestSet.execute(JUnit4TestSet.java:59)
	at org.apache.maven.surefire.suite.AbstractDirectoryTestSuite.executeTestSet(AbstractDirectoryTestSuite.java:120)
	at org.apache.maven.surefire.suite.AbstractDirectoryTestSuite.execute(AbstractDirectoryTestSuite.java:103)
	at org.apache.maven.surefire.Surefire.run(Surefire.java:169)
	at sun.reflect.NativeMethodAccessorImpl.invoke0(Native Method)
	at sun.reflect.NativeMethodAccessorImpl.invoke(NativeMethodAccessorImpl.java:39)
	at sun.reflect.DelegatingMethodAccessorImpl.invoke(DelegatingMethodAccessorImpl.java:25)
	at java.lang.reflect.Method.invoke(Method.java:597)
	at org.apache.maven.surefire.booter.SurefireBooter.runSuitesInProcess(SurefireBooter.java:350)
	at org.apache.maven.surefire.booter.SurefireBooter.main(SurefireBooter.java:1021)

  TicketGrantingServiceTest
    testForwardableTicket :
  java.lang.ClassCastException
  java.lang.ClassCastException: org.apache.directory.server.kerberos.shared.messages.ErrorMessage cannot be cast to org.apache.directory.server.kerberos.shared.messages.TicketGrantReply
	at org.apache.directory.server.kerberos.protocol.TicketGrantingServiceTest.testForwardableTicket(TicketGrantingServiceTest.java:1625)
	at sun.reflect.NativeMethodAccessorImpl.invoke0(Native Method)
	at sun.reflect.NativeMethodAccessorImpl.invoke(NativeMethodAccessorImpl.java:39)
	at sun.reflect.DelegatingMethodAccessorImpl.invoke(DelegatingMethodAccessorImpl.java:25)
	at java.lang.reflect.Method.invoke(Method.java:597)
	at org.junit.runners.model.FrameworkMethod$1.runReflectiveCall(FrameworkMethod.java:44)
	at org.junit.internal.runners.model.ReflectiveCallable.run(ReflectiveCallable.java:15)
	at org.junit.runners.model.FrameworkMethod.invokeExplosively(FrameworkMethod.java:41)
	at org.junit.internal.runners.statements.InvokeMethod.evaluate(InvokeMethod.java:20)
	at org.junit.internal.runners.statements.RunBefores.evaluate(RunBefores.java:28)
	at org.junit.internal.runners.statements.RunAfters.evaluate(RunAfters.java:31)
	at org.junit.runners.BlockJUnit4ClassRunner.runChild(BlockJUnit4ClassRunner.java:76)
	at org.junit.runners.BlockJUnit4ClassRunner.runChild(BlockJUnit4ClassRunner.java:50)
	at org.junit.runners.ParentRunner$3.run(ParentRunner.java:193)
	at org.junit.runners.ParentRunner$1.schedule(ParentRunner.java:52)
	at org.junit.runners.ParentRunner.runChildren(ParentRunner.java:191)
	at org.junit.runners.ParentRunner.access$000(ParentRunner.java:42)
	at org.junit.runners.ParentRunner$2.evaluate(ParentRunner.java:184)
	at org.junit.runners.ParentRunner.run(ParentRunner.java:236)
	at org.apache.maven.surefire.junit4.JUnit4TestSet.execute(JUnit4TestSet.java:59)
	at org.apache.maven.surefire.suite.AbstractDirectoryTestSuite.executeTestSet(AbstractDirectoryTestSuite.java:120)
	at org.apache.maven.surefire.suite.AbstractDirectoryTestSuite.execute(AbstractDirectoryTestSuite.java:103)
	at org.apache.maven.surefire.Surefire.run(Surefire.java:169)
	at sun.reflect.NativeMethodAccessorImpl.invoke0(Native Method)
	at sun.reflect.NativeMethodAccessorImpl.invoke(NativeMethodAccessorImpl.java:39)
	at sun.reflect.DelegatingMethodAccessorImpl.invoke(DelegatingMethodAccessorImpl.java:25)
	at java.lang.reflect.Method.invoke(Method.java:597)
	at org.apache.maven.surefire.booter.SurefireBooter.runSuitesInProcess(SurefireBooter.java:350)
	at org.apache.maven.surefire.booter.SurefireBooter.main(SurefireBooter.java:1021)

    testForwardedTicket :
  java.lang.ClassCastException
  java.lang.ClassCastException: org.apache.directory.server.kerberos.shared.messages.ErrorMessage cannot be cast to org.apache.directory.server.kerberos.shared.messages.TicketGrantReply
	at org.apache.directory.server.kerberos.protocol.TicketGrantingServiceTest.testForwardedTicket(TicketGrantingServiceTest.java:625)
	at sun.reflect.NativeMethodAccessorImpl.invoke0(Native Method)
	at sun.reflect.NativeMethodAccessorImpl.invoke(NativeMethodAccessorImpl.java:39)
	at sun.reflect.DelegatingMethodAccessorImpl.invoke(DelegatingMethodAccessorImpl.java:25)
	at java.lang.reflect.Method.invoke(Method.java:597)
	at org.junit.runners.model.FrameworkMethod$1.runReflectiveCall(FrameworkMethod.java:44)
	at org.junit.internal.runners.model.ReflectiveCallable.run(ReflectiveCallable.java:15)
	at org.junit.runners.model.FrameworkMethod.invokeExplosively(FrameworkMethod.java:41)
	at org.junit.internal.runners.statements.InvokeMethod.evaluate(InvokeMethod.java:20)
	at org.junit.internal.runners.statements.RunBefores.evaluate(RunBefores.java:28)
	at org.junit.internal.runners.statements.RunAfters.evaluate(RunAfters.java:31)
	at org.junit.runners.BlockJUnit4ClassRunner.runChild(BlockJUnit4ClassRunner.java:76)
	at org.junit.runners.BlockJUnit4ClassRunner.runChild(BlockJUnit4ClassRunner.java:50)
	at org.junit.runners.ParentRunner$3.run(ParentRunner.java:193)
	at org.junit.runners.ParentRunner$1.schedule(ParentRunner.java:52)
	at org.junit.runners.ParentRunner.runChildren(ParentRunner.java:191)
	at org.junit.runners.ParentRunner.access$000(ParentRunner.java:42)
	at org.junit.runners.ParentRunner$2.evaluate(ParentRunner.java:184)
	at org.junit.runners.ParentRunner.run(ParentRunner.java:236)
	at org.apache.maven.surefire.junit4.JUnit4TestSet.execute(JUnit4TestSet.java:59)
	at org.apache.maven.surefire.suite.AbstractDirectoryTestSuite.executeTestSet(AbstractDirectoryTestSuite.java:120)
	at org.apache.maven.surefire.suite.AbstractDirectoryTestSuite.execute(AbstractDirectoryTestSuite.java:103)
	at org.apache.maven.surefire.Surefire.run(Surefire.java:169)
	at sun.reflect.NativeMethodAccessorImpl.invoke0(Native Method)
	at sun.reflect.NativeMethodAccessorImpl.invoke(NativeMethodAccessorImpl.java:39)
	at sun.reflect.DelegatingMethodAccessorImpl.invoke(DelegatingMethodAccessorImpl.java:25)
	at java.lang.reflect.Method.invoke(Method.java:597)
	at org.apache.maven.surefire.booter.SurefireBooter.runSuitesInProcess(SurefireBooter.java:350)
	at org.apache.maven.surefire.booter.SurefireBooter.main(SurefireBooter.java:1021)

    testProxiableTicket :
  java.lang.ClassCastException
  java.lang.ClassCastException: org.apache.directory.server.kerberos.shared.messages.ErrorMessage cannot be cast to org.apache.directory.server.kerberos.shared.messages.TicketGrantReply
	at org.apache.directory.server.kerberos.protocol.TicketGrantingServiceTest.testProxiableTicket(TicketGrantingServiceTest.java:1735)
	at sun.reflect.NativeMethodAccessorImpl.invoke0(Native Method)
	at sun.reflect.NativeMethodAccessorImpl.invoke(NativeMethodAccessorImpl.java:39)
	at sun.reflect.DelegatingMethodAccessorImpl.invoke(DelegatingMethodAccessorImpl.java:25)
	at java.lang.reflect.Method.invoke(Method.java:597)
	at org.junit.runners.model.FrameworkMethod$1.runReflectiveCall(FrameworkMethod.java:44)
	at org.junit.internal.runners.model.ReflectiveCallable.run(ReflectiveCallable.java:15)
	at org.junit.runners.model.FrameworkMethod.invokeExplosively(FrameworkMethod.java:41)
	at org.junit.internal.runners.statements.InvokeMethod.evaluate(InvokeMethod.java:20)
	at org.junit.internal.runners.statements.RunBefores.evaluate(RunBefores.java:28)
	at org.junit.internal.runners.statements.RunAfters.evaluate(RunAfters.java:31)
	at org.junit.runners.BlockJUnit4ClassRunner.runChild(BlockJUnit4ClassRunner.java:76)
	at org.junit.runners.BlockJUnit4ClassRunner.runChild(BlockJUnit4ClassRunner.java:50)
	at org.junit.runners.ParentRunner$3.run(ParentRunner.java:193)
	at org.junit.runners.ParentRunner$1.schedule(ParentRunner.java:52)
	at org.junit.runners.ParentRunner.runChildren(ParentRunner.java:191)
	at org.junit.runners.ParentRunner.access$000(ParentRunner.java:42)
	at org.junit.runners.ParentRunner$2.evaluate(ParentRunner.java:184)
	at org.junit.runners.ParentRunner.run(ParentRunner.java:236)
	at org.apache.maven.surefire.junit4.JUnit4TestSet.execute(JUnit4TestSet.java:59)
	at org.apache.maven.surefire.suite.AbstractDirectoryTestSuite.executeTestSet(AbstractDirectoryTestSuite.java:120)
	at org.apache.maven.surefire.suite.AbstractDirectoryTestSuite.execute(AbstractDirectoryTestSuite.java:103)
	at org.apache.maven.surefire.Surefire.run(Surefire.java:169)
	at sun.reflect.NativeMethodAccessorImpl.invoke0(Native Method)
	at sun.reflect.NativeMethodAccessorImpl.invoke(NativeMethodAccessorImpl.java:39)
	at sun.reflect.DelegatingMethodAccessorImpl.invoke(DelegatingMethodAccessorImpl.java:25)
	at java.lang.reflect.Method.invoke(Method.java:597)
	at org.apache.maven.surefire.booter.SurefireBooter.runSuitesInProcess(SurefireBooter.java:350)
	at org.apache.maven.surefire.booter.SurefireBooter.main(SurefireBooter.java:1021)

    testProxyTicket :
  java.lang.ClassCastException
  java.lang.ClassCastException: org.apache.directory.server.kerberos.shared.messages.ErrorMessage cannot be cast to org.apache.directory.server.kerberos.shared.messages.TicketGrantReply
	at org.apache.directory.server.kerberos.protocol.TicketGrantingServiceTest.testProxyTicket(TicketGrantingServiceTest.java:566)
	at sun.reflect.NativeMethodAccessorImpl.invoke0(Native Method)
	at sun.reflect.NativeMethodAccessorImpl.invoke(NativeMethodAccessorImpl.java:39)
	at sun.reflect.DelegatingMethodAccessorImpl.invoke(DelegatingMethodAccessorImpl.java:25)
	at java.lang.reflect.Method.invoke(Method.java:597)
	at org.junit.runners.model.FrameworkMethod$1.runReflectiveCall(FrameworkMethod.java:44)
	at org.junit.internal.runners.model.ReflectiveCallable.run(ReflectiveCallable.java:15)
	at org.junit.runners.model.FrameworkMethod.invokeExplosively(FrameworkMethod.java:41)
	at org.junit.internal.runners.statements.InvokeMethod.evaluate(InvokeMethod.java:20)
	at org.junit.internal.runners.statements.RunBefores.evaluate(RunBefores.java:28)
	at org.junit.internal.runners.statements.RunAfters.evaluate(RunAfters.java:31)
	at org.junit.runners.BlockJUnit4ClassRunner.runChild(BlockJUnit4ClassRunner.java:76)
	at org.junit.runners.BlockJUnit4ClassRunner.runChild(BlockJUnit4ClassRunner.java:50)
	at org.junit.runners.ParentRunner$3.run(ParentRunner.java:193)
	at org.junit.runners.ParentRunner$1.schedule(ParentRunner.java:52)
	at org.junit.runners.ParentRunner.runChildren(ParentRunner.java:191)
	at org.junit.runners.ParentRunner.access$000(ParentRunner.java:42)
	at org.junit.runners.ParentRunner$2.evaluate(ParentRunner.java:184)
	at org.junit.runners.ParentRunner.run(ParentRunner.java:236)
	at org.apache.maven.surefire.junit4.JUnit4TestSet.execute(JUnit4TestSet.java:59)
	at org.apache.maven.surefire.suite.AbstractDirectoryTestSuite.executeTestSet(AbstractDirectoryTestSuite.java:120)
	at org.apache.maven.surefire.suite.AbstractDirectoryTestSuite.execute(AbstractDirectoryTestSuite.java:103)
	at org.apache.maven.surefire.Surefire.run(Surefire.java:169)
	at sun.reflect.NativeMethodAccessorImpl.invoke0(Native Method)
	at sun.reflect.NativeMethodAccessorImpl.invoke(NativeMethodAccessorImpl.java:39)
	at sun.reflect.DelegatingMethodAccessorImpl.invoke(DelegatingMethodAccessorImpl.java:25)
	at java.lang.reflect.Method.invoke(Method.java:597)
	at org.apache.maven.surefire.booter.SurefireBooter.runSuitesInProcess(SurefireBooter.java:350)
	at org.apache.maven.surefire.booter.SurefireBooter.main(SurefireBooter.java:1021)

    testAllowPostdate :
  java.lang.ClassCastException
  java.lang.ClassCastException: org.apache.directory.server.kerberos.shared.messages.ErrorMessage cannot be cast to org.apache.directory.server.kerberos.shared.messages.TicketGrantReply
	at org.apache.directory.server.kerberos.protocol.TicketGrantingServiceTest.testAllowPostdate(TicketGrantingServiceTest.java:1680)
	at sun.reflect.NativeMethodAccessorImpl.invoke0(Native Method)
	at sun.reflect.NativeMethodAccessorImpl.invoke(NativeMethodAccessorImpl.java:39)
	at sun.reflect.DelegatingMethodAccessorImpl.invoke(DelegatingMethodAccessorImpl.java:25)
	at java.lang.reflect.Method.invoke(Method.java:597)
	at org.junit.runners.model.FrameworkMethod$1.runReflectiveCall(FrameworkMethod.java:44)
	at org.junit.internal.runners.model.ReflectiveCallable.run(ReflectiveCallable.java:15)
	at org.junit.runners.model.FrameworkMethod.invokeExplosively(FrameworkMethod.java:41)
	at org.junit.internal.runners.statements.InvokeMethod.evaluate(InvokeMethod.java:20)
	at org.junit.internal.runners.statements.RunBefores.evaluate(RunBefores.java:28)
	at org.junit.internal.runners.statements.RunAfters.evaluate(RunAfters.java:31)
	at org.junit.runners.BlockJUnit4ClassRunner.runChild(BlockJUnit4ClassRunner.java:76)
	at org.junit.runners.BlockJUnit4ClassRunner.runChild(BlockJUnit4ClassRunner.java:50)
	at org.junit.runners.ParentRunner$3.run(ParentRunner.java:193)
	at org.junit.runners.ParentRunner$1.schedule(ParentRunner.java:52)
	at org.junit.runners.ParentRunner.runChildren(ParentRunner.java:191)
	at org.junit.runners.ParentRunner.access$000(ParentRunner.java:42)
	at org.junit.runners.ParentRunner$2.evaluate(ParentRunner.java:184)
	at org.junit.runners.ParentRunner.run(ParentRunner.java:236)
	at org.apache.maven.surefire.junit4.JUnit4TestSet.execute(JUnit4TestSet.java:59)
	at org.apache.maven.surefire.suite.AbstractDirectoryTestSuite.executeTestSet(AbstractDirectoryTestSuite.java:120)
	at org.apache.maven.surefire.suite.AbstractDirectoryTestSuite.execute(AbstractDirectoryTestSuite.java:103)
	at org.apache.maven.surefire.Surefire.run(Surefire.java:169)
	at sun.reflect.NativeMethodAccessorImpl.invoke0(Native Method)
	at sun.reflect.NativeMethodAccessorImpl.invoke(NativeMethodAccessorImpl.java:39)
	at sun.reflect.DelegatingMethodAccessorImpl.invoke(DelegatingMethodAccessorImpl.java:25)
	at java.lang.reflect.Method.invoke(Method.java:597)
	at org.apache.maven.surefire.booter.SurefireBooter.runSuitesInProcess(SurefireBooter.java:350)
	at org.apache.maven.surefire.booter.SurefireBooter.main(SurefireBooter.java:1021)

    testRenewTicket :
  java.lang.ClassCastException
  java.lang.ClassCastException: org.apache.directory.server.kerberos.shared.messages.ErrorMessage cannot be cast to org.apache.directory.server.kerberos.shared.messages.TicketGrantReply
	at org.apache.directory.server.kerberos.protocol.TicketGrantingServiceTest.testRenewTicket(TicketGrantingServiceTest.java:460)
	at sun.reflect.NativeMethodAccessorImpl.invoke0(Native Method)
	at sun.reflect.NativeMethodAccessorImpl.invoke(NativeMethodAccessorImpl.java:39)
	at sun.reflect.DelegatingMethodAccessorImpl.invoke(DelegatingMethodAccessorImpl.java:25)
	at java.lang.reflect.Method.invoke(Method.java:597)
	at org.junit.runners.model.FrameworkMethod$1.runReflectiveCall(FrameworkMethod.java:44)
	at org.junit.internal.runners.model.ReflectiveCallable.run(ReflectiveCallable.java:15)
	at org.junit.runners.model.FrameworkMethod.invokeExplosively(FrameworkMethod.java:41)
	at org.junit.internal.runners.statements.InvokeMethod.evaluate(InvokeMethod.java:20)
	at org.junit.internal.runners.statements.RunBefores.evaluate(RunBefores.java:28)
	at org.junit.internal.runners.statements.RunAfters.evaluate(RunAfters.java:31)
	at org.junit.runners.BlockJUnit4ClassRunner.runChild(BlockJUnit4ClassRunner.java:76)
	at org.junit.runners.BlockJUnit4ClassRunner.runChild(BlockJUnit4ClassRunner.java:50)
	at org.junit.runners.ParentRunner$3.run(ParentRunner.java:193)
	at org.junit.runners.ParentRunner$1.schedule(ParentRunner.java:52)
	at org.junit.runners.ParentRunner.runChildren(ParentRunner.java:191)
	at org.junit.runners.ParentRunner.access$000(ParentRunner.java:42)
	at org.junit.runners.ParentRunner$2.evaluate(ParentRunner.java:184)
	at org.junit.runners.ParentRunner.run(ParentRunner.java:236)
	at org.apache.maven.surefire.junit4.JUnit4TestSet.execute(JUnit4TestSet.java:59)
	at org.apache.maven.surefire.suite.AbstractDirectoryTestSuite.executeTestSet(AbstractDirectoryTestSuite.java:120)
	at org.apache.maven.surefire.suite.AbstractDirectoryTestSuite.execute(AbstractDirectoryTestSuite.java:103)
	at org.apache.maven.surefire.Surefire.run(Surefire.java:169)
	at sun.reflect.NativeMethodAccessorImpl.invoke0(Native Method)
	at sun.reflect.NativeMethodAccessorImpl.invoke(NativeMethodAccessorImpl.java:39)
	at sun.reflect.DelegatingMethodAccessorImpl.invoke(DelegatingMethodAccessorImpl.java:25)
	at java.lang.reflect.Method.invoke(Method.java:597)
	at org.apache.maven.surefire.booter.SurefireBooter.runSuitesInProcess(SurefireBooter.java:350)
	at org.apache.maven.surefire.booter.SurefireBooter.main(SurefireBooter.java:1021)

    testRenewableOk :
  java.lang.ClassCastException
  java.lang.ClassCastException: org.apache.directory.server.kerberos.shared.messages.ErrorMessage cannot be cast to org.apache.directory.server.kerberos.shared.messages.TicketGrantReply
	at org.apache.directory.server.kerberos.protocol.TicketGrantingServiceTest.testRenewableOk(TicketGrantingServiceTest.java:1565)
	at sun.reflect.NativeMethodAccessorImpl.invoke0(Native Method)
	at sun.reflect.NativeMethodAccessorImpl.invoke(NativeMethodAccessorImpl.java:39)
	at sun.reflect.DelegatingMethodAccessorImpl.invoke(DelegatingMethodAccessorImpl.java:25)
	at java.lang.reflect.Method.invoke(Method.java:597)
	at org.junit.runners.model.FrameworkMethod$1.runReflectiveCall(FrameworkMethod.java:44)
	at org.junit.internal.runners.model.ReflectiveCallable.run(ReflectiveCallable.java:15)
	at org.junit.runners.model.FrameworkMethod.invokeExplosively(FrameworkMethod.java:41)
	at org.junit.internal.runners.statements.InvokeMethod.evaluate(InvokeMethod.java:20)
	at org.junit.internal.runners.statements.RunBefores.evaluate(RunBefores.java:28)
	at org.junit.internal.runners.statements.RunAfters.evaluate(RunAfters.java:31)
	at org.junit.runners.BlockJUnit4ClassRunner.runChild(BlockJUnit4ClassRunner.java:76)
	at org.junit.runners.BlockJUnit4ClassRunner.runChild(BlockJUnit4ClassRunner.java:50)
	at org.junit.runners.ParentRunner$3.run(ParentRunner.java:193)
	at org.junit.runners.ParentRunner$1.schedule(ParentRunner.java:52)
	at org.junit.runners.ParentRunner.runChildren(ParentRunner.java:191)
	at org.junit.runners.ParentRunner.access$000(ParentRunner.java:42)
	at org.junit.runners.ParentRunner$2.evaluate(ParentRunner.java:184)
	at org.junit.runners.ParentRunner.run(ParentRunner.java:236)
	at org.apache.maven.surefire.junit4.JUnit4TestSet.execute(JUnit4TestSet.java:59)
	at org.apache.maven.surefire.suite.AbstractDirectoryTestSuite.executeTestSet(AbstractDirectoryTestSuite.java:120)
	at org.apache.maven.surefire.suite.AbstractDirectoryTestSuite.execute(AbstractDirectoryTestSuite.java:103)
	at org.apache.maven.surefire.Surefire.run(Surefire.java:169)
	at sun.reflect.NativeMethodAccessorImpl.invoke0(Native Method)
	at sun.reflect.NativeMethodAccessorImpl.invoke(NativeMethodAccessorImpl.java:39)
	at sun.reflect.DelegatingMethodAccessorImpl.invoke(DelegatingMethodAccessorImpl.java:25)
	at java.lang.reflect.Method.invoke(Method.java:597)
	at org.apache.maven.surefire.booter.SurefireBooter.runSuitesInProcess(SurefireBooter.java:350)
	at org.apache.maven.surefire.booter.SurefireBooter.main(SurefireBooter.java:1021)

    testRenewableTicket :
  java.lang.ClassCastException
  java.lang.ClassCastException: org.apache.directory.server.kerberos.shared.messages.ErrorMessage cannot be cast to org.apache.directory.server.kerberos.shared.messages.TicketGrantReply
	at org.apache.directory.server.kerberos.protocol.TicketGrantingServiceTest.testRenewableTicket(TicketGrantingServiceTest.java:1796)
	at sun.reflect.NativeMethodAccessorImpl.invoke0(Native Method)
	at sun.reflect.NativeMethodAccessorImpl.invoke(NativeMethodAccessorImpl.java:39)
	at sun.reflect.DelegatingMethodAccessorImpl.invoke(DelegatingMethodAccessorImpl.java:25)
	at java.lang.reflect.Method.invoke(Method.java:597)
	at org.junit.runners.model.FrameworkMethod$1.runReflectiveCall(FrameworkMethod.java:44)
	at org.junit.internal.runners.model.ReflectiveCallable.run(ReflectiveCallable.java:15)
	at org.junit.runners.model.FrameworkMethod.invokeExplosively(FrameworkMethod.java:41)
	at org.junit.internal.runners.statements.InvokeMethod.evaluate(InvokeMethod.java:20)
	at org.junit.internal.runners.statements.RunBefores.evaluate(RunBefores.java:28)
	at org.junit.internal.runners.statements.RunAfters.evaluate(RunAfters.java:31)
	at org.junit.runners.BlockJUnit4ClassRunner.runChild(BlockJUnit4ClassRunner.java:76)
	at org.junit.runners.BlockJUnit4ClassRunner.runChild(BlockJUnit4ClassRunner.java:50)
	at org.junit.runners.ParentRunner$3.run(ParentRunner.java:193)
	at org.junit.runners.ParentRunner$1.schedule(ParentRunner.java:52)
	at org.junit.runners.ParentRunner.runChildren(ParentRunner.java:191)
	at org.junit.runners.ParentRunner.access$000(ParentRunner.java:42)
	at org.junit.runners.ParentRunner$2.evaluate(ParentRunner.java:184)
	at org.junit.runners.ParentRunner.run(ParentRunner.java:236)
	at org.apache.maven.surefire.junit4.JUnit4TestSet.execute(JUnit4TestSet.java:59)
	at org.apache.maven.surefire.suite.AbstractDirectoryTestSuite.executeTestSet(AbstractDirectoryTestSuite.java:120)
	at org.apache.maven.surefire.suite.AbstractDirectoryTestSuite.execute(AbstractDirectoryTestSuite.java:103)
	at org.apache.maven.surefire.Surefire.run(Surefire.java:169)
	at sun.reflect.NativeMethodAccessorImpl.invoke0(Native Method)
	at sun.reflect.NativeMethodAccessorImpl.invoke(NativeMethodAccessorImpl.java:39)
	at sun.reflect.DelegatingMethodAccessorImpl.invoke(DelegatingMethodAccessorImpl.java:25)
	at java.lang.reflect.Method.invoke(Method.java:597)
	at org.apache.maven.surefire.booter.SurefireBooter.runSuitesInProcess(SurefireBooter.java:350)
	at org.apache.maven.surefire.booter.SurefireBooter.main(SurefireBooter.java:1021)

    testServerNotFound :
  java.lang.AssertionError
  java.lang.AssertionError: Server not found in Kerberos database expected:<7> but was:<33>
	at org.junit.Assert.fail(Assert.java:91)
	at org.junit.Assert.failNotEquals(Assert.java:645)
	at org.junit.Assert.assertEquals(Assert.java:126)
	at org.junit.Assert.assertEquals(Assert.java:470)
	at org.apache.directory.server.kerberos.protocol.TicketGrantingServiceTest.testServerNotFound(TicketGrantingServiceTest.java:207)
	at sun.reflect.NativeMethodAccessorImpl.invoke0(Native Method)
	at sun.reflect.NativeMethodAccessorImpl.invoke(NativeMethodAccessorImpl.java:39)
	at sun.reflect.DelegatingMethodAccessorImpl.invoke(DelegatingMethodAccessorImpl.java:25)
	at java.lang.reflect.Method.invoke(Method.java:597)
	at org.junit.runners.model.FrameworkMethod$1.runReflectiveCall(FrameworkMethod.java:44)
	at org.junit.internal.runners.model.ReflectiveCallable.run(ReflectiveCallable.java:15)
	at org.junit.runners.model.FrameworkMethod.invokeExplosively(FrameworkMethod.java:41)
	at org.junit.internal.runners.statements.InvokeMethod.evaluate(InvokeMethod.java:20)
	at org.junit.internal.runners.statements.RunBefores.evaluate(RunBefores.java:28)
	at org.junit.internal.runners.statements.RunAfters.evaluate(RunAfters.java:31)
	at org.junit.runners.BlockJUnit4ClassRunner.runChild(BlockJUnit4ClassRunner.java:76)
	at org.junit.runners.BlockJUnit4ClassRunner.runChild(BlockJUnit4ClassRunner.java:50)
	at org.junit.runners.ParentRunner$3.run(ParentRunner.java:193)
	at org.junit.runners.ParentRunner$1.schedule(ParentRunner.java:52)
	at org.junit.runners.ParentRunner.runChildren(ParentRunner.java:191)
	at org.junit.runners.ParentRunner.access$000(ParentRunner.java:42)
	at org.junit.runners.ParentRunner$2.evaluate(ParentRunner.java:184)
	at org.junit.runners.ParentRunner.run(ParentRunner.java:236)
	at org.apache.maven.surefire.junit4.JUnit4TestSet.execute(JUnit4TestSet.java:59)
	at org.apache.maven.surefire.suite.AbstractDirectoryTestSuite.executeTestSet(AbstractDirectoryTestSuite.java:120)
	at org.apache.maven.surefire.suite.AbstractDirectoryTestSuite.execute(AbstractDirectoryTestSuite.java:103)
	at org.apache.maven.surefire.Surefire.run(Surefire.java:169)
	at sun.reflect.NativeMethodAccessorImpl.invoke0(Native Method)
	at sun.reflect.NativeMethodAccessorImpl.invoke(NativeMethodAccessorImpl.java:39)
	at sun.reflect.DelegatingMethodAccessorImpl.invoke(DelegatingMethodAccessorImpl.java:25)
	at java.lang.reflect.Method.invoke(Method.java:597)
	at org.apache.maven.surefire.booter.SurefireBooter.runSuitesInProcess(SurefireBooter.java:350)
	at org.apache.maven.surefire.booter.SurefireBooter.main(SurefireBooter.java:1021)

    testInappropriateChecksum :
  java.lang.AssertionError
  java.lang.AssertionError: Inappropriate type of checksum in message expected:<50> but was:<33>
	at org.junit.Assert.fail(Assert.java:91)
	at org.junit.Assert.failNotEquals(Assert.java:645)
	at org.junit.Assert.assertEquals(Assert.java:126)
	at org.junit.Assert.assertEquals(Assert.java:470)
	at org.apache.directory.server.kerberos.protocol.TicketGrantingServiceTest.testInappropriateChecksum(TicketGrantingServiceTest.java:298)
	at sun.reflect.NativeMethodAccessorImpl.invoke0(Native Method)
	at sun.reflect.NativeMethodAccessorImpl.invoke(NativeMethodAccessorImpl.java:39)
	at sun.reflect.DelegatingMethodAccessorImpl.invoke(DelegatingMethodAccessorImpl.java:25)
	at java.lang.reflect.Method.invoke(Method.java:597)
	at org.junit.runners.model.FrameworkMethod$1.runReflectiveCall(FrameworkMethod.java:44)
	at org.junit.internal.runners.model.ReflectiveCallable.run(ReflectiveCallable.java:15)
	at org.junit.runners.model.FrameworkMethod.invokeExplosively(FrameworkMethod.java:41)
	at org.junit.internal.runners.statements.InvokeMethod.evaluate(InvokeMethod.java:20)
	at org.junit.internal.runners.statements.RunBefores.evaluate(RunBefores.java:28)
	at org.junit.internal.runners.statements.RunAfters.evaluate(RunAfters.java:31)
	at org.junit.runners.BlockJUnit4ClassRunner.runChild(BlockJUnit4ClassRunner.java:76)
	at org.junit.runners.BlockJUnit4ClassRunner.runChild(BlockJUnit4ClassRunner.java:50)
	at org.junit.runners.ParentRunner$3.run(ParentRunner.java:193)
	at org.junit.runners.ParentRunner$1.schedule(ParentRunner.java:52)
	at org.junit.runners.ParentRunner.runChildren(ParentRunner.java:191)
	at org.junit.runners.ParentRunner.access$000(ParentRunner.java:42)
	at org.junit.runners.ParentRunner$2.evaluate(ParentRunner.java:184)
	at org.junit.runners.ParentRunner.run(ParentRunner.java:236)
	at org.apache.maven.surefire.junit4.JUnit4TestSet.execute(JUnit4TestSet.java:59)
	at org.apache.maven.surefire.suite.AbstractDirectoryTestSuite.executeTestSet(AbstractDirectoryTestSuite.java:120)
	at org.apache.maven.surefire.suite.AbstractDirectoryTestSuite.execute(AbstractDirectoryTestSuite.java:103)
	at org.apache.maven.surefire.Surefire.run(Surefire.java:169)
	at sun.reflect.NativeMethodAccessorImpl.invoke0(Native Method)
	at sun.reflect.NativeMethodAccessorImpl.invoke(NativeMethodAccessorImpl.java:39)
	at sun.reflect.DelegatingMethodAccessorImpl.invoke(DelegatingMethodAccessorImpl.java:25)
	at java.lang.reflect.Method.invoke(Method.java:597)
	at org.apache.maven.surefire.booter.SurefireBooter.runSuitesInProcess(SurefireBooter.java:350)
	at org.apache.maven.surefire.booter.SurefireBooter.main(SurefireBooter.java:1021)

    testExpiredTgt :
  java.lang.AssertionError
  java.lang.AssertionError: Ticket expired expected:<32> but was:<33>
	at org.junit.Assert.fail(Assert.java:91)
	at org.junit.Assert.failNotEquals(Assert.java:645)
	at org.junit.Assert.assertEquals(Assert.java:126)
	at org.junit.Assert.assertEquals(Assert.java:470)
	at org.apache.directory.server.kerberos.protocol.TicketGrantingServiceTest.testExpiredTgt(TicketGrantingServiceTest.java:680)
	at sun.reflect.NativeMethodAccessorImpl.invoke0(Native Method)
	at sun.reflect.NativeMethodAccessorImpl.invoke(NativeMethodAccessorImpl.java:39)
	at sun.reflect.DelegatingMethodAccessorImpl.invoke(DelegatingMethodAccessorImpl.java:25)
	at java.lang.reflect.Method.invoke(Method.java:597)
	at org.junit.runners.model.FrameworkMethod$1.runReflectiveCall(FrameworkMethod.java:44)
	at org.junit.internal.runners.model.ReflectiveCallable.run(ReflectiveCallable.java:15)
	at org.junit.runners.model.FrameworkMethod.invokeExplosively(FrameworkMethod.java:41)
	at org.junit.internal.runners.statements.InvokeMethod.evaluate(InvokeMethod.java:20)
	at org.junit.internal.runners.statements.RunBefores.evaluate(RunBefores.java:28)
	at org.junit.internal.runners.statements.RunAfters.evaluate(RunAfters.java:31)
	at org.junit.runners.BlockJUnit4ClassRunner.runChild(BlockJUnit4ClassRunner.java:76)
	at org.junit.runners.BlockJUnit4ClassRunner.runChild(BlockJUnit4ClassRunner.java:50)
	at org.junit.runners.ParentRunner$3.run(ParentRunner.java:193)
	at org.junit.runners.ParentRunner$1.schedule(ParentRunner.java:52)
	at org.junit.runners.ParentRunner.runChildren(ParentRunner.java:191)
	at org.junit.runners.ParentRunner.access$000(ParentRunner.java:42)
	at org.junit.runners.ParentRunner$2.evaluate(ParentRunner.java:184)
	at org.junit.runners.ParentRunner.run(ParentRunner.java:236)
	at org.apache.maven.surefire.junit4.JUnit4TestSet.execute(JUnit4TestSet.java:59)
	at org.apache.maven.surefire.suite.AbstractDirectoryTestSuite.executeTestSet(AbstractDirectoryTestSuite.java:120)
	at org.apache.maven.surefire.suite.AbstractDirectoryTestSuite.execute(AbstractDirectoryTestSuite.java:103)
	at org.apache.maven.surefire.Surefire.run(Surefire.java:169)
	at sun.reflect.NativeMethodAccessorImpl.invoke0(Native Method)
	at sun.reflect.NativeMethodAccessorImpl.invoke(NativeMethodAccessorImpl.java:39)
	at sun.reflect.DelegatingMethodAccessorImpl.invoke(DelegatingMethodAccessorImpl.java:25)
	at java.lang.reflect.Method.invoke(Method.java:597)
	at org.apache.maven.surefire.booter.SurefireBooter.runSuitesInProcess(SurefireBooter.java:350)
	at org.apache.maven.surefire.booter.SurefireBooter.main(SurefireBooter.java:1021)

    testExpiredRenewableTicket :
  java.lang.AssertionError
  java.lang.AssertionError: Ticket expired expected:<32> but was:<33>
	at org.junit.Assert.fail(Assert.java:91)
	at org.junit.Assert.failNotEquals(Assert.java:645)
	at org.junit.Assert.assertEquals(Assert.java:126)
	at org.junit.Assert.assertEquals(Assert.java:470)
	at org.apache.directory.server.kerberos.protocol.TicketGrantingServiceTest.testExpiredRenewableTicket(TicketGrantingServiceTest.java:729)
	at sun.reflect.NativeMethodAccessorImpl.invoke0(Native Method)
	at sun.reflect.NativeMethodAccessorImpl.invoke(NativeMethodAccessorImpl.java:39)
	at sun.reflect.DelegatingMethodAccessorImpl.invoke(DelegatingMethodAccessorImpl.java:25)
	at java.lang.reflect.Method.invoke(Method.java:597)
	at org.junit.runners.model.FrameworkMethod$1.runReflectiveCall(FrameworkMethod.java:44)
	at org.junit.internal.runners.model.ReflectiveCallable.run(ReflectiveCallable.java:15)
	at org.junit.runners.model.FrameworkMethod.invokeExplosively(FrameworkMethod.java:41)
	at org.junit.internal.runners.statements.InvokeMethod.evaluate(InvokeMethod.java:20)
	at org.junit.internal.runners.statements.RunBefores.evaluate(RunBefores.java:28)
	at org.junit.internal.runners.statements.RunAfters.evaluate(RunAfters.java:31)
	at org.junit.runners.BlockJUnit4ClassRunner.runChild(BlockJUnit4ClassRunner.java:76)
	at org.junit.runners.BlockJUnit4ClassRunner.runChild(BlockJUnit4ClassRunner.java:50)
	at org.junit.runners.ParentRunner$3.run(ParentRunner.java:193)
	at org.junit.runners.ParentRunner$1.schedule(ParentRunner.java:52)
	at org.junit.runners.ParentRunner.runChildren(ParentRunner.java:191)
	at org.junit.runners.ParentRunner.access$000(ParentRunner.java:42)
	at org.junit.runners.ParentRunner$2.evaluate(ParentRunner.java:184)
	at org.junit.runners.ParentRunner.run(ParentRunner.java:236)
	at org.apache.maven.surefire.junit4.JUnit4TestSet.execute(JUnit4TestSet.java:59)
	at org.apache.maven.surefire.suite.AbstractDirectoryTestSuite.executeTestSet(AbstractDirectoryTestSuite.java:120)
	at org.apache.maven.surefire.suite.AbstractDirectoryTestSuite.execute(AbstractDirectoryTestSuite.java:103)
	at org.apache.maven.surefire.Surefire.run(Surefire.java:169)
	at sun.reflect.NativeMethodAccessorImpl.invoke0(Native Method)
	at sun.reflect.NativeMethodAccessorImpl.invoke(NativeMethodAccessorImpl.java:39)
	at sun.reflect.DelegatingMethodAccessorImpl.invoke(DelegatingMethodAccessorImpl.java:25)
	at java.lang.reflect.Method.invoke(Method.java:597)
	at org.apache.maven.surefire.booter.SurefireBooter.runSuitesInProcess(SurefireBooter.java:350)
	at org.apache.maven.surefire.booter.SurefireBooter.main(SurefireBooter.java:1021)

    testRenewableTicketNoRenew :
  java.lang.ClassCastException
  java.lang.ClassCastException: org.apache.directory.server.kerberos.shared.messages.ErrorMessage cannot be cast to org.apache.directory.server.kerberos.shared.messages.TicketGrantReply
	at org.apache.directory.server.kerberos.protocol.TicketGrantingServiceTest.testRenewableTicketNoRenew(TicketGrantingServiceTest.java:777)
	at sun.reflect.NativeMethodAccessorImpl.invoke0(Native Method)
	at sun.reflect.NativeMethodAccessorImpl.invoke(NativeMethodAccessorImpl.java:39)
	at sun.reflect.DelegatingMethodAccessorImpl.invoke(DelegatingMethodAccessorImpl.java:25)
	at java.lang.reflect.Method.invoke(Method.java:597)
	at org.junit.runners.model.FrameworkMethod$1.runReflectiveCall(FrameworkMethod.java:44)
	at org.junit.internal.runners.model.ReflectiveCallable.run(ReflectiveCallable.java:15)
	at org.junit.runners.model.FrameworkMethod.invokeExplosively(FrameworkMethod.java:41)
	at org.junit.internal.runners.statements.InvokeMethod.evaluate(InvokeMethod.java:20)
	at org.junit.internal.runners.statements.RunBefores.evaluate(RunBefores.java:28)
	at org.junit.internal.runners.statements.RunAfters.evaluate(RunAfters.java:31)
	at org.junit.runners.BlockJUnit4ClassRunner.runChild(BlockJUnit4ClassRunner.java:76)
	at org.junit.runners.BlockJUnit4ClassRunner.runChild(BlockJUnit4ClassRunner.java:50)
	at org.junit.runners.ParentRunner$3.run(ParentRunner.java:193)
	at org.junit.runners.ParentRunner$1.schedule(ParentRunner.java:52)
	at org.junit.runners.ParentRunner.runChildren(ParentRunner.java:191)
	at org.junit.runners.ParentRunner.access$000(ParentRunner.java:42)
	at org.junit.runners.ParentRunner$2.evaluate(ParentRunner.java:184)
	at org.junit.runners.ParentRunner.run(ParentRunner.java:236)
	at org.apache.maven.surefire.junit4.JUnit4TestSet.execute(JUnit4TestSet.java:59)
	at org.apache.maven.surefire.suite.AbstractDirectoryTestSuite.executeTestSet(AbstractDirectoryTestSuite.java:120)
	at org.apache.maven.surefire.suite.AbstractDirectoryTestSuite.execute(AbstractDirectoryTestSuite.java:103)
	at org.apache.maven.surefire.Surefire.run(Surefire.java:169)
	at sun.reflect.NativeMethodAccessorImpl.invoke0(Native Method)
	at sun.reflect.NativeMethodAccessorImpl.invoke(NativeMethodAccessorImpl.java:39)
	at sun.reflect.DelegatingMethodAccessorImpl.invoke(DelegatingMethodAccessorImpl.java:25)
	at java.lang.reflect.Method.invoke(Method.java:597)
	at org.apache.maven.surefire.booter.SurefireBooter.runSuitesInProcess(SurefireBooter.java:350)
	at org.apache.maven.surefire.booter.SurefireBooter.main(SurefireBooter.java:1021)

    testRenewableTicketRenewal :
  java.lang.ClassCastException
  java.lang.ClassCastException: org.apache.directory.server.kerberos.shared.messages.ErrorMessage cannot be cast to org.apache.directory.server.kerberos.shared.messages.TicketGrantReply
	at org.apache.directory.server.kerberos.protocol.TicketGrantingServiceTest.testRenewableTicketRenewal(TicketGrantingServiceTest.java:829)
	at sun.reflect.NativeMethodAccessorImpl.invoke0(Native Method)
	at sun.reflect.NativeMethodAccessorImpl.invoke(NativeMethodAccessorImpl.java:39)
	at sun.reflect.DelegatingMethodAccessorImpl.invoke(DelegatingMethodAccessorImpl.java:25)
	at java.lang.reflect.Method.invoke(Method.java:597)
	at org.junit.runners.model.FrameworkMethod$1.runReflectiveCall(FrameworkMethod.java:44)
	at org.junit.internal.runners.model.ReflectiveCallable.run(ReflectiveCallable.java:15)
	at org.junit.runners.model.FrameworkMethod.invokeExplosively(FrameworkMethod.java:41)
	at org.junit.internal.runners.statements.InvokeMethod.evaluate(InvokeMethod.java:20)
	at org.junit.internal.runners.statements.RunBefores.evaluate(RunBefores.java:28)
	at org.junit.internal.runners.statements.RunAfters.evaluate(RunAfters.java:31)
	at org.junit.runners.BlockJUnit4ClassRunner.runChild(BlockJUnit4ClassRunner.java:76)
	at org.junit.runners.BlockJUnit4ClassRunner.runChild(BlockJUnit4ClassRunner.java:50)
	at org.junit.runners.ParentRunner$3.run(ParentRunner.java:193)
	at org.junit.runners.ParentRunner$1.schedule(ParentRunner.java:52)
	at org.junit.runners.ParentRunner.runChildren(ParentRunner.java:191)
	at org.junit.runners.ParentRunner.access$000(ParentRunner.java:42)
	at org.junit.runners.ParentRunner$2.evaluate(ParentRunner.java:184)
	at org.junit.runners.ParentRunner.run(ParentRunner.java:236)
	at org.apache.maven.surefire.junit4.JUnit4TestSet.execute(JUnit4TestSet.java:59)
	at org.apache.maven.surefire.suite.AbstractDirectoryTestSuite.executeTestSet(AbstractDirectoryTestSuite.java:120)
	at org.apache.maven.surefire.suite.AbstractDirectoryTestSuite.execute(AbstractDirectoryTestSuite.java:103)
	at org.apache.maven.surefire.Surefire.run(Surefire.java:169)
	at sun.reflect.NativeMethodAccessorImpl.invoke0(Native Method)
	at sun.reflect.NativeMethodAccessorImpl.invoke(NativeMethodAccessorImpl.java:39)
	at sun.reflect.DelegatingMethodAccessorImpl.invoke(DelegatingMethodAccessorImpl.java:25)
	at java.lang.reflect.Method.invoke(Method.java:597)
	at org.apache.maven.surefire.booter.SurefireBooter.runSuitesInProcess(SurefireBooter.java:350)
	at org.apache.maven.surefire.booter.SurefireBooter.main(SurefireBooter.java:1021)

    testServerNullKey :
  java.lang.AssertionError
  java.lang.AssertionError: The client or server has a null key expected:<9> but was:<33>
	at org.junit.Assert.fail(Assert.java:91)
	at org.junit.Assert.failNotEquals(Assert.java:645)
	at org.junit.Assert.assertEquals(Assert.java:126)
	at org.junit.Assert.assertEquals(Assert.java:470)
	at org.apache.directory.server.kerberos.protocol.TicketGrantingServiceTest.testServerNullKey(TicketGrantingServiceTest.java:910)
	at sun.reflect.NativeMethodAccessorImpl.invoke0(Native Method)
	at sun.reflect.NativeMethodAccessorImpl.invoke(NativeMethodAccessorImpl.java:39)
	at sun.reflect.DelegatingMethodAccessorImpl.invoke(DelegatingMethodAccessorImpl.java:25)
	at java.lang.reflect.Method.invoke(Method.java:597)
	at org.junit.runners.model.FrameworkMethod$1.runReflectiveCall(FrameworkMethod.java:44)
	at org.junit.internal.runners.model.ReflectiveCallable.run(ReflectiveCallable.java:15)
	at org.junit.runners.model.FrameworkMethod.invokeExplosively(FrameworkMethod.java:41)
	at org.junit.internal.runners.statements.InvokeMethod.evaluate(InvokeMethod.java:20)
	at org.junit.internal.runners.statements.RunBefores.evaluate(RunBefores.java:28)
	at org.junit.internal.runners.statements.RunAfters.evaluate(RunAfters.java:31)
	at org.junit.runners.BlockJUnit4ClassRunner.runChild(BlockJUnit4ClassRunner.java:76)
	at org.junit.runners.BlockJUnit4ClassRunner.runChild(BlockJUnit4ClassRunner.java:50)
	at org.junit.runners.ParentRunner$3.run(ParentRunner.java:193)
	at org.junit.runners.ParentRunner$1.schedule(ParentRunner.java:52)
	at org.junit.runners.ParentRunner.runChildren(ParentRunner.java:191)
	at org.junit.runners.ParentRunner.access$000(ParentRunner.java:42)
	at org.junit.runners.ParentRunner$2.evaluate(ParentRunner.java:184)
	at org.junit.runners.ParentRunner.run(ParentRunner.java:236)
	at org.apache.maven.surefire.junit4.JUnit4TestSet.execute(JUnit4TestSet.java:59)
	at org.apache.maven.surefire.suite.AbstractDirectoryTestSuite.executeTestSet(AbstractDirectoryTestSuite.java:120)
	at org.apache.maven.surefire.suite.AbstractDirectoryTestSuite.execute(AbstractDirectoryTestSuite.java:103)
	at org.apache.maven.surefire.Surefire.run(Surefire.java:169)
	at sun.reflect.NativeMethodAccessorImpl.invoke0(Native Method)
	at sun.reflect.NativeMethodAccessorImpl.invoke(NativeMethodAccessorImpl.java:39)
	at sun.reflect.DelegatingMethodAccessorImpl.invoke(DelegatingMethodAccessorImpl.java:25)
	at java.lang.reflect.Method.invoke(Method.java:597)
	at org.apache.maven.surefire.booter.SurefireBooter.runSuitesInProcess(SurefireBooter.java:350)
	at org.apache.maven.surefire.booter.SurefireBooter.main(SurefireBooter.java:1021)

    testStartTimeAbsentNoPostdate :
  java.lang.ClassCastException
  java.lang.ClassCastException: org.apache.directory.server.kerberos.shared.messages.ErrorMessage cannot be cast to org.apache.directory.server.kerberos.shared.messages.TicketGrantReply
	at org.apache.directory.server.kerberos.protocol.TicketGrantingServiceTest.testStartTimeAbsentNoPostdate(TicketGrantingServiceTest.java:959)
	at sun.reflect.NativeMethodAccessorImpl.invoke0(Native Method)
	at sun.reflect.NativeMethodAccessorImpl.invoke(NativeMethodAccessorImpl.java:39)
	at sun.reflect.DelegatingMethodAccessorImpl.invoke(DelegatingMethodAccessorImpl.java:25)
	at java.lang.reflect.Method.invoke(Method.java:597)
	at org.junit.runners.model.FrameworkMethod$1.runReflectiveCall(FrameworkMethod.java:44)
	at org.junit.internal.runners.model.ReflectiveCallable.run(ReflectiveCallable.java:15)
	at org.junit.runners.model.FrameworkMethod.invokeExplosively(FrameworkMethod.java:41)
	at org.junit.internal.runners.statements.InvokeMethod.evaluate(InvokeMethod.java:20)
	at org.junit.internal.runners.statements.RunBefores.evaluate(RunBefores.java:28)
	at org.junit.internal.runners.statements.RunAfters.evaluate(RunAfters.java:31)
	at org.junit.runners.BlockJUnit4ClassRunner.runChild(BlockJUnit4ClassRunner.java:76)
	at org.junit.runners.BlockJUnit4ClassRunner.runChild(BlockJUnit4ClassRunner.java:50)
	at org.junit.runners.ParentRunner$3.run(ParentRunner.java:193)
	at org.junit.runners.ParentRunner$1.schedule(ParentRunner.java:52)
	at org.junit.runners.ParentRunner.runChildren(ParentRunner.java:191)
	at org.junit.runners.ParentRunner.access$000(ParentRunner.java:42)
	at org.junit.runners.ParentRunner$2.evaluate(ParentRunner.java:184)
	at org.junit.runners.ParentRunner.run(ParentRunner.java:236)
	at org.apache.maven.surefire.junit4.JUnit4TestSet.execute(JUnit4TestSet.java:59)
	at org.apache.maven.surefire.suite.AbstractDirectoryTestSuite.executeTestSet(AbstractDirectoryTestSuite.java:120)
	at org.apache.maven.surefire.suite.AbstractDirectoryTestSuite.execute(AbstractDirectoryTestSuite.java:103)
	at org.apache.maven.surefire.Surefire.run(Surefire.java:169)
	at sun.reflect.NativeMethodAccessorImpl.invoke0(Native Method)
	at sun.reflect.NativeMethodAccessorImpl.invoke(NativeMethodAccessorImpl.java:39)
	at sun.reflect.DelegatingMethodAccessorImpl.invoke(DelegatingMethodAccessorImpl.java:25)
	at java.lang.reflect.Method.invoke(Method.java:597)
	at org.apache.maven.surefire.booter.SurefireBooter.runSuitesInProcess(SurefireBooter.java:350)
	at org.apache.maven.surefire.booter.SurefireBooter.main(SurefireBooter.java:1021)

    testStartTimeInThePastNoPostdate :
  java.lang.ClassCastException
  java.lang.ClassCastException: org.apache.directory.server.kerberos.shared.messages.ErrorMessage cannot be cast to org.apache.directory.server.kerberos.shared.messages.TicketGrantReply
	at org.apache.directory.server.kerberos.protocol.TicketGrantingServiceTest.testStartTimeInThePastNoPostdate(TicketGrantingServiceTest.java:1016)
	at sun.reflect.NativeMethodAccessorImpl.invoke0(Native Method)
	at sun.reflect.NativeMethodAccessorImpl.invoke(NativeMethodAccessorImpl.java:39)
	at sun.reflect.DelegatingMethodAccessorImpl.invoke(DelegatingMethodAccessorImpl.java:25)
	at java.lang.reflect.Method.invoke(Method.java:597)
	at org.junit.runners.model.FrameworkMethod$1.runReflectiveCall(FrameworkMethod.java:44)
	at org.junit.internal.runners.model.ReflectiveCallable.run(ReflectiveCallable.java:15)
	at org.junit.runners.model.FrameworkMethod.invokeExplosively(FrameworkMethod.java:41)
	at org.junit.internal.runners.statements.InvokeMethod.evaluate(InvokeMethod.java:20)
	at org.junit.internal.runners.statements.RunBefores.evaluate(RunBefores.java:28)
	at org.junit.internal.runners.statements.RunAfters.evaluate(RunAfters.java:31)
	at org.junit.runners.BlockJUnit4ClassRunner.runChild(BlockJUnit4ClassRunner.java:76)
	at org.junit.runners.BlockJUnit4ClassRunner.runChild(BlockJUnit4ClassRunner.java:50)
	at org.junit.runners.ParentRunner$3.run(ParentRunner.java:193)
	at org.junit.runners.ParentRunner$1.schedule(ParentRunner.java:52)
	at org.junit.runners.ParentRunner.runChildren(ParentRunner.java:191)
	at org.junit.runners.ParentRunner.access$000(ParentRunner.java:42)
	at org.junit.runners.ParentRunner$2.evaluate(ParentRunner.java:184)
	at org.junit.runners.ParentRunner.run(ParentRunner.java:236)
	at org.apache.maven.surefire.junit4.JUnit4TestSet.execute(JUnit4TestSet.java:59)
	at org.apache.maven.surefire.suite.AbstractDirectoryTestSuite.executeTestSet(AbstractDirectoryTestSuite.java:120)
	at org.apache.maven.surefire.suite.AbstractDirectoryTestSuite.execute(AbstractDirectoryTestSuite.java:103)
	at org.apache.maven.surefire.Surefire.run(Surefire.java:169)
	at sun.reflect.NativeMethodAccessorImpl.invoke0(Native Method)
	at sun.reflect.NativeMethodAccessorImpl.invoke(NativeMethodAccessorImpl.java:39)
	at sun.reflect.DelegatingMethodAccessorImpl.invoke(DelegatingMethodAccessorImpl.java:25)
	at java.lang.reflect.Method.invoke(Method.java:597)
	at org.apache.maven.surefire.booter.SurefireBooter.runSuitesInProcess(SurefireBooter.java:350)
	at org.apache.maven.surefire.booter.SurefireBooter.main(SurefireBooter.java:1021)

    testStartTimeAcceptableClockSkewNoPostdate :
  java.lang.ClassCastException
  java.lang.ClassCastException: org.apache.directory.server.kerberos.shared.messages.ErrorMessage cannot be cast to org.apache.directory.server.kerberos.shared.messages.TicketGrantReply
	at org.apache.directory.server.kerberos.protocol.TicketGrantingServiceTest.testStartTimeAcceptableClockSkewNoPostdate(TicketGrantingServiceTest.java:1073)
	at sun.reflect.NativeMethodAccessorImpl.invoke0(Native Method)
	at sun.reflect.NativeMethodAccessorImpl.invoke(NativeMethodAccessorImpl.java:39)
	at sun.reflect.DelegatingMethodAccessorImpl.invoke(DelegatingMethodAccessorImpl.java:25)
	at java.lang.reflect.Method.invoke(Method.java:597)
	at org.junit.runners.model.FrameworkMethod$1.runReflectiveCall(FrameworkMethod.java:44)
	at org.junit.internal.runners.model.ReflectiveCallable.run(ReflectiveCallable.java:15)
	at org.junit.runners.model.FrameworkMethod.invokeExplosively(FrameworkMethod.java:41)
	at org.junit.internal.runners.statements.InvokeMethod.evaluate(InvokeMethod.java:20)
	at org.junit.internal.runners.statements.RunBefores.evaluate(RunBefores.java:28)
	at org.junit.internal.runners.statements.RunAfters.evaluate(RunAfters.java:31)
	at org.junit.runners.BlockJUnit4ClassRunner.runChild(BlockJUnit4ClassRunner.java:76)
	at org.junit.runners.BlockJUnit4ClassRunner.runChild(BlockJUnit4ClassRunner.java:50)
	at org.junit.runners.ParentRunner$3.run(ParentRunner.java:193)
	at org.junit.runners.ParentRunner$1.schedule(ParentRunner.java:52)
	at org.junit.runners.ParentRunner.runChildren(ParentRunner.java:191)
	at org.junit.runners.ParentRunner.access$000(ParentRunner.java:42)
	at org.junit.runners.ParentRunner$2.evaluate(ParentRunner.java:184)
	at org.junit.runners.ParentRunner.run(ParentRunner.java:236)
	at org.apache.maven.surefire.junit4.JUnit4TestSet.execute(JUnit4TestSet.java:59)
	at org.apache.maven.surefire.suite.AbstractDirectoryTestSuite.executeTestSet(AbstractDirectoryTestSuite.java:120)
	at org.apache.maven.surefire.suite.AbstractDirectoryTestSuite.execute(AbstractDirectoryTestSuite.java:103)
	at org.apache.maven.surefire.Surefire.run(Surefire.java:169)
	at sun.reflect.NativeMethodAccessorImpl.invoke0(Native Method)
	at sun.reflect.NativeMethodAccessorImpl.invoke(NativeMethodAccessorImpl.java:39)
	at sun.reflect.DelegatingMethodAccessorImpl.invoke(DelegatingMethodAccessorImpl.java:25)
	at java.lang.reflect.Method.invoke(Method.java:597)
	at org.apache.maven.surefire.booter.SurefireBooter.runSuitesInProcess(SurefireBooter.java:350)
	at org.apache.maven.surefire.booter.SurefireBooter.main(SurefireBooter.java:1021)

    testStartTimeOrderNeverValid :
  java.lang.AssertionError
  java.lang.AssertionError: Requested start time is later than end time expected:<11> but was:<33>
	at org.junit.Assert.fail(Assert.java:91)
	at org.junit.Assert.failNotEquals(Assert.java:645)
	at org.junit.Assert.assertEquals(Assert.java:126)
	at org.junit.Assert.assertEquals(Assert.java:470)
	at org.apache.directory.server.kerberos.protocol.TicketGrantingServiceTest.testStartTimeOrderNeverValid(TicketGrantingServiceTest.java:1132)
	at sun.reflect.NativeMethodAccessorImpl.invoke0(Native Method)
	at sun.reflect.NativeMethodAccessorImpl.invoke(NativeMethodAccessorImpl.java:39)
	at sun.reflect.DelegatingMethodAccessorImpl.invoke(DelegatingMethodAccessorImpl.java:25)
	at java.lang.reflect.Method.invoke(Method.java:597)
	at org.junit.runners.model.FrameworkMethod$1.runReflectiveCall(FrameworkMethod.java:44)
	at org.junit.internal.runners.model.ReflectiveCallable.run(ReflectiveCallable.java:15)
	at org.junit.runners.model.FrameworkMethod.invokeExplosively(FrameworkMethod.java:41)
	at org.junit.internal.runners.statements.InvokeMethod.evaluate(InvokeMethod.java:20)
	at org.junit.internal.runners.statements.RunBefores.evaluate(RunBefores.java:28)
	at org.junit.internal.runners.statements.RunAfters.evaluate(RunAfters.java:31)
	at org.junit.runners.BlockJUnit4ClassRunner.runChild(BlockJUnit4ClassRunner.java:76)
	at org.junit.runners.BlockJUnit4ClassRunner.runChild(BlockJUnit4ClassRunner.java:50)
	at org.junit.runners.ParentRunner$3.run(ParentRunner.java:193)
	at org.junit.runners.ParentRunner$1.schedule(ParentRunner.java:52)
	at org.junit.runners.ParentRunner.runChildren(ParentRunner.java:191)
	at org.junit.runners.ParentRunner.access$000(ParentRunner.java:42)
	at org.junit.runners.ParentRunner$2.evaluate(ParentRunner.java:184)
	at org.junit.runners.ParentRunner.run(ParentRunner.java:236)
	at org.apache.maven.surefire.junit4.JUnit4TestSet.execute(JUnit4TestSet.java:59)
	at org.apache.maven.surefire.suite.AbstractDirectoryTestSuite.executeTestSet(AbstractDirectoryTestSuite.java:120)
	at org.apache.maven.surefire.suite.AbstractDirectoryTestSuite.execute(AbstractDirectoryTestSuite.java:103)
	at org.apache.maven.surefire.Surefire.run(Surefire.java:169)
	at sun.reflect.NativeMethodAccessorImpl.invoke0(Native Method)
	at sun.reflect.NativeMethodAccessorImpl.invoke(NativeMethodAccessorImpl.java:39)
	at sun.reflect.DelegatingMethodAccessorImpl.invoke(DelegatingMethodAccessorImpl.java:25)
	at java.lang.reflect.Method.invoke(Method.java:597)
	at org.apache.maven.surefire.booter.SurefireBooter.runSuitesInProcess(SurefireBooter.java:350)
	at org.apache.maven.surefire.booter.SurefireBooter.main(SurefireBooter.java:1021)

    testStartTimeMinimumNeverValid :
  java.lang.AssertionError
  java.lang.AssertionError: Requested start time is later than end time expected:<11> but was:<33>
	at org.junit.Assert.fail(Assert.java:91)
	at org.junit.Assert.failNotEquals(Assert.java:645)
	at org.junit.Assert.assertEquals(Assert.java:126)
	at org.junit.Assert.assertEquals(Assert.java:470)
	at org.apache.directory.server.kerberos.protocol.TicketGrantingServiceTest.testStartTimeMinimumNeverValid(TicketGrantingServiceTest.java:1186)
	at sun.reflect.NativeMethodAccessorImpl.invoke0(Native Method)
	at sun.reflect.NativeMethodAccessorImpl.invoke(NativeMethodAccessorImpl.java:39)
	at sun.reflect.DelegatingMethodAccessorImpl.invoke(DelegatingMethodAccessorImpl.java:25)
	at java.lang.reflect.Method.invoke(Method.java:597)
	at org.junit.runners.model.FrameworkMethod$1.runReflectiveCall(FrameworkMethod.java:44)
	at org.junit.internal.runners.model.ReflectiveCallable.run(ReflectiveCallable.java:15)
	at org.junit.runners.model.FrameworkMethod.invokeExplosively(FrameworkMethod.java:41)
	at org.junit.internal.runners.statements.InvokeMethod.evaluate(InvokeMethod.java:20)
	at org.junit.internal.runners.statements.RunBefores.evaluate(RunBefores.java:28)
	at org.junit.internal.runners.statements.RunAfters.evaluate(RunAfters.java:31)
	at org.junit.runners.BlockJUnit4ClassRunner.runChild(BlockJUnit4ClassRunner.java:76)
	at org.junit.runners.BlockJUnit4ClassRunner.runChild(BlockJUnit4ClassRunner.java:50)
	at org.junit.runners.ParentRunner$3.run(ParentRunner.java:193)
	at org.junit.runners.ParentRunner$1.schedule(ParentRunner.java:52)
	at org.junit.runners.ParentRunner.runChildren(ParentRunner.java:191)
	at org.junit.runners.ParentRunner.access$000(ParentRunner.java:42)
	at org.junit.runners.ParentRunner$2.evaluate(ParentRunner.java:184)
	at org.junit.runners.ParentRunner.run(ParentRunner.java:236)
	at org.apache.maven.surefire.junit4.JUnit4TestSet.execute(JUnit4TestSet.java:59)
	at org.apache.maven.surefire.suite.AbstractDirectoryTestSuite.executeTestSet(AbstractDirectoryTestSuite.java:120)
	at org.apache.maven.surefire.suite.AbstractDirectoryTestSuite.execute(AbstractDirectoryTestSuite.java:103)
	at org.apache.maven.surefire.Surefire.run(Surefire.java:169)
	at sun.reflect.NativeMethodAccessorImpl.invoke0(Native Method)
	at sun.reflect.NativeMethodAccessorImpl.invoke(NativeMethodAccessorImpl.java:39)
	at sun.reflect.DelegatingMethodAccessorImpl.invoke(DelegatingMethodAccessorImpl.java:25)
	at java.lang.reflect.Method.invoke(Method.java:597)
	at org.apache.maven.surefire.booter.SurefireBooter.runSuitesInProcess(SurefireBooter.java:350)
	at org.apache.maven.surefire.booter.SurefireBooter.main(SurefireBooter.java:1021)

    testStartTimeNoPostdated :
  java.lang.AssertionError
  java.lang.AssertionError: Ticket not eligible for postdating expected:<10> but was:<33>
	at org.junit.Assert.fail(Assert.java:91)
	at org.junit.Assert.failNotEquals(Assert.java:645)
	at org.junit.Assert.assertEquals(Assert.java:126)
	at org.junit.Assert.assertEquals(Assert.java:470)
	at org.apache.directory.server.kerberos.protocol.TicketGrantingServiceTest.testStartTimeNoPostdated(TicketGrantingServiceTest.java:1238)
	at sun.reflect.NativeMethodAccessorImpl.invoke0(Native Method)
	at sun.reflect.NativeMethodAccessorImpl.invoke(NativeMethodAccessorImpl.java:39)
	at sun.reflect.DelegatingMethodAccessorImpl.invoke(DelegatingMethodAccessorImpl.java:25)
	at java.lang.reflect.Method.invoke(Method.java:597)
	at org.junit.runners.model.FrameworkMethod$1.runReflectiveCall(FrameworkMethod.java:44)
	at org.junit.internal.runners.model.ReflectiveCallable.run(ReflectiveCallable.java:15)
	at org.junit.runners.model.FrameworkMethod.invokeExplosively(FrameworkMethod.java:41)
	at org.junit.internal.runners.statements.InvokeMethod.evaluate(InvokeMethod.java:20)
	at org.junit.internal.runners.statements.RunBefores.evaluate(RunBefores.java:28)
	at org.junit.internal.runners.statements.RunAfters.evaluate(RunAfters.java:31)
	at org.junit.runners.BlockJUnit4ClassRunner.runChild(BlockJUnit4ClassRunner.java:76)
	at org.junit.runners.BlockJUnit4ClassRunner.runChild(BlockJUnit4ClassRunner.java:50)
	at org.junit.runners.ParentRunner$3.run(ParentRunner.java:193)
	at org.junit.runners.ParentRunner$1.schedule(ParentRunner.java:52)
	at org.junit.runners.ParentRunner.runChildren(ParentRunner.java:191)
	at org.junit.runners.ParentRunner.access$000(ParentRunner.java:42)
	at org.junit.runners.ParentRunner$2.evaluate(ParentRunner.java:184)
	at org.junit.runners.ParentRunner.run(ParentRunner.java:236)
	at org.apache.maven.surefire.junit4.JUnit4TestSet.execute(JUnit4TestSet.java:59)
	at org.apache.maven.surefire.suite.AbstractDirectoryTestSuite.executeTestSet(AbstractDirectoryTestSuite.java:120)
	at org.apache.maven.surefire.suite.AbstractDirectoryTestSuite.execute(AbstractDirectoryTestSuite.java:103)
	at org.apache.maven.surefire.Surefire.run(Surefire.java:169)
	at sun.reflect.NativeMethodAccessorImpl.invoke0(Native Method)
	at sun.reflect.NativeMethodAccessorImpl.invoke(NativeMethodAccessorImpl.java:39)
	at sun.reflect.DelegatingMethodAccessorImpl.invoke(DelegatingMethodAccessorImpl.java:25)
	at java.lang.reflect.Method.invoke(Method.java:597)
	at org.apache.maven.surefire.booter.SurefireBooter.runSuitesInProcess(SurefireBooter.java:350)
	at org.apache.maven.surefire.booter.SurefireBooter.main(SurefireBooter.java:1021)

    testSpecificStartTime :
  java.lang.ClassCastException
  java.lang.ClassCastException: org.apache.directory.server.kerberos.shared.messages.ErrorMessage cannot be cast to org.apache.directory.server.kerberos.shared.messages.TicketGrantReply
	at org.apache.directory.server.kerberos.protocol.TicketGrantingServiceTest.testSpecificStartTime(TicketGrantingServiceTest.java:1303)
	at sun.reflect.NativeMethodAccessorImpl.invoke0(Native Method)
	at sun.reflect.NativeMethodAccessorImpl.invoke(NativeMethodAccessorImpl.java:39)
	at sun.reflect.DelegatingMethodAccessorImpl.invoke(DelegatingMethodAccessorImpl.java:25)
	at java.lang.reflect.Method.invoke(Method.java:597)
	at org.junit.runners.model.FrameworkMethod$1.runReflectiveCall(FrameworkMethod.java:44)
	at org.junit.internal.runners.model.ReflectiveCallable.run(ReflectiveCallable.java:15)
	at org.junit.runners.model.FrameworkMethod.invokeExplosively(FrameworkMethod.java:41)
	at org.junit.internal.runners.statements.InvokeMethod.evaluate(InvokeMethod.java:20)
	at org.junit.internal.runners.statements.RunBefores.evaluate(RunBefores.java:28)
	at org.junit.internal.runners.statements.RunAfters.evaluate(RunAfters.java:31)
	at org.junit.runners.BlockJUnit4ClassRunner.runChild(BlockJUnit4ClassRunner.java:76)
	at org.junit.runners.BlockJUnit4ClassRunner.runChild(BlockJUnit4ClassRunner.java:50)
	at org.junit.runners.ParentRunner$3.run(ParentRunner.java:193)	at org.junit.runners.ParentRunner$1.schedule(ParentRunner.java:52)
	at org.junit.runners.ParentRunner.runChildren(ParentRunner.java:191)
	at org.junit.runners.ParentRunner.access$000(ParentRunner.java:42)
	at org.junit.runners.ParentRunner$2.evaluate(ParentRunner.java:184)
	at org.junit.runners.ParentRunner.run(ParentRunner.java:236)
	at org.apache.maven.surefire.junit4.JUnit4TestSet.execute(JUnit4TestSet.java:59)
	at org.apache.maven.surefire.suite.AbstractDirectoryTestSuite.executeTestSet(AbstractDirectoryTestSuite.java:120)
	at org.apache.maven.surefire.suite.AbstractDirectoryTestSuite.execute(AbstractDirectoryTestSuite.java:103)
	at org.apache.maven.surefire.Surefire.run(Surefire.java:169)
	at sun.reflect.NativeMethodAccessorImpl.invoke0(Native Method)
	at sun.reflect.NativeMethodAccessorImpl.invoke(NativeMethodAccessorImpl.java:39)
	at sun.reflect.DelegatingMethodAccessorImpl.invoke(DelegatingMethodAccessorImpl.java:25)
	at java.lang.reflect.Method.invoke(Method.java:597)
	at org.apache.maven.surefire.booter.SurefireBooter.runSuitesInProcess(SurefireBooter.java:350)
	at org.apache.maven.surefire.booter.SurefireBooter.main(SurefireBooter.java:1021)

    testPreAuthenticationFlag :
  java.lang.ClassCastException
  java.lang.ClassCastException: org.apache.directory.server.kerberos.shared.messages.ErrorMessage cannot be cast to org.apache.directory.server.kerberos.shared.messages.TicketGrantReply
	at org.apache.directory.server.kerberos.protocol.TicketGrantingServiceTest.testPreAuthenticationFlag(TicketGrantingServiceTest.java:1358)
	at sun.reflect.NativeMethodAccessorImpl.invoke0(Native Method)
	at sun.reflect.NativeMethodAccessorImpl.invoke(NativeMethodAccessorImpl.java:39)
	at sun.reflect.DelegatingMethodAccessorImpl.invoke(DelegatingMethodAccessorImpl.java:25)
	at java.lang.reflect.Method.invoke(Method.java:597)
	at org.junit.runners.model.FrameworkMethod$1.runReflectiveCall(FrameworkMethod.java:44)
	at org.junit.internal.runners.model.ReflectiveCallable.run(ReflectiveCallable.java:15)
	at org.junit.runners.model.FrameworkMethod.invokeExplosively(FrameworkMethod.java:41)
	at org.junit.internal.runners.statements.InvokeMethod.evaluate(InvokeMethod.java:20)
	at org.junit.internal.runners.statements.RunBefores.evaluate(RunBefores.java:28)
	at org.junit.internal.runners.statements.RunAfters.evaluate(RunAfters.java:31)
	at org.junit.runners.BlockJUnit4ClassRunner.runChild(BlockJUnit4ClassRunner.java:76)
	at org.junit.runners.BlockJUnit4ClassRunner.runChild(BlockJUnit4ClassRunner.java:50)
	at org.junit.runners.ParentRunner$3.run(ParentRunner.java:193)
	at org.junit.runners.ParentRunner$1.schedule(ParentRunner.java:52)
	at org.junit.runners.ParentRunner.runChildren(ParentRunner.java:191)
	at org.junit.runners.ParentRunner.access$000(ParentRunner.java:42)
	at org.junit.runners.ParentRunner$2.evaluate(ParentRunner.java:184)
	at org.junit.runners.ParentRunner.run(ParentRunner.java:236)
	at org.apache.maven.surefire.junit4.JUnit4TestSet.execute(JUnit4TestSet.java:59)
	at org.apache.maven.surefire.suite.AbstractDirectoryTestSuite.executeTestSet(AbstractDirectoryTestSuite.java:120)
	at org.apache.maven.surefire.suite.AbstractDirectoryTestSuite.execute(AbstractDirectoryTestSuite.java:103)
	at org.apache.maven.surefire.Surefire.run(Surefire.java:169)
	at sun.reflect.NativeMethodAccessorImpl.invoke0(Native Method)
	at sun.reflect.NativeMethodAccessorImpl.invoke(NativeMethodAccessorImpl.java:39)
	at sun.reflect.DelegatingMethodAccessorImpl.invoke(DelegatingMethodAccessorImpl.java:25)
	at java.lang.reflect.Method.invoke(Method.java:597)
	at org.apache.maven.surefire.booter.SurefireBooter.runSuitesInProcess(SurefireBooter.java:350)
	at org.apache.maven.surefire.booter.SurefireBooter.main(SurefireBooter.java:1021)

    testSpecificEndTime :
  java.lang.ClassCastException
  java.lang.ClassCastException: org.apache.directory.server.kerberos.shared.messages.ErrorMessage cannot be cast to org.apache.directory.server.kerberos.shared.messages.TicketGrantReply
	at org.apache.directory.server.kerberos.protocol.TicketGrantingServiceTest.testSpecificEndTime(TicketGrantingServiceTest.java:1408)
	at sun.reflect.NativeMethodAccessorImpl.invoke0(Native Method)
	at sun.reflect.NativeMethodAccessorImpl.invoke(NativeMethodAccessorImpl.java:39)
	at sun.reflect.DelegatingMethodAccessorImpl.invoke(DelegatingMethodAccessorImpl.java:25)
	at java.lang.reflect.Method.invoke(Method.java:597)
	at org.junit.runners.model.FrameworkMethod$1.runReflectiveCall(FrameworkMethod.java:44)
	at org.junit.internal.runners.model.ReflectiveCallable.run(ReflectiveCallable.java:15)
	at org.junit.runners.model.FrameworkMethod.invokeExplosively(FrameworkMethod.java:41)
	at org.junit.internal.runners.statements.InvokeMethod.evaluate(InvokeMethod.java:20)
	at org.junit.internal.runners.statements.RunBefores.evaluate(RunBefores.java:28)
	at org.junit.internal.runners.statements.RunAfters.evaluate(RunAfters.java:31)
	at org.junit.runners.BlockJUnit4ClassRunner.runChild(BlockJUnit4ClassRunner.java:76)
	at org.junit.runners.BlockJUnit4ClassRunner.runChild(BlockJUnit4ClassRunner.java:50)
	at org.junit.runners.ParentRunner$3.run(ParentRunner.java:193)
	at org.junit.runners.ParentRunner$1.schedule(ParentRunner.java:52)
	at org.junit.runners.ParentRunner.runChildren(ParentRunner.java:191)
	at org.junit.runners.ParentRunner.access$000(ParentRunner.java:42)
	at org.junit.runners.ParentRunner$2.evaluate(ParentRunner.java:184)
	at org.junit.runners.ParentRunner.run(ParentRunner.java:236)
	at org.apache.maven.surefire.junit4.JUnit4TestSet.execute(JUnit4TestSet.java:59)
	at org.apache.maven.surefire.suite.AbstractDirectoryTestSuite.executeTestSet(AbstractDirectoryTestSuite.java:120)
	at org.apache.maven.surefire.suite.AbstractDirectoryTestSuite.execute(AbstractDirectoryTestSuite.java:103)
	at org.apache.maven.surefire.Surefire.run(Surefire.java:169)
	at sun.reflect.NativeMethodAccessorImpl.invoke0(Native Method)
	at sun.reflect.NativeMethodAccessorImpl.invoke(NativeMethodAccessorImpl.java:39)
	at sun.reflect.DelegatingMethodAccessorImpl.invoke(DelegatingMethodAccessorImpl.java:25)
	at java.lang.reflect.Method.invoke(Method.java:597)
	at org.apache.maven.surefire.booter.SurefireBooter.runSuitesInProcess(SurefireBooter.java:350)
	at org.apache.maven.surefire.booter.SurefireBooter.main(SurefireBooter.java:1021)

    testEndTimeExceedsMaximumAllowable :
  java.lang.ClassCastException
  java.lang.ClassCastException: org.apache.directory.server.kerberos.shared.messages.ErrorMessage cannot be cast to org.apache.directory.server.kerberos.shared.messages.TicketGrantReply
	at org.apache.directory.server.kerberos.protocol.TicketGrantingServiceTest.testEndTimeExceedsMaximumAllowable(TicketGrantingServiceTest.java:1459)
	at sun.reflect.NativeMethodAccessorImpl.invoke0(Native Method)
	at sun.reflect.NativeMethodAccessorImpl.invoke(NativeMethodAccessorImpl.java:39)
	at sun.reflect.DelegatingMethodAccessorImpl.invoke(DelegatingMethodAccessorImpl.java:25)
	at java.lang.reflect.Method.invoke(Method.java:597)
	at org.junit.runners.model.FrameworkMethod$1.runReflectiveCall(FrameworkMethod.java:44)
	at org.junit.internal.runners.model.ReflectiveCallable.run(ReflectiveCallable.java:15)
	at org.junit.runners.model.FrameworkMethod.invokeExplosively(FrameworkMethod.java:41)
	at org.junit.internal.runners.statements.InvokeMethod.evaluate(InvokeMethod.java:20)
	at org.junit.internal.runners.statements.RunBefores.evaluate(RunBefores.java:28)
	at org.junit.internal.runners.statements.RunAfters.evaluate(RunAfters.java:31)
	at org.junit.runners.BlockJUnit4ClassRunner.runChild(BlockJUnit4ClassRunner.java:76)
	at org.junit.runners.BlockJUnit4ClassRunner.runChild(BlockJUnit4ClassRunner.java:50)
	at org.junit.runners.ParentRunner$3.run(ParentRunner.java:193)
	at org.junit.runners.ParentRunner$1.schedule(ParentRunner.java:52)
	at org.junit.runners.ParentRunner.runChildren(ParentRunner.java:191)
	at org.junit.runners.ParentRunner.access$000(ParentRunner.java:42)
	at org.junit.runners.ParentRunner$2.evaluate(ParentRunner.java:184)
	at org.junit.runners.ParentRunner.run(ParentRunner.java:236)
	at org.apache.maven.surefire.junit4.JUnit4TestSet.execute(JUnit4TestSet.java:59)
	at org.apache.maven.surefire.suite.AbstractDirectoryTestSuite.executeTestSet(AbstractDirectoryTestSuite.java:120)
	at org.apache.maven.surefire.suite.AbstractDirectoryTestSuite.execute(AbstractDirectoryTestSuite.java:103)
	at org.apache.maven.surefire.Surefire.run(Surefire.java:169)
	at sun.reflect.NativeMethodAccessorImpl.invoke0(Native Method)
	at sun.reflect.NativeMethodAccessorImpl.invoke(NativeMethodAccessorImpl.java:39)
	at sun.reflect.DelegatingMethodAccessorImpl.invoke(DelegatingMethodAccessorImpl.java:25)
	at java.lang.reflect.Method.invoke(Method.java:597)
	at org.apache.maven.surefire.booter.SurefireBooter.runSuitesInProcess(SurefireBooter.java:350)
	at org.apache.maven.surefire.booter.SurefireBooter.main(SurefireBooter.java:1021)

    testEpochEndTime :
  java.lang.ClassCastException
  java.lang.ClassCastException: org.apache.directory.server.kerberos.shared.messages.ErrorMessage cannot be cast to org.apache.directory.server.kerberos.shared.messages.TicketGrantReply
	at org.apache.directory.server.kerberos.protocol.TicketGrantingServiceTest.testEpochEndTime(TicketGrantingServiceTest.java:1507)
	at sun.reflect.NativeMethodAccessorImpl.invoke0(Native Method)
	at sun.reflect.NativeMethodAccessorImpl.invoke(NativeMethodAccessorImpl.java:39)
	at sun.reflect.DelegatingMethodAccessorImpl.invoke(DelegatingMethodAccessorImpl.java:25)
	at java.lang.reflect.Method.invoke(Method.java:597)
	at org.junit.runners.model.FrameworkMethod$1.runReflectiveCall(FrameworkMethod.java:44)
	at org.junit.internal.runners.model.ReflectiveCallable.run(ReflectiveCallable.java:15)
	at org.junit.runners.model.FrameworkMethod.invokeExplosively(FrameworkMethod.java:41)
	at org.junit.internal.runners.statements.InvokeMethod.evaluate(InvokeMethod.java:20)
	at org.junit.internal.runners.statements.RunBefores.evaluate(RunBefores.java:28)
	at org.junit.internal.runners.statements.RunAfters.evaluate(RunAfters.java:31)
	at org.junit.runners.BlockJUnit4ClassRunner.runChild(BlockJUnit4ClassRunner.java:76)
	at org.junit.runners.BlockJUnit4ClassRunner.runChild(BlockJUnit4ClassRunner.java:50)
	at org.junit.runners.ParentRunner$3.run(ParentRunner.java:193)
	at org.junit.runners.ParentRunner$1.schedule(ParentRunner.java:52)
	at org.junit.runners.ParentRunner.runChildren(ParentRunner.java:191)
	at org.junit.runners.ParentRunner.access$000(ParentRunner.java:42)
	at org.junit.runners.ParentRunner$2.evaluate(ParentRunner.java:184)
	at org.junit.runners.ParentRunner.run(ParentRunner.java:236)
	at org.apache.maven.surefire.junit4.JUnit4TestSet.execute(JUnit4TestSet.java:59)
	at org.apache.maven.surefire.suite.AbstractDirectoryTestSuite.executeTestSet(AbstractDirectoryTestSuite.java:120)
	at org.apache.maven.surefire.suite.AbstractDirectoryTestSuite.execute(AbstractDirectoryTestSuite.java:103)
	at org.apache.maven.surefire.Surefire.run(Surefire.java:169)
	at sun.reflect.NativeMethodAccessorImpl.invoke0(Native Method)
	at sun.reflect.NativeMethodAccessorImpl.invoke(NativeMethodAccessorImpl.java:39)
	at sun.reflect.DelegatingMethodAccessorImpl.invoke(DelegatingMethodAccessorImpl.java:25)
	at java.lang.reflect.Method.invoke(Method.java:597)
	at org.apache.maven.surefire.booter.SurefireBooter.runSuitesInProcess(SurefireBooter.java:350)
	at org.apache.maven.surefire.booter.SurefireBooter.main(SurefireBooter.java:1021)

    testRenewableTicketExceedsMaximumAllowable :
  java.lang.ClassCastException
  java.lang.ClassCastException: org.apache.directory.server.kerberos.shared.messages.ErrorMessage cannot be cast to org.apache.directory.server.kerberos.shared.messages.TicketGrantReply
	at org.apache.directory.server.kerberos.protocol.TicketGrantingServiceTest.testRenewableTicketExceedsMaximumAllowable(TicketGrantingServiceTest.java:1860)
	at sun.reflect.NativeMethodAccessorImpl.invoke0(Native Method)
	at sun.reflect.NativeMethodAccessorImpl.invoke(NativeMethodAccessorImpl.java:39)
	at sun.reflect.DelegatingMethodAccessorImpl.invoke(DelegatingMethodAccessorImpl.java:25)
	at java.lang.reflect.Method.invoke(Method.java:597)
	at org.junit.runners.model.FrameworkMethod$1.runReflectiveCall(FrameworkMethod.java:44)
	at org.junit.internal.runners.model.ReflectiveCallable.run(ReflectiveCallable.java:15)
	at org.junit.runners.model.FrameworkMethod.invokeExplosively(FrameworkMethod.java:41)
	at org.junit.internal.runners.statements.InvokeMethod.evaluate(InvokeMethod.java:20)
	at org.junit.internal.runners.statements.RunBefores.evaluate(RunBefores.java:28)
	at org.junit.internal.runners.statements.RunAfters.evaluate(RunAfters.java:31)
	at org.junit.runners.BlockJUnit4ClassRunner.runChild(BlockJUnit4ClassRunner.java:76)
	at org.junit.runners.BlockJUnit4ClassRunner.runChild(BlockJUnit4ClassRunner.java:50)
	at org.junit.runners.ParentRunner$3.run(ParentRunner.java:193)
	at org.junit.runners.ParentRunner$1.schedule(ParentRunner.java:52)
	at org.junit.runners.ParentRunner.runChildren(ParentRunner.java:191)
	at org.junit.runners.ParentRunner.access$000(ParentRunner.java:42)
	at org.junit.runners.ParentRunner$2.evaluate(ParentRunner.java:184)
	at org.junit.runners.ParentRunner.run(ParentRunner.java:236)
	at org.apache.maven.surefire.junit4.JUnit4TestSet.execute(JUnit4TestSet.java:59)
	at org.apache.maven.surefire.suite.AbstractDirectoryTestSuite.executeTestSet(AbstractDirectoryTestSuite.java:120)
	at org.apache.maven.surefire.suite.AbstractDirectoryTestSuite.execute(AbstractDirectoryTestSuite.java:103)
	at org.apache.maven.surefire.Surefire.run(Surefire.java:169)
	at sun.reflect.NativeMethodAccessorImpl.invoke0(Native Method)
	at sun.reflect.NativeMethodAccessorImpl.invoke(NativeMethodAccessorImpl.java:39)
	at sun.reflect.DelegatingMethodAccessorImpl.invoke(DelegatingMethodAccessorImpl.java:25)
	at java.lang.reflect.Method.invoke(Method.java:597)
	at org.apache.maven.surefire.booter.SurefireBooter.runSuitesInProcess(SurefireBooter.java:350)
	at org.apache.maven.surefire.booter.SurefireBooter.main(SurefireBooter.java:1021)

    testAuthenticatorSubKey :
  java.lang.ClassCastException
  java.lang.ClassCastException: org.apache.directory.server.kerberos.shared.messages.ErrorMessage cannot be cast to org.apache.directory.server.kerberos.shared.messages.TicketGrantReply
	at org.apache.directory.server.kerberos.protocol.TicketGrantingServiceTest.testAuthenticatorSubKey(TicketGrantingServiceTest.java:1917)
	at sun.reflect.NativeMethodAccessorImpl.invoke0(Native Method)
	at sun.reflect.NativeMethodAccessorImpl.invoke(NativeMethodAccessorImpl.java:39)
	at sun.reflect.DelegatingMethodAccessorImpl.invoke(DelegatingMethodAccessorImpl.java:25)
	at java.lang.reflect.Method.invoke(Method.java:597)
	at org.junit.runners.model.FrameworkMethod$1.runReflectiveCall(FrameworkMethod.java:44)
	at org.junit.internal.runners.model.ReflectiveCallable.run(ReflectiveCallable.java:15)
	at org.junit.runners.model.FrameworkMethod.invokeExplosively(FrameworkMethod.java:41)
	at org.junit.internal.runners.statements.InvokeMethod.evaluate(InvokeMethod.java:20)
	at org.junit.internal.runners.statements.RunBefores.evaluate(RunBefores.java:28)
	at org.junit.internal.runners.statements.RunAfters.evaluate(RunAfters.java:31)
	at org.junit.runners.BlockJUnit4ClassRunner.runChild(BlockJUnit4ClassRunner.java:76)
	at org.junit.runners.BlockJUnit4ClassRunner.runChild(BlockJUnit4ClassRunner.java:50)
	at org.junit.runners.ParentRunner$3.run(ParentRunner.java:193)
	at org.junit.runners.ParentRunner$1.schedule(ParentRunner.java:52)
	at org.junit.runners.ParentRunner.runChildren(ParentRunner.java:191)
	at org.junit.runners.ParentRunner.access$000(ParentRunner.java:42)
	at org.junit.runners.ParentRunner$2.evaluate(ParentRunner.java:184)
	at org.junit.runners.ParentRunner.run(ParentRunner.java:236)
	at org.apache.maven.surefire.junit4.JUnit4TestSet.execute(JUnit4TestSet.java:59)
	at org.apache.maven.surefire.suite.AbstractDirectoryTestSuite.executeTestSet(AbstractDirectoryTestSuite.java:120)
	at org.apache.maven.surefire.suite.AbstractDirectoryTestSuite.execute(AbstractDirectoryTestSuite.java:103)
	at org.apache.maven.surefire.Surefire.run(Surefire.java:169)
	at sun.reflect.NativeMethodAccessorImpl.invoke0(Native Method)
	at sun.reflect.NativeMethodAccessorImpl.invoke(NativeMethodAccessorImpl.java:39)
	at sun.reflect.DelegatingMethodAccessorImpl.invoke(DelegatingMethodAccessorImpl.java:25)
	at java.lang.reflect.Method.invoke(Method.java:597)
	at org.apache.maven.surefire.booter.SurefireBooter.runSuitesInProcess(SurefireBooter.java:350)
	at org.apache.maven.surefire.booter.SurefireBooter.main(SurefireBooter.java:1021)

    testBadOptionReserved :
  java.lang.AssertionError
  java.lang.AssertionError: KDC cannot accommodate requested option expected:<13> but was:<33>
	at org.junit.Assert.fail(Assert.java:91)
	at org.junit.Assert.failNotEquals(Assert.java:645)
	at org.junit.Assert.assertEquals(Assert.java:126)
	at org.junit.Assert.assertEquals(Assert.java:470)
	at org.apache.directory.server.kerberos.protocol.TicketGrantingServiceTest.testBadOptionReserved(TicketGrantingServiceTest.java:1961)
	at sun.reflect.NativeMethodAccessorImpl.invoke0(Native Method)
	at sun.reflect.NativeMethodAccessorImpl.invoke(NativeMethodAccessorImpl.java:39)
	at sun.reflect.DelegatingMethodAccessorImpl.invoke(DelegatingMethodAccessorImpl.java:25)
	at java.lang.reflect.Method.invoke(Method.java:597)
	at org.junit.runners.model.FrameworkMethod$1.runReflectiveCall(FrameworkMethod.java:44)
	at org.junit.internal.runners.model.ReflectiveCallable.run(ReflectiveCallable.java:15)
	at org.junit.runners.model.FrameworkMethod.invokeExplosively(FrameworkMethod.java:41)
	at org.junit.internal.runners.statements.InvokeMethod.evaluate(InvokeMethod.java:20)
	at org.junit.internal.runners.statements.RunBefores.evaluate(RunBefores.java:28)
	at org.junit.internal.runners.statements.RunAfters.evaluate(RunAfters.java:31)
	at org.junit.runners.BlockJUnit4ClassRunner.runChild(BlockJUnit4ClassRunner.java:76)
	at org.junit.runners.BlockJUnit4ClassRunner.runChild(BlockJUnit4ClassRunner.java:50)
	at org.junit.runners.ParentRunner$3.run(ParentRunner.java:193)
	at org.junit.runners.ParentRunner$1.schedule(ParentRunner.java:52)
	at org.junit.runners.ParentRunner.runChildren(ParentRunner.java:191)
	at org.junit.runners.ParentRunner.access$000(ParentRunner.java:42)
	at org.junit.runners.ParentRunner$2.evaluate(ParentRunner.java:184)
	at org.junit.runners.ParentRunner.run(ParentRunner.java:236)
	at org.apache.maven.surefire.junit4.JUnit4TestSet.execute(JUnit4TestSet.java:59)
	at org.apache.maven.surefire.suite.AbstractDirectoryTestSuite.executeTestSet(AbstractDirectoryTestSuite.java:120)
	at org.apache.maven.surefire.suite.AbstractDirectoryTestSuite.execute(AbstractDirectoryTestSuite.java:103)
	at org.apache.maven.surefire.Surefire.run(Surefire.java:169)
	at sun.reflect.NativeMethodAccessorImpl.invoke0(Native Method)
	at sun.reflect.NativeMethodAccessorImpl.invoke(NativeMethodAccessorImpl.java:39)
	at sun.reflect.DelegatingMethodAccessorImpl.invoke(DelegatingMethodAccessorImpl.java:25)
	at java.lang.reflect.Method.invoke(Method.java:597)
	at org.apache.maven.surefire.booter.SurefireBooter.runSuitesInProcess(SurefireBooter.java:350)
	at org.apache.maven.surefire.booter.SurefireBooter.main(SurefireBooter.java:1021)

  



Mime
View raw message