directory-commits mailing list archives

Site index · List index
Message view « Date » · « Thread »
Top « Date » · « Thread »
From "Continuum@vmbuild" <contin...@apache.org>
Subject [continuum] BUILD FAILURE: Directory - ApacheDS 1.5 Build With Dependencies - Default Maven 2 Build Definition
Date Sun, 05 Sep 2010 23:03:46 GMT
Online report : http://vmbuild.apache.org/continuum/buildResult.action?buildId=390&projectId=10

Build statistics:
  State: Failed
  Previous State: Ok
  Started at: Sun 5 Sep 2010 23:00:45 +0000
  Finished at: Sun 5 Sep 2010 23:03:31 +0000
  Total time: 2m 45s
  Build Trigger: Schedule
  Build Number: 32
  Exit code: 1
  Building machine hostname: vmbuild
  Operating system : Linux(unknown)
  Java Home version : 
          java version "1.6.0_20"
          Java(TM) SE Runtime Environment (build 1.6.0_20-b02)
          Java HotSpot(TM) 64-Bit Server VM (build 16.3-b01, mixed mode)
        
  Builder version :
          Apache Maven 2.2.1 (r801777; 2009-08-06 19:16:01+0000)
          Java version: 1.6.0_20
          Java home: /usr/lib/jvm/java-6-sun-1.6.0.20/jre
          Default locale: en_US, platform encoding: ANSI_X3.4-1968
          OS name: "linux" version: "2.6.32-24-server" arch: "amd64" Family: "unix"
    
****************************************************************************
SCM Changes:
****************************************************************************
Changed: no author @ no date
Comment: no comment
Files changed:
  apacheds/core-api/src/main/java/org/apache/directory/server/core/filtering/CursorList.java
( no revision )
  shared/i18n/src/main/java/org/apache/directory/shared/i18n/I18n.java ( no revision )
  shared/i18n/src/main/resources/org/apache/directory/shared/i18n/errors.properties ( no revision
)
  shared/ldap/src/main/java/org/apache/directory/shared/ldap/aci/ACIItemChecker.java ( no
revision )
  shared/ldap/src/main/java/org/apache/directory/shared/ldap/aci/ACIItemParser.java ( no revision
)
  shared/asn1/src/main/java/org/apache/directory/shared/asn1/ber/tlv/Value.java ( no revision
)
  shared/asn1/src/main/java/org/apache/directory/shared/asn1/ber/grammar/AbstractGrammar.java
( no revision )
  shared/asn1/src/main/java/org/apache/directory/shared/asn1/ber/Asn1Decoder.java ( no revision
)
  shared/asn1/src/main/java/org/apache/directory/shared/asn1/der/ASN1OutputStream.java ( no
revision )
  shared/asn1/src/main/java/org/apache/directory/shared/asn1/der/BERConstructedOctetString.java
( no revision )
  shared/asn1/src/main/java/org/apache/directory/shared/asn1/der/ASN1InputStream.java ( no
revision )
  shared/asn1/src/main/java/org/apache/directory/shared/asn1/der/BERTaggedObject.java ( no
revision )
  shared/asn1/src/main/java/org/apache/directory/shared/asn1/der/DERUniversalString.java (
no revision )
  shared/asn1/src/main/java/org/apache/directory/shared/asn1/primitives/BitString.java ( no
revision )
  shared/asn1/src/main/java/org/apache/directory/shared/asn1/primitives/OID.java ( no revision
)
  shared/asn1/src/main/java/org/apache/directory/shared/asn1/AbstractAsn1Object.java ( no
revision )
  shared/asn1/src/main/java/org/apache/directory/shared/asn1/codec/binary/Hex.java ( no revision
)
  shared/asn1/src/main/java/org/apache/directory/shared/asn1/util/IntegerDecoder.java ( no
revision )
  shared/asn1/src/main/java/org/apache/directory/shared/asn1/util/BooleanDecoder.java ( no
revision )
  shared/asn1/src/main/java/org/apache/directory/shared/asn1/util/LongDecoder.java ( no revision
)
  shared/cursor/src/main/java/org/apache/directory/shared/ldap/cursor/SingletonCursor.java
( no revision )
  shared/cursor/src/main/java/org/apache/directory/shared/ldap/cursor/AbstractCursor.java
( no revision )
  shared/cursor/src/main/java/org/apache/directory/shared/ldap/cursor/CursorStateEnum.java
( no revision )
  shared/cursor/src/main/java/org/apache/directory/shared/ldap/cursor/ListCursor.java ( no
revision )
  shared/cursor/src/main/java/org/apache/directory/shared/ldap/cursor/AbstractTupleCursor.java
( no revision )
  shared/cursor/src/main/java/org/apache/directory/shared/ldap/cursor/Cursor.java ( no revision
)
  shared/cursor/src/main/java/org/apache/directory/shared/ldap/cursor/ClosureMonitor.java
( no revision )
  shared/cursor/src/main/java/org/apache/directory/shared/ldap/cursor/CursorClosedException.java
( no revision )
  shared/cursor/src/main/java/org/apache/directory/shared/ldap/cursor/CursorIterator.java
( no revision )
  shared/cursor/src/main/java/org/apache/directory/shared/ldap/cursor/TupleCursor.java ( no
revision )
  shared/cursor/src/main/java/org/apache/directory/shared/ldap/cursor/InvalidCursorPositionException.java
( no revision )
  shared/cursor/src/main/java/org/apache/directory/shared/ldap/cursor/Tuple.java ( no revision
)
  shared/cursor/src/main/java/org/apache/directory/shared/ldap/cursor/EmptyCursor.java ( no
revision )
  shared/cursor/src/main/java/org/apache/directory/shared/ldap/cursor/InconsistentCursorStateException.java
( no revision )

****************************************************************************
Dependencies Changes:
****************************************************************************
No dependencies changed


****************************************************************************
Build Definition:
****************************************************************************
POM filename: pom.xml
Goals: clean install -Dintegration   
Arguments: --batch-mode
Build Fresh: false
Always Build: false
Default Build Definition: true
Schedule: DEFAULT_SCHEDULE
Profile Name: Maven 2.2.1
Description: Default Maven 2 Build Definition

****************************************************************************
Test Summary:
****************************************************************************
Tests: 5038
Failures: 5
Errors: 0
Success Rate: 99
Total time: 831.83545

****************************************************************************
Test Failures:
****************************************************************************

LdapMessageTest
    testDecodeWrongProtocolOpMaxInt :
  java.lang.AssertionError
  java.lang.AssertionError: Bad exception : ERR_00002_BAD_TRANSITION Bad transition !
	at org.junit.Assert.fail(Assert.java:91)
	at org.apache.directory.shared.ldap.codec.LdapMessageTest.testDecodeWrongProtocolOpMaxInt(LdapMessageTest.java:267)
	at sun.reflect.NativeMethodAccessorImpl.invoke0(Native Method)
	at sun.reflect.NativeMethodAccessorImpl.invoke(NativeMethodAccessorImpl.java:39)
	at sun.reflect.DelegatingMethodAccessorImpl.invoke(DelegatingMethodAccessorImpl.java:25)
	at java.lang.reflect.Method.invoke(Method.java:597)
	at org.junit.runners.model.FrameworkMethod$1.runReflectiveCall(FrameworkMethod.java:44)
	at org.junit.internal.runners.model.ReflectiveCallable.run(ReflectiveCallable.java:15)
	at org.junit.runners.model.FrameworkMethod.invokeExplosively(FrameworkMethod.java:41)
	at org.junit.internal.runners.statements.InvokeMethod.evaluate(InvokeMethod.java:20)
	at org.junit.runners.BlockJUnit4ClassRunner.runChild(BlockJUnit4ClassRunner.java:76)
	at org.junit.runners.BlockJUnit4ClassRunner.runChild(BlockJUnit4ClassRunner.java:50)
	at org.junit.runners.ParentRunner$3.run(ParentRunner.java:193)
	at java.util.concurrent.Executors$RunnableAdapter.call(Executors.java:441)
	at java.util.concurrent.FutureTask$Sync.innerRun(FutureTask.java:303)
	at java.util.concurrent.FutureTask.run(FutureTask.java:138)
	at java.util.concurrent.Executors$RunnableAdapter.call(Executors.java:441)
	at java.util.concurrent.FutureTask$Sync.innerRun(FutureTask.java:303)
	at java.util.concurrent.FutureTask.run(FutureTask.java:138)
	at java.util.concurrent.ThreadPoolExecutor$Worker.runTask(ThreadPoolExecutor.java:886)
	at java.util.concurrent.ThreadPoolExecutor$Worker.run(ThreadPoolExecutor.java:908)
	at java.lang.Thread.run(Thread.java:619)

  LdapDecoderTest
    testDecodeBadLengthTooSmall :
  org.junit.ComparisonFailure
  org.junit.ComparisonFailure: expected:<ERR_[VALUE_LENGTH_ABOVE_EXPECTED_LENGTH_00008]
The current Value l...> but was:<ERR_[00008_VALUE_LENGTH_ABOVE_EXPECTED_LENGTH] The
current Value l...>
	at org.junit.Assert.assertEquals(Assert.java:123)
	at org.junit.Assert.assertEquals(Assert.java:145)
	at org.apache.directory.shared.ldap.codec.LdapDecoderTest.testDecodeBadLengthTooSmall(LdapDecoderTest.java:273)
	at sun.reflect.NativeMethodAccessorImpl.invoke0(Native Method)
	at sun.reflect.NativeMethodAccessorImpl.invoke(NativeMethodAccessorImpl.java:39)
	at sun.reflect.DelegatingMethodAccessorImpl.invoke(DelegatingMethodAccessorImpl.java:25)
	at java.lang.reflect.Method.invoke(Method.java:597)
	at org.junit.runners.model.FrameworkMethod$1.runReflectiveCall(FrameworkMethod.java:44)
	at org.junit.internal.runners.model.ReflectiveCallable.run(ReflectiveCallable.java:15)
	at org.junit.runners.model.FrameworkMethod.invokeExplosively(FrameworkMethod.java:41)
	at org.junit.internal.runners.statements.InvokeMethod.evaluate(InvokeMethod.java:20)
	at org.junit.runners.BlockJUnit4ClassRunner.runChild(BlockJUnit4ClassRunner.java:76)
	at org.junit.runners.BlockJUnit4ClassRunner.runChild(BlockJUnit4ClassRunner.java:50)
	at org.junit.runners.ParentRunner$3.run(ParentRunner.java:193)
	at java.util.concurrent.Executors$RunnableAdapter.call(Executors.java:441)
	at java.util.concurrent.FutureTask$Sync.innerRun(FutureTask.java:303)
	at java.util.concurrent.FutureTask.run(FutureTask.java:138)
	at java.util.concurrent.Executors$RunnableAdapter.call(Executors.java:441)
	at java.util.concurrent.FutureTask$Sync.innerRun(FutureTask.java:303)
	at java.util.concurrent.FutureTask.run(FutureTask.java:138)
	at java.util.concurrent.ThreadPoolExecutor$Worker.runTask(ThreadPoolExecutor.java:886)
	at java.util.concurrent.ThreadPoolExecutor$Worker.run(ThreadPoolExecutor.java:908)
	at java.lang.Thread.run(Thread.java:619)

    testDecodeBadTagTransition :
  org.junit.ComparisonFailure
  org.junit.ComparisonFailure: expected:<ERR_[BAD_TRANSITION_00002] Bad transition !>
but was:<ERR_[00002_BAD_TRANSITION] Bad transition !>
	at org.junit.Assert.assertEquals(Assert.java:123)
	at org.junit.Assert.assertEquals(Assert.java:145)
	at org.apache.directory.shared.ldap.codec.LdapDecoderTest.testDecodeBadTagTransition(LdapDecoderTest.java:374)
	at sun.reflect.NativeMethodAccessorImpl.invoke0(Native Method)
	at sun.reflect.NativeMethodAccessorImpl.invoke(NativeMethodAccessorImpl.java:39)
	at sun.reflect.DelegatingMethodAccessorImpl.invoke(DelegatingMethodAccessorImpl.java:25)
	at java.lang.reflect.Method.invoke(Method.java:597)
	at org.junit.runners.model.FrameworkMethod$1.runReflectiveCall(FrameworkMethod.java:44)
	at org.junit.internal.runners.model.ReflectiveCallable.run(ReflectiveCallable.java:15)
	at org.junit.runners.model.FrameworkMethod.invokeExplosively(FrameworkMethod.java:41)
	at org.junit.internal.runners.statements.InvokeMethod.evaluate(InvokeMethod.java:20)
	at org.junit.runners.BlockJUnit4ClassRunner.runChild(BlockJUnit4ClassRunner.java:76)
	at org.junit.runners.BlockJUnit4ClassRunner.runChild(BlockJUnit4ClassRunner.java:50)
	at org.junit.runners.ParentRunner$3.run(ParentRunner.java:193)
	at java.util.concurrent.Executors$RunnableAdapter.call(Executors.java:441)
	at java.util.concurrent.FutureTask$Sync.innerRun(FutureTask.java:303)
	at java.util.concurrent.FutureTask.run(FutureTask.java:138)
	at java.util.concurrent.Executors$RunnableAdapter.call(Executors.java:441)
	at java.util.concurrent.FutureTask$Sync.innerRun(FutureTask.java:303)
	at java.util.concurrent.FutureTask.run(FutureTask.java:138)
	at java.util.concurrent.ThreadPoolExecutor$Worker.runTask(ThreadPoolExecutor.java:886)
	at java.util.concurrent.ThreadPoolExecutor$Worker.run(ThreadPoolExecutor.java:908)
	at java.lang.Thread.run(Thread.java:619)

    testDecodeBadPrimitiveLengthTooBig :
  org.junit.ComparisonFailure
  org.junit.ComparisonFailure: expected:<ERR_[BAD_TRANSITION_00002] Bad transition !>
but was:<ERR_[00002_BAD_TRANSITION] Bad transition !>
	at org.junit.Assert.assertEquals(Assert.java:123)
	at org.junit.Assert.assertEquals(Assert.java:145)
	at org.apache.directory.shared.ldap.codec.LdapDecoderTest.testDecodeBadPrimitiveLengthTooBig(LdapDecoderTest.java:323)
	at sun.reflect.NativeMethodAccessorImpl.invoke0(Native Method)
	at sun.reflect.NativeMethodAccessorImpl.invoke(NativeMethodAccessorImpl.java:39)
	at sun.reflect.DelegatingMethodAccessorImpl.invoke(DelegatingMethodAccessorImpl.java:25)
	at java.lang.reflect.Method.invoke(Method.java:597)
	at org.junit.runners.model.FrameworkMethod$1.runReflectiveCall(FrameworkMethod.java:44)
	at org.junit.internal.runners.model.ReflectiveCallable.run(ReflectiveCallable.java:15)
	at org.junit.runners.model.FrameworkMethod.invokeExplosively(FrameworkMethod.java:41)
	at org.junit.internal.runners.statements.InvokeMethod.evaluate(InvokeMethod.java:20)
	at org.junit.runners.BlockJUnit4ClassRunner.runChild(BlockJUnit4ClassRunner.java:76)
	at org.junit.runners.BlockJUnit4ClassRunner.runChild(BlockJUnit4ClassRunner.java:50)
	at org.junit.runners.ParentRunner$3.run(ParentRunner.java:193)
	at java.util.concurrent.Executors$RunnableAdapter.call(Executors.java:441)
	at java.util.concurrent.FutureTask$Sync.innerRun(FutureTask.java:303)
	at java.util.concurrent.FutureTask.run(FutureTask.java:138)
	at java.util.concurrent.Executors$RunnableAdapter.call(Executors.java:441)
	at java.util.concurrent.FutureTask$Sync.innerRun(FutureTask.java:303)
	at java.util.concurrent.FutureTask.run(FutureTask.java:138)
	at java.util.concurrent.ThreadPoolExecutor$Worker.runTask(ThreadPoolExecutor.java:886)
	at java.util.concurrent.ThreadPoolExecutor$Worker.run(ThreadPoolExecutor.java:908)
	at java.lang.Thread.run(Thread.java:619)

  BindRequestTest
    testDecodeBindRequestSimpleNoName :
  org.junit.ComparisonFailure
  org.junit.ComparisonFailure: expected:<ERR_[BAD_TRANSITION_00002] Bad transition !>
but was:<ERR_[00002_BAD_TRANSITION] Bad transition !>
	at org.junit.Assert.assertEquals(Assert.java:123)
	at org.junit.Assert.assertEquals(Assert.java:145)
	at org.apache.directory.shared.ldap.codec.bind.BindRequestTest.testDecodeBindRequestSimpleNoName(BindRequestTest.java:319)
	at sun.reflect.NativeMethodAccessorImpl.invoke0(Native Method)
	at sun.reflect.NativeMethodAccessorImpl.invoke(NativeMethodAccessorImpl.java:39)
	at sun.reflect.DelegatingMethodAccessorImpl.invoke(DelegatingMethodAccessorImpl.java:25)
	at java.lang.reflect.Method.invoke(Method.java:597)
	at org.junit.runners.model.FrameworkMethod$1.runReflectiveCall(FrameworkMethod.java:44)
	at org.junit.internal.runners.model.ReflectiveCallable.run(ReflectiveCallable.java:15)
	at org.junit.runners.model.FrameworkMethod.invokeExplosively(FrameworkMethod.java:41)
	at org.junit.internal.runners.statements.InvokeMethod.evaluate(InvokeMethod.java:20)
	at org.junit.runners.BlockJUnit4ClassRunner.runChild(BlockJUnit4ClassRunner.java:76)
	at org.junit.runners.BlockJUnit4ClassRunner.runChild(BlockJUnit4ClassRunner.java:50)
	at org.junit.runners.ParentRunner$3.run(ParentRunner.java:193)
	at java.util.concurrent.Executors$RunnableAdapter.call(Executors.java:441)
	at java.util.concurrent.FutureTask$Sync.innerRun(FutureTask.java:303)
	at java.util.concurrent.FutureTask.run(FutureTask.java:138)
	at java.util.concurrent.Executors$RunnableAdapter.call(Executors.java:441)
	at java.util.concurrent.FutureTask$Sync.innerRun(FutureTask.java:303)
	at java.util.concurrent.FutureTask.run(FutureTask.java:138)
	at java.util.concurrent.ThreadPoolExecutor$Worker.runTask(ThreadPoolExecutor.java:886)
	at java.util.concurrent.ThreadPoolExecutor$Worker.run(ThreadPoolExecutor.java:908)
	at java.lang.Thread.run(Thread.java:619)

  



Mime
View raw message