directory-commits mailing list archives

Site index · List index
Message view « Date » · « Thread »
Top « Date » · « Thread »
From "Continuum@vmbuild" <contin...@apache.org>
Subject [continuum] BUILD FAILURE: Directory - ApacheDS 1.5 Build With Dependencies - Default Maven 2 Build Definition
Date Sun, 05 Sep 2010 11:02:51 GMT
Online report : http://vmbuild.apache.org/continuum/buildResult.action?buildId=374&projectId=10

Build statistics:
  State: Failed
  Previous State: Failed
  Started at: Sun 5 Sep 2010 11:00:27 +0000
  Finished at: Sun 5 Sep 2010 11:02:43 +0000
  Total time: 2m 15s
  Build Trigger: Schedule
  Build Number: 26
  Exit code: 1
  Building machine hostname: vmbuild
  Operating system : Linux(unknown)
  Java Home version : 
          java version "1.6.0_20"
          Java(TM) SE Runtime Environment (build 1.6.0_20-b02)
          Java HotSpot(TM) 64-Bit Server VM (build 16.3-b01, mixed mode)
        
  Builder version :
          Apache Maven 2.2.1 (r801777; 2009-08-06 19:16:01+0000)
          Java version: 1.6.0_20
          Java home: /usr/lib/jvm/java-6-sun-1.6.0.20/jre
          Default locale: en_US, platform encoding: ANSI_X3.4-1968
          OS name: "linux" version: "2.6.32-24-server" arch: "amd64" Family: "unix"
    
****************************************************************************
SCM Changes:
****************************************************************************
Changed: no author @ no date
Comment: no comment
Files changed:
  shared/i18n/src/main/java/org/apache/directory/shared/i18n/I18n.java ( no revision )
  shared/i18n/src/main/resources/org/apache/directory/shared/i18n/errors.properties ( no revision
)
  shared/ldap/src/test/java/org/apache/directory/shared/ldap/codec/LdapDecoderTest.java (
no revision )
  shared/ldap/src/test/java/org/apache/directory/shared/ldap/codec/LdapMessageTest.java (
no revision )
  shared/ldap/src/main/java/org/apache/directory/shared/ldap/codec/extended/operations/gracefulDisconnect/GracefulDisconnectGrammar.java
( no revision )
  shared/ldap/src/main/java/org/apache/directory/shared/ldap/codec/extended/operations/gracefulDisconnect/GracefulDisconnectStatesEnum.java
( no revision )
  shared/ldap/src/main/java/org/apache/directory/shared/ldap/codec/extended/operations/gracefulShutdown/GracefulShutdownGrammar.java
( no revision )
  shared/ldap/src/main/java/org/apache/directory/shared/ldap/codec/extended/operations/gracefulShutdown/GracefulShutdownStatesEnum.java
( no revision )
  shared/ldap/src/main/java/org/apache/directory/shared/ldap/codec/extended/operations/cancel/CancelGrammar.java
( no revision )
  shared/ldap/src/main/java/org/apache/directory/shared/ldap/codec/extended/operations/cancel/CancelStatesEnum.java
( no revision )
  shared/ldap/src/main/java/org/apache/directory/shared/ldap/codec/extended/operations/certGeneration/CertGenerationGrammar.java
( no revision )
  shared/ldap/src/main/java/org/apache/directory/shared/ldap/codec/extended/operations/certGeneration/CertGenerationStatesEnum.java
( no revision )
  shared/ldap/src/main/java/org/apache/directory/shared/ldap/codec/extended/operations/storedProcedure/StoredProcedureGrammar.java
( no revision )
  shared/ldap/src/main/java/org/apache/directory/shared/ldap/codec/extended/operations/storedProcedure/StoredProcedureStatesEnum.java
( no revision )
  shared/ldap/src/main/java/org/apache/directory/shared/ldap/codec/controls/ppolicy/PasswordPolicyResponseControlStates.java
( no revision )
  shared/ldap/src/main/java/org/apache/directory/shared/ldap/codec/controls/ppolicy/PasswordPolicyResponseControlGrammar.java
( no revision )
  shared/ldap/src/main/java/org/apache/directory/shared/ldap/codec/controls/replication/syncDoneValue/SyncDoneValueControlGrammar.java
( no revision )
  shared/ldap/src/main/java/org/apache/directory/shared/ldap/codec/controls/replication/syncDoneValue/SyncDoneValueControlStatesEnum.java
( no revision )
  shared/ldap/src/main/java/org/apache/directory/shared/ldap/codec/controls/replication/syncRequestValue/SyncRequestValueControlGrammar.java
( no revision )
  shared/ldap/src/main/java/org/apache/directory/shared/ldap/codec/controls/replication/syncRequestValue/SyncRequestValueControlStatesEnum.java
( no revision )
  shared/ldap/src/main/java/org/apache/directory/shared/ldap/codec/controls/replication/syncInfoValue/SyncInfoValueControlStatesEnum.java
( no revision )
  shared/ldap/src/main/java/org/apache/directory/shared/ldap/codec/controls/replication/syncInfoValue/SyncInfoValueControlGrammar.java
( no revision )
  shared/ldap/src/main/java/org/apache/directory/shared/ldap/codec/controls/replication/syncmodifydn/SyncModifyDnControlStatesEnum.java
( no revision )
  shared/ldap/src/main/java/org/apache/directory/shared/ldap/codec/controls/replication/syncmodifydn/SyncModifyDnControlGrammar.java
( no revision )
  shared/ldap/src/main/java/org/apache/directory/shared/ldap/codec/controls/replication/syncStateValue/SyncStateValueControlGrammar.java
( no revision )
  shared/ldap/src/main/java/org/apache/directory/shared/ldap/codec/controls/replication/syncStateValue/SyncStateValueControlStatesEnum.java
( no revision )
  shared/ldap/src/main/java/org/apache/directory/shared/ldap/codec/search/controls/subentries/SubentriesControlGrammar.java
( no revision )
  shared/ldap/src/main/java/org/apache/directory/shared/ldap/codec/search/controls/subentries/SubentriesControlStatesEnum.java
( no revision )
  shared/ldap/src/main/java/org/apache/directory/shared/ldap/codec/search/controls/pagedSearch/PagedResultsControlGrammar.java
( no revision )
  shared/ldap/src/main/java/org/apache/directory/shared/ldap/codec/search/controls/pagedSearch/PagedResultsControlStatesEnum.java
( no revision )
  shared/ldap/src/main/java/org/apache/directory/shared/ldap/codec/search/controls/persistentSearch/PersistentSearchControlStatesEnum.java
( no revision )
  shared/ldap/src/main/java/org/apache/directory/shared/ldap/codec/search/controls/persistentSearch/PersistentSearchControlGrammar.java
( no revision )
  shared/ldap/src/main/java/org/apache/directory/shared/ldap/codec/search/controls/entryChange/EntryChangeControlGrammar.java
( no revision )
  shared/ldap/src/main/java/org/apache/directory/shared/ldap/codec/search/controls/entryChange/EntryChangeControlStatesEnum.java
( no revision )
  shared/ldap/src/main/java/org/apache/directory/shared/ldap/codec/LdapStatesEnum.java ( no
revision )
  shared/ldap/src/main/java/org/apache/directory/shared/ldap/codec/LdapMessageGrammar.java
( no revision )
  shared/file-review.txt ( no revision )
  shared/asn1/src/main/java/org/apache/directory/shared/asn1/ber/AbstractContainer.java (
no revision )
  shared/asn1/src/main/java/org/apache/directory/shared/asn1/ber/grammar/IGrammar.java ( no
revision )
  shared/asn1/src/main/java/org/apache/directory/shared/asn1/ber/grammar/IAction.java ( no
revision )
  shared/asn1/src/main/java/org/apache/directory/shared/asn1/ber/grammar/IStates.java ( no
revision )
  shared/asn1/src/main/java/org/apache/directory/shared/asn1/ber/grammar/GrammarTransition.java
( no revision )
  shared/asn1/src/main/java/org/apache/directory/shared/asn1/ber/grammar/States.java ( no
revision )
  shared/asn1/src/main/java/org/apache/directory/shared/asn1/ber/grammar/GrammarAction.java
( no revision )
  shared/asn1/src/main/java/org/apache/directory/shared/asn1/ber/grammar/Grammar.java ( no
revision )
  shared/asn1/src/main/java/org/apache/directory/shared/asn1/ber/grammar/AbstractGrammar.java
( no revision )
  shared/asn1/src/main/java/org/apache/directory/shared/asn1/ber/grammar/Action.java ( no
revision )
  shared/asn1/src/main/java/org/apache/directory/shared/asn1/ber/Asn1Decoder.java ( no revision
)
  shared/asn1/src/main/java/org/apache/directory/shared/asn1/ber/IAsn1Container.java ( no
revision )

****************************************************************************
Dependencies Changes:
****************************************************************************
No dependencies changed


****************************************************************************
Build Definition:
****************************************************************************
POM filename: pom.xml
Goals: clean install -Dintegration   
Arguments: --batch-mode
Build Fresh: false
Always Build: false
Default Build Definition: true
Schedule: DEFAULT_SCHEDULE
Profile Name: Maven 2.2.1
Description: Default Maven 2 Build Definition

****************************************************************************
Test Summary:
****************************************************************************
Tests: 5060
Failures: 4
Errors: 0
Success Rate: 99
Total time: 904.0569

****************************************************************************
Test Failures:
****************************************************************************

LdapMessageTest
    testDecodeWrongProtocolOpMaxInt :
  java.lang.AssertionError
  java.lang.AssertionError: Bad exception : ERR_BAD_TRANSITION_00002 Bad transition !
	at org.junit.Assert.fail(Assert.java:91)
	at org.apache.directory.shared.ldap.codec.LdapMessageTest.testDecodeWrongProtocolOpMaxInt(LdapMessageTest.java:267)
	at sun.reflect.NativeMethodAccessorImpl.invoke0(Native Method)
	at sun.reflect.NativeMethodAccessorImpl.invoke(NativeMethodAccessorImpl.java:39)
	at sun.reflect.DelegatingMethodAccessorImpl.invoke(DelegatingMethodAccessorImpl.java:25)
	at java.lang.reflect.Method.invoke(Method.java:597)
	at org.junit.runners.model.FrameworkMethod$1.runReflectiveCall(FrameworkMethod.java:44)
	at org.junit.internal.runners.model.ReflectiveCallable.run(ReflectiveCallable.java:15)
	at org.junit.runners.model.FrameworkMethod.invokeExplosively(FrameworkMethod.java:41)
	at org.junit.internal.runners.statements.InvokeMethod.evaluate(InvokeMethod.java:20)
	at org.junit.runners.BlockJUnit4ClassRunner.runChild(BlockJUnit4ClassRunner.java:76)
	at org.junit.runners.BlockJUnit4ClassRunner.runChild(BlockJUnit4ClassRunner.java:50)
	at org.junit.runners.ParentRunner$3.run(ParentRunner.java:193)
	at java.util.concurrent.Executors$RunnableAdapter.call(Executors.java:441)
	at java.util.concurrent.FutureTask$Sync.innerRun(FutureTask.java:303)
	at java.util.concurrent.FutureTask.run(FutureTask.java:138)
	at java.util.concurrent.Executors$RunnableAdapter.call(Executors.java:441)
	at java.util.concurrent.FutureTask$Sync.innerRun(FutureTask.java:303)
	at java.util.concurrent.FutureTask.run(FutureTask.java:138)
	at java.util.concurrent.ThreadPoolExecutor$Worker.runTask(ThreadPoolExecutor.java:886)
	at java.util.concurrent.ThreadPoolExecutor$Worker.run(ThreadPoolExecutor.java:908)
	at java.lang.Thread.run(Thread.java:619)

  LdapDecoderTest
    testDecodeBadTagTransition :
  org.junit.ComparisonFailure
  org.junit.ComparisonFailure: expected:<ERR_[]00002 Bad transition...> but was:<ERR_[BAD_TRANSITION_]00002
Bad transition...>
	at org.junit.Assert.assertEquals(Assert.java:123)
	at org.junit.Assert.assertEquals(Assert.java:145)
	at org.apache.directory.shared.ldap.codec.LdapDecoderTest.testDecodeBadTagTransition(LdapDecoderTest.java:374)
	at sun.reflect.NativeMethodAccessorImpl.invoke0(Native Method)
	at sun.reflect.NativeMethodAccessorImpl.invoke(NativeMethodAccessorImpl.java:39)
	at sun.reflect.DelegatingMethodAccessorImpl.invoke(DelegatingMethodAccessorImpl.java:25)
	at java.lang.reflect.Method.invoke(Method.java:597)
	at org.junit.runners.model.FrameworkMethod$1.runReflectiveCall(FrameworkMethod.java:44)
	at org.junit.internal.runners.model.ReflectiveCallable.run(ReflectiveCallable.java:15)
	at org.junit.runners.model.FrameworkMethod.invokeExplosively(FrameworkMethod.java:41)
	at org.junit.internal.runners.statements.InvokeMethod.evaluate(InvokeMethod.java:20)
	at org.junit.runners.BlockJUnit4ClassRunner.runChild(BlockJUnit4ClassRunner.java:76)
	at org.junit.runners.BlockJUnit4ClassRunner.runChild(BlockJUnit4ClassRunner.java:50)
	at org.junit.runners.ParentRunner$3.run(ParentRunner.java:193)
	at java.util.concurrent.Executors$RunnableAdapter.call(Executors.java:441)
	at java.util.concurrent.FutureTask$Sync.innerRun(FutureTask.java:303)
	at java.util.concurrent.FutureTask.run(FutureTask.java:138)
	at java.util.concurrent.Executors$RunnableAdapter.call(Executors.java:441)
	at java.util.concurrent.FutureTask$Sync.innerRun(FutureTask.java:303)
	at java.util.concurrent.FutureTask.run(FutureTask.java:138)
	at java.util.concurrent.ThreadPoolExecutor$Worker.runTask(ThreadPoolExecutor.java:886)
	at java.util.concurrent.ThreadPoolExecutor$Worker.run(ThreadPoolExecutor.java:908)
	at java.lang.Thread.run(Thread.java:619)

    testDecodeBadPrimitiveLengthTooBig :
  org.junit.ComparisonFailure
  org.junit.ComparisonFailure: expected:<ERR_[]00002 Bad transition...> but was:<ERR_[BAD_TRANSITION_]00002
Bad transition...>
	at org.junit.Assert.assertEquals(Assert.java:123)
	at org.junit.Assert.assertEquals(Assert.java:145)
	at org.apache.directory.shared.ldap.codec.LdapDecoderTest.testDecodeBadPrimitiveLengthTooBig(LdapDecoderTest.java:323)
	at sun.reflect.NativeMethodAccessorImpl.invoke0(Native Method)
	at sun.reflect.NativeMethodAccessorImpl.invoke(NativeMethodAccessorImpl.java:39)
	at sun.reflect.DelegatingMethodAccessorImpl.invoke(DelegatingMethodAccessorImpl.java:25)
	at java.lang.reflect.Method.invoke(Method.java:597)
	at org.junit.runners.model.FrameworkMethod$1.runReflectiveCall(FrameworkMethod.java:44)
	at org.junit.internal.runners.model.ReflectiveCallable.run(ReflectiveCallable.java:15)
	at org.junit.runners.model.FrameworkMethod.invokeExplosively(FrameworkMethod.java:41)
	at org.junit.internal.runners.statements.InvokeMethod.evaluate(InvokeMethod.java:20)
	at org.junit.runners.BlockJUnit4ClassRunner.runChild(BlockJUnit4ClassRunner.java:76)
	at org.junit.runners.BlockJUnit4ClassRunner.runChild(BlockJUnit4ClassRunner.java:50)
	at org.junit.runners.ParentRunner$3.run(ParentRunner.java:193)
	at java.util.concurrent.Executors$RunnableAdapter.call(Executors.java:441)
	at java.util.concurrent.FutureTask$Sync.innerRun(FutureTask.java:303)
	at java.util.concurrent.FutureTask.run(FutureTask.java:138)
	at java.util.concurrent.Executors$RunnableAdapter.call(Executors.java:441)
	at java.util.concurrent.FutureTask$Sync.innerRun(FutureTask.java:303)
	at java.util.concurrent.FutureTask.run(FutureTask.java:138)
	at java.util.concurrent.ThreadPoolExecutor$Worker.runTask(ThreadPoolExecutor.java:886)
	at java.util.concurrent.ThreadPoolExecutor$Worker.run(ThreadPoolExecutor.java:908)
	at java.lang.Thread.run(Thread.java:619)

  BindRequestTest
    testDecodeBindRequestSimpleNoName :
  org.junit.ComparisonFailure
  org.junit.ComparisonFailure: expected:<ERR_[]00002 Bad transition...> but was:<ERR_[BAD_TRANSITION_]00002
Bad transition...>
	at org.junit.Assert.assertEquals(Assert.java:123)
	at org.junit.Assert.assertEquals(Assert.java:145)
	at org.apache.directory.shared.ldap.codec.bind.BindRequestTest.testDecodeBindRequestSimpleNoName(BindRequestTest.java:319)
	at sun.reflect.NativeMethodAccessorImpl.invoke0(Native Method)
	at sun.reflect.NativeMethodAccessorImpl.invoke(NativeMethodAccessorImpl.java:39)
	at sun.reflect.DelegatingMethodAccessorImpl.invoke(DelegatingMethodAccessorImpl.java:25)
	at java.lang.reflect.Method.invoke(Method.java:597)
	at org.junit.runners.model.FrameworkMethod$1.runReflectiveCall(FrameworkMethod.java:44)
	at org.junit.internal.runners.model.ReflectiveCallable.run(ReflectiveCallable.java:15)
	at org.junit.runners.model.FrameworkMethod.invokeExplosively(FrameworkMethod.java:41)
	at org.junit.internal.runners.statements.InvokeMethod.evaluate(InvokeMethod.java:20)
	at org.junit.runners.BlockJUnit4ClassRunner.runChild(BlockJUnit4ClassRunner.java:76)
	at org.junit.runners.BlockJUnit4ClassRunner.runChild(BlockJUnit4ClassRunner.java:50)
	at org.junit.runners.ParentRunner$3.run(ParentRunner.java:193)
	at java.util.concurrent.Executors$RunnableAdapter.call(Executors.java:441)
	at java.util.concurrent.FutureTask$Sync.innerRun(FutureTask.java:303)
	at java.util.concurrent.FutureTask.run(FutureTask.java:138)
	at java.util.concurrent.Executors$RunnableAdapter.call(Executors.java:441)
	at java.util.concurrent.FutureTask$Sync.innerRun(FutureTask.java:303)
	at java.util.concurrent.FutureTask.run(FutureTask.java:138)
	at java.util.concurrent.ThreadPoolExecutor$Worker.runTask(ThreadPoolExecutor.java:886)
	at java.util.concurrent.ThreadPoolExecutor$Worker.run(ThreadPoolExecutor.java:908)
	at java.lang.Thread.run(Thread.java:619)

  



Mime
View raw message