directory-commits mailing list archives

Site index · List index
Message view « Date » · « Thread »
Top « Date » · « Thread »
From "Continuum@vmbuild.apache.org" <contin...@apache.org>
Subject [continuum] BUILD FAILURE: Directory - Apache Directory Shared - clean deploy
Date Wed, 06 Jan 2010 04:46:29 GMT
Online report : http://vmbuild.apache.org/continuum/buildResult.action?buildId=266477&projectId=1498

Build statistics:
  State: Failed
  Previous State: Failed
  Started at: Tue 5 Jan 2010 20:36:34 -0800
  Finished at: Tue 5 Jan 2010 20:45:18 -0800
  Total time: 8m 43s
  Build Trigger: Schedule
  Build Number: 80
  Exit code: 1
  Building machine hostname: vmbuild.apache.org
  Operating system : Linux(unknown)
  Java Home version : 
          java version "1.5.0_12"
          Java(TM) 2 Runtime Environment, Standard Edition (build 1.5.0_12-b04)
          Java HotSpot(TM) Client VM (build 1.5.0_12-b04, mixed mode, sharing)
        
  Builder version :
          Maven version: 2.0.9
          Java version: 1.5.0_12
          OS name: "linux" version: "2.6.24-23-server" arch: "i386" Family: "unix"
    
****************************************************************************
SCM Changes:
****************************************************************************
Changed: no author @ no date
Comment: no comment
Files changed:
  ldap-schema-loader/pom.xml ( no revision )
  pom.xml ( no revision )
  ldap-schema/src/main/resources/schema/ou=schema/cn=adsconfig/ou=objectclasses.ldif ( no
revision )
  ldap-schema/src/main/resources/schema/ou=schema/cn=adsconfig/ou=matchingrules.ldif ( no
revision )
  ldap-schema/src/main/resources/schema/ou=schema/cn=adsconfig/ou=normalizers.ldif ( no revision
)
  ldap-schema/src/main/resources/schema/ou=schema/cn=adsconfig/ou=ditcontentrules.ldif ( no
revision )
  ldap-schema/src/main/resources/schema/ou=schema/cn=adsconfig/ou=nameforms.ldif ( no revision
)
  ldap-schema/src/main/resources/schema/ou=schema/cn=adsconfig/ou=objectclasses/m-oid=1.3.6.1.4.1.18060.0.4.1.3.100.ldif
( no revision )
  ldap-schema/src/main/resources/schema/ou=schema/cn=adsconfig/ou=objectclasses/m-oid=1.3.6.1.4.1.18060.0.4.1.3.120.ldif
( no revision )
  ldap-schema/src/main/resources/schema/ou=schema/cn=adsconfig/ou=objectclasses/m-oid=1.3.6.1.4.1.18060.0.4.1.3.300.ldif
( no revision )
  ldap-schema/src/main/resources/schema/ou=schema/cn=adsconfig/ou=objectclasses/m-oid=1.3.6.1.4.1.18060.0.4.1.3.130.ldif
( no revision )
  ldap-schema/src/main/resources/schema/ou=schema/cn=adsconfig/ou=objectclasses/m-oid=1.3.6.1.4.1.18060.0.4.1.3.400.ldif
( no revision )
  ldap-schema/src/main/resources/schema/ou=schema/cn=adsconfig/ou=objectclasses/m-oid=1.3.6.1.4.1.18060.0.4.1.3.140.ldif
( no revision )
  ldap-schema/src/main/resources/schema/ou=schema/cn=adsconfig/ou=objectclasses/m-oid=1.3.6.1.4.1.18060.0.4.1.3.500.ldif
( no revision )
  ldap-schema/src/main/resources/schema/ou=schema/cn=adsconfig/ou=objectclasses/m-oid=1.3.6.1.4.1.18060.0.4.1.3.600.ldif
( no revision )
  ldap-schema/src/main/resources/schema/ou=schema/cn=adsconfig/ou=objectclasses/m-oid=1.3.6.1.4.1.18060.0.4.1.3.150.ldif
( no revision )
  ldap-schema/src/main/resources/schema/ou=schema/cn=adsconfig/ou=objectclasses/m-oid=1.3.6.1.4.1.18060.0.4.1.3.700.ldif
( no revision )
  ldap-schema/src/main/resources/schema/ou=schema/cn=adsconfig/ou=objectclasses/m-oid=1.3.6.1.4.1.18060.0.4.1.3.151.ldif
( no revision )
  ldap-schema/src/main/resources/schema/ou=schema/cn=adsconfig/ou=objectclasses/m-oid=1.3.6.1.4.1.18060.0.4.1.3.160.ldif
( no revision )
  ldap-schema/src/main/resources/schema/ou=schema/cn=adsconfig/ou=objectclasses/m-oid=1.3.6.1.4.1.18060.0.4.1.3.250.ldif
( no revision )
  ldap-schema/src/main/resources/schema/ou=schema/cn=adsconfig/ou=objectclasses/m-oid=1.3.6.1.4.1.18060.0.4.1.3.800.ldif
( no revision )
  ldap-schema/src/main/resources/schema/ou=schema/cn=adsconfig/ou=objectclasses/m-oid=1.3.6.1.4.1.18060.0.4.1.3.161.ldif
( no revision )
  ldap-schema/src/main/resources/schema/ou=schema/cn=adsconfig/ou=objectclasses/m-oid=1.3.6.1.4.1.18060.0.4.1.3.260.ldif
( no revision )
  ldap-schema/src/main/resources/schema/ou=schema/cn=adsconfig/ou=objectclasses/m-oid=1.3.6.1.4.1.18060.0.4.1.3.20.ldif
( no revision )
  ldap-schema/src/main/resources/schema/ou=schema/cn=adsconfig/ou=objectclasses/m-oid=1.3.6.1.4.1.18060.0.4.1.3.18.ldif
( no revision )
  ldap-schema/src/main/resources/schema/ou=schema/cn=adsconfig/ou=objectclasses/m-oid=1.3.6.1.4.1.18060.0.4.1.3.19.ldif
( no revision )
  ldap-schema/src/main/resources/schema/ou=schema/cn=adsconfig/ou=attributetypes.ldif ( no
revision )
  ldap-schema/src/main/resources/schema/ou=schema/cn=adsconfig/ou=comparators.ldif ( no revision
)
  ldap-schema/src/main/resources/schema/ou=schema/cn=adsconfig/ou=attributetypes/m-oid=1.3.6.1.4.1.18060.0.4.1.2.200.ldif
( no revision )
  ldap-schema/src/main/resources/schema/ou=schema/cn=adsconfig/ou=attributetypes/m-oid=1.3.6.1.4.1.18060.0.4.1.2.111.ldif
( no revision )
  ldap-schema/src/main/resources/schema/ou=schema/cn=adsconfig/ou=attributetypes/m-oid=1.3.6.1.4.1.18060.0.4.1.2.103.ldif
( no revision )
  ldap-schema/src/main/resources/schema/ou=schema/cn=adsconfig/ou=attributetypes/m-oid=1.3.6.1.4.1.18060.0.4.1.2.301.ldif
( no revision )
  ldap-schema/src/main/resources/schema/ou=schema/cn=adsconfig/ou=attributetypes/m-oid=1.3.6.1.4.1.18060.0.4.1.2.131.ldif
( no revision )
  ldap-schema/src/main/resources/schema/ou=schema/cn=adsconfig/ou=attributetypes/m-oid=1.3.6.1.4.1.18060.0.4.1.2.410.ldif
( no revision )
  ldap-schema/src/main/resources/schema/ou=schema/cn=adsconfig/ou=attributetypes/m-oid=1.3.6.1.4.1.18060.0.4.1.2.402.ldif
( no revision )
  ldap-schema/src/main/resources/schema/ou=schema/cn=adsconfig/ou=attributetypes/m-oid=1.3.6.1.4.1.18060.0.4.1.2.151.ldif
( no revision )
  ldap-schema/src/main/resources/schema/ou=schema/cn=adsconfig/ou=attributetypes/m-oid=1.3.6.1.4.1.18060.0.4.1.2.143.ldif
( no revision )
  ldap-schema/src/main/resources/schema/ou=schema/cn=adsconfig/ou=attributetypes/m-oid=1.3.6.1.4.1.18060.0.4.1.2.107.ldif
( no revision )
  ldap-schema/src/main/resources/schema/ou=schema/cn=adsconfig/ou=attributetypes/m-oid=1.3.6.1.4.1.18060.0.4.1.2.260.ldif
( no revision )
  ldap-schema/src/main/resources/schema/ou=schema/cn=adsconfig/ou=attributetypes/m-oid=1.3.6.1.4.1.18060.0.4.1.2.305.ldif
( no revision )
  ldap-schema/src/main/resources/schema/ou=schema/cn=adsconfig/ou=attributetypes/m-oid=1.3.6.1.4.1.18060.0.4.1.2.802.ldif
( no revision )
  ldap-schema/src/main/resources/schema/ou=schema/cn=adsconfig/ou=attributetypes/m-oid=1.3.6.1.4.1.18060.0.4.1.2.163.ldif
( no revision )
  ldap-schema/src/main/resources/schema/ou=schema/cn=adsconfig/ou=attributetypes/m-oid=1.3.6.1.4.1.18060.0.4.1.2.406.ldif
( no revision )
  ldap-schema/src/main/resources/schema/ou=schema/cn=adsconfig/ou=attributetypes/m-oid=1.3.6.1.4.1.18060.0.4.1.2.309.ldif
( no revision )
  ldap-schema/src/main/resources/schema/ou=schema/cn=adsconfig/ou=attributetypes/m-oid=1.3.6.1.4.1.18060.0.4.1.2.63.ldif
( no revision )
  ldap-schema/src/main/resources/schema/ou=schema/cn=adsconfig/ou=attributetypes/m-oid=1.3.6.1.4.1.18060.0.4.1.2.100.ldif
( no revision )
  ldap-schema/src/main/resources/schema/ou=schema/cn=adsconfig/ou=attributetypes/m-oid=1.3.6.1.4.1.18060.0.4.1.2.120.ldif
( no revision )
  ldap-schema/src/main/resources/schema/ou=schema/cn=adsconfig/ou=attributetypes/m-oid=1.3.6.1.4.1.18060.0.4.1.2.112.ldif
( no revision )
  ldap-schema/src/main/resources/schema/ou=schema/cn=adsconfig/ou=attributetypes/m-oid=1.3.6.1.4.1.18060.0.4.1.2.302.ldif
( no revision )
  ldap-schema/src/main/resources/schema/ou=schema/cn=adsconfig/ou=attributetypes/m-oid=1.3.6.1.4.1.18060.0.4.1.2.104.ldif
( no revision )
  ldap-schema/src/main/resources/schema/ou=schema/cn=adsconfig/ou=attributetypes/m-oid=1.3.6.1.4.1.18060.0.4.1.2.140.ldif
( no revision )
  ldap-schema/src/main/resources/schema/ou=schema/cn=adsconfig/ou=attributetypes/m-oid=1.3.6.1.4.1.18060.0.4.1.2.411.ldif
( no revision )
  ldap-schema/src/main/resources/schema/ou=schema/cn=adsconfig/ou=attributetypes/m-oid=1.3.6.1.4.1.18060.0.4.1.2.403.ldif
( no revision )
  ldap-schema/src/main/resources/schema/ou=schema/cn=adsconfig/ou=attributetypes/m-oid=1.3.6.1.4.1.18060.0.4.1.2.160.ldif
( no revision )
  ldap-schema/src/main/resources/schema/ou=schema/cn=adsconfig/ou=attributetypes/m-oid=1.3.6.1.4.1.18060.0.4.1.2.152.ldif
( no revision )
  ldap-schema/src/main/resources/schema/ou=schema/cn=adsconfig/ou=attributetypes/m-oid=1.3.6.1.4.1.18060.0.4.1.2.306.ldif
( no revision )
  ldap-schema/src/main/resources/schema/ou=schema/cn=adsconfig/ou=attributetypes/m-oid=1.3.6.1.4.1.18060.0.4.1.2.108.ldif
( no revision )
  ldap-schema/src/main/resources/schema/ou=schema/cn=adsconfig/ou=attributetypes/m-oid=1.3.6.1.4.1.18060.0.4.1.2.407.ldif
( no revision )
  ldap-schema/src/main/resources/schema/ou=schema/cn=adsconfig/ou=attributetypes/m-oid=1.3.6.1.4.1.18060.0.4.1.2.164.ldif
( no revision )
  ldap-schema/src/main/resources/schema/ou=schema/cn=adsconfig/ou=attributetypes/m-oid=1.3.6.1.4.1.18060.0.4.1.2.803.ldif
( no revision )
  ldap-schema/src/main/resources/schema/ou=schema/cn=adsconfig/ou=attributetypes/m-oid=1.3.6.1.4.1.18060.0.4.1.2.64.ldif
( no revision )
  ldap-schema/src/main/resources/schema/ou=schema/cn=adsconfig/ou=attributetypes/m-oid=1.3.6.1.4.1.18060.0.4.1.2.101.ldif
( no revision )
  ldap-schema/src/main/resources/schema/ou=schema/cn=adsconfig/ou=attributetypes/m-oid=1.3.6.1.4.1.18060.0.4.1.2.121.ldif
( no revision )
  ldap-schema/src/main/resources/schema/ou=schema/cn=adsconfig/ou=attributetypes/m-oid=1.3.6.1.4.1.18060.0.4.1.2.400.ldif
( no revision )
  ldap-schema/src/main/resources/schema/ou=schema/cn=adsconfig/ou=attributetypes/m-oid=1.3.6.1.4.1.18060.0.4.1.2.113.ldif
( no revision )
  ldap-schema/src/main/resources/schema/ou=schema/cn=adsconfig/ou=attributetypes/m-oid=1.3.6.1.4.1.18060.0.4.1.2.141.ldif
( no revision )
  ldap-schema/src/main/resources/schema/ou=schema/cn=adsconfig/ou=attributetypes/m-oid=1.3.6.1.4.1.18060.0.4.1.2.105.ldif
( no revision )
  ldap-schema/src/main/resources/schema/ou=schema/cn=adsconfig/ou=attributetypes/m-oid=1.3.6.1.4.1.18060.0.4.1.2.303.ldif
( no revision )
  ldap-schema/src/main/resources/schema/ou=schema/cn=adsconfig/ou=attributetypes/m-oid=1.3.6.1.4.1.18060.0.4.1.2.250.ldif
( no revision )
  ldap-schema/src/main/resources/schema/ou=schema/cn=adsconfig/ou=attributetypes/m-oid=1.3.6.1.4.1.18060.0.4.1.2.412.ldif
( no revision )
  ldap-schema/src/main/resources/schema/ou=schema/cn=adsconfig/ou=attributetypes/m-oid=1.3.6.1.4.1.18060.0.4.1.2.161.ldif
( no revision )
  ldap-schema/src/main/resources/schema/ou=schema/cn=adsconfig/ou=attributetypes/m-oid=1.3.6.1.4.1.18060.0.4.1.2.404.ldif
( no revision )
  ldap-schema/src/main/resources/schema/ou=schema/cn=adsconfig/ou=attributetypes/m-oid=1.3.6.1.4.1.18060.0.4.1.2.800.ldif
( no revision )
  ldap-schema/src/main/resources/schema/ou=schema/cn=adsconfig/ou=attributetypes/m-oid=1.3.6.1.4.1.18060.0.4.1.2.153.ldif
( no revision )
  ldap-schema/src/main/resources/schema/ou=schema/cn=adsconfig/ou=attributetypes/m-oid=1.3.6.1.4.1.18060.0.4.1.2.109.ldif
( no revision )
  ldap-schema/src/main/resources/schema/ou=schema/cn=adsconfig/ou=attributetypes/m-oid=1.3.6.1.4.1.18060.0.4.1.2.307.ldif
( no revision )
  ldap-schema/src/main/resources/schema/ou=schema/cn=adsconfig/ou=attributetypes/m-oid=1.3.6.1.4.1.18060.0.4.1.2.408.ldif
( no revision )
  ldap-schema/src/main/resources/schema/ou=schema/cn=adsconfig/ou=attributetypes/m-oid=1.3.6.1.4.1.18060.0.4.1.2.61.ldif
( no revision )
  ldap-schema/src/main/resources/schema/ou=schema/cn=adsconfig/ou=attributetypes/m-oid=1.3.6.1.4.1.18060.0.4.1.2.110.ldif
( no revision )
  ldap-schema/src/main/resources/schema/ou=schema/cn=adsconfig/ou=attributetypes/m-oid=1.3.6.1.4.1.18060.0.4.1.2.102.ldif
( no revision )
  ldap-schema/src/main/resources/schema/ou=schema/cn=adsconfig/ou=attributetypes/m-oid=1.3.6.1.4.1.18060.0.4.1.2.300.ldif
( no revision )
  ldap-schema/src/main/resources/schema/ou=schema/cn=adsconfig/ou=attributetypes/m-oid=1.3.6.1.4.1.18060.0.4.1.2.130.ldif
( no revision )
  ldap-schema/src/main/resources/schema/ou=schema/cn=adsconfig/ou=attributetypes/m-oid=1.3.6.1.4.1.18060.0.4.1.2.401.ldif
( no revision )
  ldap-schema/src/main/resources/schema/ou=schema/cn=adsconfig/ou=attributetypes/m-oid=1.3.6.1.4.1.18060.0.4.1.2.150.ldif
( no revision )
  ldap-schema/src/main/resources/schema/ou=schema/cn=adsconfig/ou=attributetypes/m-oid=1.3.6.1.4.1.18060.0.4.1.2.114.ldif
( no revision )
  ldap-schema/src/main/resources/schema/ou=schema/cn=adsconfig/ou=attributetypes/m-oid=1.3.6.1.4.1.18060.0.4.1.2.142.ldif
( no revision )
  ldap-schema/src/main/resources/schema/ou=schema/cn=adsconfig/ou=attributetypes/m-oid=1.3.6.1.4.1.18060.0.4.1.2.106.ldif
( no revision )
  ldap-schema/src/main/resources/schema/ou=schema/cn=adsconfig/ou=attributetypes/m-oid=1.3.6.1.4.1.18060.0.4.1.2.304.ldif
( no revision )
  ldap-schema/src/main/resources/schema/ou=schema/cn=adsconfig/ou=attributetypes/m-oid=1.3.6.1.4.1.18060.0.4.1.2.251.ldif
( no revision )
  ldap-schema/src/main/resources/schema/ou=schema/cn=adsconfig/ou=attributetypes/m-oid=1.3.6.1.4.1.18060.0.4.1.2.801.ldif
( no revision )
  ldap-schema/src/main/resources/schema/ou=schema/cn=adsconfig/ou=attributetypes/m-oid=1.3.6.1.4.1.18060.0.4.1.2.162.ldif
( no revision )
  ldap-schema/src/main/resources/schema/ou=schema/cn=adsconfig/ou=attributetypes/m-oid=1.3.6.1.4.1.18060.0.4.1.2.405.ldif
( no revision )
  ldap-schema/src/main/resources/schema/ou=schema/cn=adsconfig/ou=attributetypes/m-oid=1.3.6.1.4.1.18060.0.4.1.2.308.ldif
( no revision )
  ldap-schema/src/main/resources/schema/ou=schema/cn=adsconfig/ou=attributetypes/m-oid=1.3.6.1.4.1.18060.0.4.1.2.409.ldif
( no revision )
  ldap-schema/src/main/resources/schema/ou=schema/cn=adsconfig/ou=attributetypes/m-oid=1.3.6.1.4.1.18060.0.4.1.2.62.ldif
( no revision )
  ldap-schema/src/main/resources/schema/ou=schema/cn=adsconfig/ou=ditstructurerules.ldif (
no revision )
  ldap-schema/src/main/resources/schema/ou=schema/cn=adsconfig/ou=syntaxcheckers.ldif ( no
revision )
  ldap-schema/src/main/resources/schema/ou=schema/cn=adsconfig/ou=syntaxes.ldif ( no revision
)
  ldap-schema/src/main/resources/schema/ou=schema/cn=adsconfig/ou=matchingruleuse.ldif ( no
revision )

****************************************************************************
Dependencies Changes:
****************************************************************************
No dependencies changed


****************************************************************************
Build Definition:
****************************************************************************
POM filename: pom.xml
Goals: clean deploy   
Arguments: --batch-mode -Dintegration
Build Fresh: false
Always Build: false
Default Build Definition: true
Schedule: DEFAULT_SCHEDULE
Profile Name: Maven 2.0.9, Java 5, Large Memory
Description: clean deploy

****************************************************************************
Test Summary:
****************************************************************************
Tests: 2723
Failures: 4
Errors: 0
Success Rate: 99
Total time: 192.62599

****************************************************************************
Test Failures:
****************************************************************************

SchemaManagerLoadWithDepsTest
    testLoadOther :
  java.lang.AssertionError
  java.lang.AssertionError: expected:<50> but was:<48>
	at org.junit.Assert.fail(Assert.java:91)
	at org.junit.Assert.failNotEquals(Assert.java:645)
	at org.junit.Assert.assertEquals(Assert.java:126)
	at org.junit.Assert.assertEquals(Assert.java:470)
	at org.junit.Assert.assertEquals(Assert.java:454)
	at org.apache.directory.shared.ldap.schema.loader.ldif.SchemaManagerLoadWithDepsTest.testLoadOther(SchemaManagerLoadWithDepsTest.java:254)
	at sun.reflect.NativeMethodAccessorImpl.invoke0(Native Method)
	at sun.reflect.NativeMethodAccessorImpl.invoke(NativeMethodAccessorImpl.java:39)
	at sun.reflect.DelegatingMethodAccessorImpl.invoke(DelegatingMethodAccessorImpl.java:25)
	at java.lang.reflect.Method.invoke(Method.java:585)
	at org.junit.runners.model.FrameworkMethod$1.runReflectiveCall(FrameworkMethod.java:44)
	at org.junit.internal.runners.model.ReflectiveCallable.run(ReflectiveCallable.java:15)
	at org.junit.runners.model.FrameworkMethod.invokeExplosively(FrameworkMethod.java:41)
	at org.junit.internal.runners.statements.InvokeMethod.evaluate(InvokeMethod.java:20)
	at org.junit.runners.BlockJUnit4ClassRunner.runChild(BlockJUnit4ClassRunner.java:76)
	at org.junit.runners.BlockJUnit4ClassRunner.runChild(BlockJUnit4ClassRunner.java:50)
	at org.junit.runners.ParentRunner$3.run(ParentRunner.java:193)
	at org.junit.runners.ParentRunner$1.schedule(ParentRunner.java:52)
	at org.junit.runners.ParentRunner.runChildren(ParentRunner.java:191)
	at org.junit.runners.ParentRunner.access$000(ParentRunner.java:42)
	at org.junit.runners.ParentRunner$2.evaluate(ParentRunner.java:184)
	at org.junit.internal.runners.statements.RunBefores.evaluate(RunBefores.java:28)
	at org.junit.internal.runners.statements.RunAfters.evaluate(RunAfters.java:31)
	at org.junit.runners.ParentRunner.run(ParentRunner.java:236)
	at org.apache.maven.surefire.junit4.JUnit4TestSet.execute(JUnit4TestSet.java:62)
	at org.apache.maven.surefire.suite.AbstractDirectoryTestSuite.executeTestSet(AbstractDirectoryTestSuite.java:140)
	at org.apache.maven.surefire.suite.AbstractDirectoryTestSuite.execute(AbstractDirectoryTestSuite.java:127)
	at org.apache.maven.surefire.Surefire.run(Surefire.java:177)
	at sun.reflect.NativeMethodAccessorImpl.invoke0(Native Method)
	at sun.reflect.NativeMethodAccessorImpl.invoke(NativeMethodAccessorImpl.java:39)
	at sun.reflect.DelegatingMethodAccessorImpl.invoke(DelegatingMethodAccessorImpl.java:25)
	at java.lang.reflect.Method.invoke(Method.java:585)
	at org.apache.maven.surefire.booter.SurefireBooter.runSuitesInProcess(SurefireBooter.java:345)
	at org.apache.maven.surefire.booter.SurefireBooter.main(SurefireBooter.java:1009)

  SchemaManagerEnableDisableLoadTest
    testLoadAllEnabled :
  java.lang.AssertionError
  java.lang.AssertionError: expected:<50> but was:<48>
	at org.junit.Assert.fail(Assert.java:91)
	at org.junit.Assert.failNotEquals(Assert.java:645)
	at org.junit.Assert.assertEquals(Assert.java:126)
	at org.junit.Assert.assertEquals(Assert.java:470)
	at org.junit.Assert.assertEquals(Assert.java:454)
	at org.apache.directory.shared.ldap.schema.loader.ldif.SchemaManagerEnableDisableLoadTest.testLoadAllEnabled(SchemaManagerEnableDisableLoadTest.java:153)
	at sun.reflect.NativeMethodAccessorImpl.invoke0(Native Method)
	at sun.reflect.NativeMethodAccessorImpl.invoke(NativeMethodAccessorImpl.java:39)
	at sun.reflect.DelegatingMethodAccessorImpl.invoke(DelegatingMethodAccessorImpl.java:25)
	at java.lang.reflect.Method.invoke(Method.java:585)
	at org.junit.runners.model.FrameworkMethod$1.runReflectiveCall(FrameworkMethod.java:44)
	at org.junit.internal.runners.model.ReflectiveCallable.run(ReflectiveCallable.java:15)
	at org.junit.runners.model.FrameworkMethod.invokeExplosively(FrameworkMethod.java:41)
	at org.junit.internal.runners.statements.InvokeMethod.evaluate(InvokeMethod.java:20)
	at org.junit.internal.runners.statements.RunBefores.evaluate(RunBefores.java:28)
	at org.junit.runners.BlockJUnit4ClassRunner.runChild(BlockJUnit4ClassRunner.java:76)
	at org.junit.runners.BlockJUnit4ClassRunner.runChild(BlockJUnit4ClassRunner.java:50)
	at org.junit.runners.ParentRunner$3.run(ParentRunner.java:193)
	at org.junit.runners.ParentRunner$1.schedule(ParentRunner.java:52)
	at org.junit.runners.ParentRunner.runChildren(ParentRunner.java:191)
	at org.junit.runners.ParentRunner.access$000(ParentRunner.java:42)
	at org.junit.runners.ParentRunner$2.evaluate(ParentRunner.java:184)
	at org.junit.internal.runners.statements.RunBefores.evaluate(RunBefores.java:28)
	at org.junit.internal.runners.statements.RunAfters.evaluate(RunAfters.java:31)
	at org.junit.runners.ParentRunner.run(ParentRunner.java:236)
	at org.apache.maven.surefire.junit4.JUnit4TestSet.execute(JUnit4TestSet.java:62)
	at org.apache.maven.surefire.suite.AbstractDirectoryTestSuite.executeTestSet(AbstractDirectoryTestSuite.java:140)
	at org.apache.maven.surefire.suite.AbstractDirectoryTestSuite.execute(AbstractDirectoryTestSuite.java:127)
	at org.apache.maven.surefire.Surefire.run(Surefire.java:177)
	at sun.reflect.NativeMethodAccessorImpl.invoke0(Native Method)
	at sun.reflect.NativeMethodAccessorImpl.invoke(NativeMethodAccessorImpl.java:39)
	at sun.reflect.DelegatingMethodAccessorImpl.invoke(DelegatingMethodAccessorImpl.java:25)
	at java.lang.reflect.Method.invoke(Method.java:585)
	at org.apache.maven.surefire.booter.SurefireBooter.runSuitesInProcess(SurefireBooter.java:345)
	at org.apache.maven.surefire.booter.SurefireBooter.main(SurefireBooter.java:1009)

    testEnableDisabled :
  java.lang.AssertionError
  java.lang.AssertionError: expected:<51> but was:<49>
	at org.junit.Assert.fail(Assert.java:91)
	at org.junit.Assert.failNotEquals(Assert.java:645)
	at org.junit.Assert.assertEquals(Assert.java:126)
	at org.junit.Assert.assertEquals(Assert.java:470)
	at org.junit.Assert.assertEquals(Assert.java:454)
	at org.apache.directory.shared.ldap.schema.loader.ldif.SchemaManagerEnableDisableLoadTest.testEnableDisabled(SchemaManagerEnableDisableLoadTest.java:198)
	at sun.reflect.NativeMethodAccessorImpl.invoke0(Native Method)
	at sun.reflect.NativeMethodAccessorImpl.invoke(NativeMethodAccessorImpl.java:39)
	at sun.reflect.DelegatingMethodAccessorImpl.invoke(DelegatingMethodAccessorImpl.java:25)
	at java.lang.reflect.Method.invoke(Method.java:585)
	at org.junit.runners.model.FrameworkMethod$1.runReflectiveCall(FrameworkMethod.java:44)
	at org.junit.internal.runners.model.ReflectiveCallable.run(ReflectiveCallable.java:15)
	at org.junit.runners.model.FrameworkMethod.invokeExplosively(FrameworkMethod.java:41)
	at org.junit.internal.runners.statements.InvokeMethod.evaluate(InvokeMethod.java:20)
	at org.junit.internal.runners.statements.RunBefores.evaluate(RunBefores.java:28)
	at org.junit.runners.BlockJUnit4ClassRunner.runChild(BlockJUnit4ClassRunner.java:76)
	at org.junit.runners.BlockJUnit4ClassRunner.runChild(BlockJUnit4ClassRunner.java:50)
	at org.junit.runners.ParentRunner$3.run(ParentRunner.java:193)
	at org.junit.runners.ParentRunner$1.schedule(ParentRunner.java:52)
	at org.junit.runners.ParentRunner.runChildren(ParentRunner.java:191)
	at org.junit.runners.ParentRunner.access$000(ParentRunner.java:42)
	at org.junit.runners.ParentRunner$2.evaluate(ParentRunner.java:184)
	at org.junit.internal.runners.statements.RunBefores.evaluate(RunBefores.java:28)
	at org.junit.internal.runners.statements.RunAfters.evaluate(RunAfters.java:31)
	at org.junit.runners.ParentRunner.run(ParentRunner.java:236)
	at org.apache.maven.surefire.junit4.JUnit4TestSet.execute(JUnit4TestSet.java:62)
	at org.apache.maven.surefire.suite.AbstractDirectoryTestSuite.executeTestSet(AbstractDirectoryTestSuite.java:140)
	at org.apache.maven.surefire.suite.AbstractDirectoryTestSuite.execute(AbstractDirectoryTestSuite.java:127)
	at org.apache.maven.surefire.Surefire.run(Surefire.java:177)
	at sun.reflect.NativeMethodAccessorImpl.invoke0(Native Method)
	at sun.reflect.NativeMethodAccessorImpl.invoke(NativeMethodAccessorImpl.java:39)
	at sun.reflect.DelegatingMethodAccessorImpl.invoke(DelegatingMethodAccessorImpl.java:25)
	at java.lang.reflect.Method.invoke(Method.java:585)
	at org.apache.maven.surefire.booter.SurefireBooter.runSuitesInProcess(SurefireBooter.java:345)
	at org.apache.maven.surefire.booter.SurefireBooter.main(SurefireBooter.java:1009)


    testDisableEnabled :
  java.lang.AssertionError
  java.lang.AssertionError: expected:<50> but was:<48>
	at org.junit.Assert.fail(Assert.java:91)
	at org.junit.Assert.failNotEquals(Assert.java:645)
	at org.junit.Assert.assertEquals(Assert.java:126)
	at org.junit.Assert.assertEquals(Assert.java:470)
	at org.junit.Assert.assertEquals(Assert.java:454)
	at org.apache.directory.shared.ldap.schema.loader.ldif.SchemaManagerEnableDisableLoadTest.testDisableEnabled(SchemaManagerEnableDisableLoadTest.java:238)
	at sun.reflect.NativeMethodAccessorImpl.invoke0(Native Method)
	at sun.reflect.NativeMethodAccessorImpl.invoke(NativeMethodAccessorImpl.java:39)
	at sun.reflect.DelegatingMethodAccessorImpl.invoke(DelegatingMethodAccessorImpl.java:25)
	at java.lang.reflect.Method.invoke(Method.java:585)
	at org.junit.runners.model.FrameworkMethod$1.runReflectiveCall(FrameworkMethod.java:44)
	at org.junit.internal.runners.model.ReflectiveCallable.run(ReflectiveCallable.java:15)
	at org.junit.runners.model.FrameworkMethod.invokeExplosively(FrameworkMethod.java:41)
	at org.junit.internal.runners.statements.InvokeMethod.evaluate(InvokeMethod.java:20)
	at org.junit.internal.runners.statements.RunBefores.evaluate(RunBefores.java:28)
	at org.junit.runners.BlockJUnit4ClassRunner.runChild(BlockJUnit4ClassRunner.java:76)
	at org.junit.runners.BlockJUnit4ClassRunner.runChild(BlockJUnit4ClassRunner.java:50)
	at org.junit.runners.ParentRunner$3.run(ParentRunner.java:193)
	at org.junit.runners.ParentRunner$1.schedule(ParentRunner.java:52)
	at org.junit.runners.ParentRunner.runChildren(ParentRunner.java:191)
	at org.junit.runners.ParentRunner.access$000(ParentRunner.java:42)
	at org.junit.runners.ParentRunner$2.evaluate(ParentRunner.java:184)
	at org.junit.internal.runners.statements.RunBefores.evaluate(RunBefores.java:28)
	at org.junit.internal.runners.statements.RunAfters.evaluate(RunAfters.java:31)
	at org.junit.runners.ParentRunner.run(ParentRunner.java:236)
	at org.apache.maven.surefire.junit4.JUnit4TestSet.execute(JUnit4TestSet.java:62)
	at org.apache.maven.surefire.suite.AbstractDirectoryTestSuite.executeTestSet(AbstractDirectoryTestSuite.java:140)
	at org.apache.maven.surefire.suite.AbstractDirectoryTestSuite.execute(AbstractDirectoryTestSuite.java:127)
	at org.apache.maven.surefire.Surefire.run(Surefire.java:177)
	at sun.reflect.NativeMethodAccessorImpl.invoke0(Native Method)
	at sun.reflect.NativeMethodAccessorImpl.invoke(NativeMethodAccessorImpl.java:39)
	at sun.reflect.DelegatingMethodAccessorImpl.invoke(DelegatingMethodAccessorImpl.java:25)
	at java.lang.reflect.Method.invoke(Method.java:585)
	at org.apache.maven.surefire.booter.SurefireBooter.runSuitesInProcess(SurefireBooter.java:345)
	at org.apache.maven.surefire.booter.SurefireBooter.main(SurefireBooter.java:1009)

  



Mime
View raw message