directory-commits mailing list archives

Site index · List index
Message view « Date » · « Thread »
Top « Date » · « Thread »
From "Continuum@vmbuild.apache.org" <contin...@apache.org>
Subject [continuum] BUILD FAILURE: Directory - ApacheDS - clean deploy
Date Thu, 23 Jul 2009 16:23:44 GMT
Online report : http://vmbuild.apache.org/continuum/buildResult.action?buildId=201991&projectId=1501

Build statistics:
  State: Failed
  Previous State: Failed
  Started at: Thu 23 Jul 2009 08:38:41 -0700
  Finished at: Thu 23 Jul 2009 09:22:25 -0700
  Total time: 43m 43s
  Build Trigger: Schedule
  Build Number: 19
  Exit code: 1
  Building machine hostname: vmbuild.apache.org
  Operating system : Linux(unknown)
  Java Home version : 
          java version "1.5.0_12"
          Java(TM) 2 Runtime Environment, Standard Edition (build 1.5.0_12-b04)
          Java HotSpot(TM) Client VM (build 1.5.0_12-b04, mixed mode, sharing)
        
  Builder version :
          Maven version: 2.0.9
          Java version: 1.5.0_12
          OS name: "linux" version: "2.6.24-23-server" arch: "i386" Family: "unix"
    
****************************************************************************
SCM Changes:
****************************************************************************
Changed: pamarcelot @ Thu 23 Jul 2009 07:37:41 -0700
Comment: Fix for DIRSERVER-1381 (problem using apacheds-tools.jar : ClassCastException during
import).
Files changed:
  /directory/apacheds/trunk/server-tools/src/main/java/org/apache/directory/server/tools/ImportCommand.java
( 797086 )
  /directory/shared/trunk/dsml-parser/src/main/java/org/apache/directory/shared/dsmlv2/request/AddRequestDsml.java
( 797086 )
  /directory/shared/trunk/ldap/src/main/java/org/apache/directory/shared/ldap/codec/actions/ValueAction.java
( 797086 )
  /directory/shared/trunk/ldap/src/main/java/org/apache/directory/shared/ldap/codec/add/AddRequestCodec.java
( 797086 )

Changed: pamarcelot @ Thu 23 Jul 2009 08:15:28 -0700
Comment: Fix for DIRSERVER-1386 (Get rid of the MANIFEST.MF file of the server-tools project)
Files changed:
  /directory/apacheds/trunk/server-tools/pom.xml ( 797099 )
  /directory/apacheds/trunk/server-tools/src/main/manifest ( 797099 )

****************************************************************************
Dependencies Changes:
****************************************************************************
No dependencies changed


****************************************************************************
Build Definition:
****************************************************************************
POM filename: pom.xml
Goals: clean deploy   
Arguments: --batch-mode -Dintegration
Build Fresh: false
Always Build: false
Default Build Definition: true
Schedule: DEFAULT_SCHEDULE
Profile Name: Maven 2.0.9, Java 5, Large Memory
Description: clean deploy

****************************************************************************
Test Summary:
****************************************************************************
Tests: 1552
Failures: 4
Errors: 2
Success Rate: 99
Total time: 1475.5359

****************************************************************************
Test Failures:
****************************************************************************

StockServerISuite
    testRequestConstrainedUnlimitByConfiguration :
  java.lang.AssertionError
  java.lang.AssertionError: Expected exception: javax.naming.TimeLimitExceededException
	at org.junit.internal.runners.statements.ExpectException.evaluate(ExpectException.java:33)
	at org.junit.internal.runners.statements.RunBefores.evaluate(RunBefores.java:28)
	at org.junit.internal.runners.statements.RunAfters.evaluate(RunAfters.java:31)
	at org.apache.directory.server.integ.state.TestServerContext.invokeTest(TestServerContext.java:219)
	at org.apache.directory.server.integ.state.StartedNormalState.test(StartedNormalState.java:167)
	at org.apache.directory.server.integ.state.TestServerContext.test(TestServerContext.java:193)
	at org.apache.directory.server.integ.SiRunner.runChild(SiRunner.java:112)
	at org.apache.directory.server.integ.SiRunner.runChild(SiRunner.java:46)
	at org.junit.runners.ParentRunner.runChildren(ParentRunner.java:180)
	at org.junit.runners.ParentRunner.access$000(ParentRunner.java:41)
	at org.junit.runners.ParentRunner$1.evaluate(ParentRunner.java:173)
	at org.junit.internal.runners.statements.RunBefores.evaluate(RunBefores.java:28)
	at org.junit.internal.runners.statements.RunAfters.evaluate(RunAfters.java:31)
	at org.junit.runners.ParentRunner.run(ParentRunner.java:220)
	at org.apache.directory.server.integ.SiRunner.run(SiRunner.java:78)
	at org.junit.runners.Suite.runChild(Suite.java:115)
	at org.junit.runners.Suite.runChild(Suite.java:23)
	at org.junit.runners.ParentRunner.runChildren(ParentRunner.java:180)
	at org.junit.runners.ParentRunner.access$000(ParentRunner.java:41)
	at org.junit.runners.ParentRunner$1.evaluate(ParentRunner.java:173)
	at org.junit.internal.runners.statements.RunBefores.evaluate(RunBefores.java:28)
	at org.junit.internal.runners.statements.RunAfters.evaluate(RunAfters.java:31)
	at org.junit.runners.ParentRunner.run(ParentRunner.java:220)
	at org.apache.directory.server.integ.SiSuite.run(SiSuite.java:57)
	at org.apache.maven.surefire.junit4.JUnit4TestSet.execute(JUnit4TestSet.java:62)
	at org.apache.maven.surefire.suite.AbstractDirectoryTestSuite.executeTestSet(AbstractDirectoryTestSuite.java:140)
	at org.apache.maven.surefire.suite.AbstractDirectoryTestSuite.execute(AbstractDirectoryTestSuite.java:127)
	at org.apache.maven.surefire.Surefire.run(Surefire.java:177)
	at sun.reflect.NativeMethodAccessorImpl.invoke0(Native Method)
	at sun.reflect.NativeMethodAccessorImpl.invoke(NativeMethodAccessorImpl.java:39)
	at sun.reflect.DelegatingMethodAccessorImpl.invoke(DelegatingMethodAccessorImpl.java:25)
	at java.lang.reflect.Method.invoke(Method.java:585)
	at org.apache.maven.surefire.booter.SurefireBooter.runSuitesInProcess(SurefireBooter.java:345)
	at org.apache.maven.surefire.booter.SurefireBooter.main(SurefireBooter.java:1009)

    testRequestConstrainedLessThanConfiguration :
  java.lang.AssertionError
  java.lang.AssertionError: Expected exception: javax.naming.TimeLimitExceededException
	at org.junit.internal.runners.statements.ExpectException.evaluate(ExpectException.java:33)
	at org.junit.internal.runners.statements.RunBefores.evaluate(RunBefores.java:28)
	at org.junit.internal.runners.statements.RunAfters.evaluate(RunAfters.java:31)
	at org.apache.directory.server.integ.state.TestServerContext.invokeTest(TestServerContext.java:219)
	at org.apache.directory.server.integ.state.StartedNormalState.test(StartedNormalState.java:167)
	at org.apache.directory.server.integ.state.TestServerContext.test(TestServerContext.java:193)
	at org.apache.directory.server.integ.SiRunner.runChild(SiRunner.java:112)
	at org.apache.directory.server.integ.SiRunner.runChild(SiRunner.java:46)
	at org.junit.runners.ParentRunner.runChildren(ParentRunner.java:180)
	at org.junit.runners.ParentRunner.access$000(ParentRunner.java:41)
	at org.junit.runners.ParentRunner$1.evaluate(ParentRunner.java:173)
	at org.junit.internal.runners.statements.RunBefores.evaluate(RunBefores.java:28)
	at org.junit.internal.runners.statements.RunAfters.evaluate(RunAfters.java:31)
	at org.junit.runners.ParentRunner.run(ParentRunner.java:220)
	at org.apache.directory.server.integ.SiRunner.run(SiRunner.java:78)
	at org.junit.runners.Suite.runChild(Suite.java:115)
	at org.junit.runners.Suite.runChild(Suite.java:23)
	at org.junit.runners.ParentRunner.runChildren(ParentRunner.java:180)
	at org.junit.runners.ParentRunner.access$000(ParentRunner.java:41)
	at org.junit.runners.ParentRunner$1.evaluate(ParentRunner.java:173)
	at org.junit.internal.runners.statements.RunBefores.evaluate(RunBefores.java:28)
	at org.junit.internal.runners.statements.RunAfters.evaluate(RunAfters.java:31)
	at org.junit.runners.ParentRunner.run(ParentRunner.java:220)
	at org.apache.directory.server.integ.SiSuite.run(SiSuite.java:57)
	at org.apache.maven.surefire.junit4.JUnit4TestSet.execute(JUnit4TestSet.java:62)
	at org.apache.maven.surefire.suite.AbstractDirectoryTestSuite.executeTestSet(AbstractDirectoryTestSuite.java:140)
	at org.apache.maven.surefire.suite.AbstractDirectoryTestSuite.execute(AbstractDirectoryTestSuite.java:127)
	at org.apache.maven.surefire.Surefire.run(Surefire.java:177)
	at sun.reflect.NativeMethodAccessorImpl.invoke0(Native Method)
	at sun.reflect.NativeMethodAccessorImpl.invoke(NativeMethodAccessorImpl.java:39)
	at sun.reflect.DelegatingMethodAccessorImpl.invoke(DelegatingMethodAccessorImpl.java:25)
	at java.lang.reflect.Method.invoke(Method.java:585)
	at org.apache.maven.surefire.booter.SurefireBooter.runSuitesInProcess(SurefireBooter.java:345)
	at org.apache.maven.surefire.booter.SurefireBooter.main(SurefireBooter.java:1009)


    testRequestConstrainedGreaterThanConfiguration :
  java.lang.AssertionError
  java.lang.AssertionError: Expected exception: javax.naming.TimeLimitExceededException
	at org.junit.internal.runners.statements.ExpectException.evaluate(ExpectException.java:33)
	at org.junit.internal.runners.statements.RunBefores.evaluate(RunBefores.java:28)
	at org.junit.internal.runners.statements.RunAfters.evaluate(RunAfters.java:31)
	at org.apache.directory.server.integ.state.TestServerContext.invokeTest(TestServerContext.java:219)
	at org.apache.directory.server.integ.state.StartedNormalState.test(StartedNormalState.java:167)
	at org.apache.directory.server.integ.state.TestServerContext.test(TestServerContext.java:193)
	at org.apache.directory.server.integ.SiRunner.runChild(SiRunner.java:112)
	at org.apache.directory.server.integ.SiRunner.runChild(SiRunner.java:46)
	at org.junit.runners.ParentRunner.runChildren(ParentRunner.java:180)
	at org.junit.runners.ParentRunner.access$000(ParentRunner.java:41)
	at org.junit.runners.ParentRunner$1.evaluate(ParentRunner.java:173)
	at org.junit.internal.runners.statements.RunBefores.evaluate(RunBefores.java:28)
	at org.junit.internal.runners.statements.RunAfters.evaluate(RunAfters.java:31)
	at org.junit.runners.ParentRunner.run(ParentRunner.java:220)
	at org.apache.directory.server.integ.SiRunner.run(SiRunner.java:78)
	at org.junit.runners.Suite.runChild(Suite.java:115)
	at org.junit.runners.Suite.runChild(Suite.java:23)
	at org.junit.runners.ParentRunner.runChildren(ParentRunner.java:180)
	at org.junit.runners.ParentRunner.access$000(ParentRunner.java:41)
	at org.junit.runners.ParentRunner$1.evaluate(ParentRunner.java:173)
	at org.junit.internal.runners.statements.RunBefores.evaluate(RunBefores.java:28)
	at org.junit.internal.runners.statements.RunAfters.evaluate(RunAfters.java:31)
	at org.junit.runners.ParentRunner.run(ParentRunner.java:220)
	at org.apache.directory.server.integ.SiSuite.run(SiSuite.java:57)
	at org.apache.maven.surefire.junit4.JUnit4TestSet.execute(JUnit4TestSet.java:62)
	at org.apache.maven.surefire.suite.AbstractDirectoryTestSuite.executeTestSet(AbstractDirectoryTestSuite.java:140)
	at org.apache.maven.surefire.suite.AbstractDirectoryTestSuite.execute(AbstractDirectoryTestSuite.java:127)
	at org.apache.maven.surefire.Surefire.run(Surefire.java:177)
	at sun.reflect.NativeMethodAccessorImpl.invoke0(Native Method)
	at sun.reflect.NativeMethodAccessorImpl.invoke(NativeMethodAccessorImpl.java:39)
	at sun.reflect.DelegatingMethodAccessorImpl.invoke(DelegatingMethodAccessorImpl.java:25)
	at java.lang.reflect.Method.invoke(Method.java:585)
	at org.apache.maven.surefire.booter.SurefireBooter.runSuitesInProcess(SurefireBooter.java:345)
	at org.apache.maven.surefire.booter.SurefireBooter.main(SurefireBooter.java:1009)


    testNonAdminRequestUnlimitedConfigurationLimited :
  java.lang.AssertionError
  java.lang.AssertionError: Expected exception: javax.naming.TimeLimitExceededException
	at org.junit.internal.runners.statements.ExpectException.evaluate(ExpectException.java:33)
	at org.junit.internal.runners.statements.RunBefores.evaluate(RunBefores.java:28)
	at org.junit.internal.runners.statements.RunAfters.evaluate(RunAfters.java:31)
	at org.apache.directory.server.integ.state.TestServerContext.invokeTest(TestServerContext.java:219)
	at org.apache.directory.server.integ.state.StartedNormalState.test(StartedNormalState.java:167)
	at org.apache.directory.server.integ.state.TestServerContext.test(TestServerContext.java:193)
	at org.apache.directory.server.integ.SiRunner.runChild(SiRunner.java:112)
	at org.apache.directory.server.integ.SiRunner.runChild(SiRunner.java:46)
	at org.junit.runners.ParentRunner.runChildren(ParentRunner.java:180)
	at org.junit.runners.ParentRunner.access$000(ParentRunner.java:41)
	at org.junit.runners.ParentRunner$1.evaluate(ParentRunner.java:173)
	at org.junit.internal.runners.statements.RunBefores.evaluate(RunBefores.java:28)
	at org.junit.internal.runners.statements.RunAfters.evaluate(RunAfters.java:31)
	at org.junit.runners.ParentRunner.run(ParentRunner.java:220)
	at org.apache.directory.server.integ.SiRunner.run(SiRunner.java:78)
	at org.junit.runners.Suite.runChild(Suite.java:115)
	at org.junit.runners.Suite.runChild(Suite.java:23)
	at org.junit.runners.ParentRunner.runChildren(ParentRunner.java:180)
	at org.junit.runners.ParentRunner.access$000(ParentRunner.java:41)
	at org.junit.runners.ParentRunner$1.evaluate(ParentRunner.java:173)
	at org.junit.internal.runners.statements.RunBefores.evaluate(RunBefores.java:28)
	at org.junit.internal.runners.statements.RunAfters.evaluate(RunAfters.java:31)
	at org.junit.runners.ParentRunner.run(ParentRunner.java:220)
	at org.apache.directory.server.integ.SiSuite.run(SiSuite.java:57)
	at org.apache.maven.surefire.junit4.JUnit4TestSet.execute(JUnit4TestSet.java:62)
	at org.apache.maven.surefire.suite.AbstractDirectoryTestSuite.executeTestSet(AbstractDirectoryTestSuite.java:140)
	at org.apache.maven.surefire.suite.AbstractDirectoryTestSuite.execute(AbstractDirectoryTestSuite.java:127)
	at org.apache.maven.surefire.Surefire.run(Surefire.java:177)
	at sun.reflect.NativeMethodAccessorImpl.invoke0(Native Method)
	at sun.reflect.NativeMethodAccessorImpl.invoke(NativeMethodAccessorImpl.java:39)
	at sun.reflect.DelegatingMethodAccessorImpl.invoke(DelegatingMethodAccessorImpl.java:25)
	at java.lang.reflect.Method.invoke(Method.java:585)
	at org.apache.maven.surefire.booter.SurefireBooter.runSuitesInProcess(SurefireBooter.java:345)
	at org.apache.maven.surefire.booter.SurefireBooter.main(SurefireBooter.java:1009)


  



Mime
View raw message