directory-commits mailing list archives

Site index · List index
Message view « Date » · « Thread »
Top « Date » · « Thread »
From "Continuum@vmbuild.apache.org" <contin...@apache.org>
Subject [continuum] BUILD FAILURE: Directory - ApacheDS - clean deploy
Date Tue, 14 Apr 2009 07:31:04 GMT
Online report : http://vmbuild.apache.org/continuum/buildResult.action?buildId=186925&projectId=1501

Build statistics:
  State: Failed
  Previous State: Ok
  Started at: Tue 14 Apr 2009 00:15:40 -0700
  Finished at: Tue 14 Apr 2009 00:30:35 -0700
  Total time: 14m 55s
  Build Trigger: Schedule
  Build Number: 15
  Exit code: 1
  Building machine hostname: vmbuild.apache.org
  Operating system : Linux(unknown)
  Java Home version : 
          java version "1.5.0_12"
          Java(TM) 2 Runtime Environment, Standard Edition (build 1.5.0_12-b04)
          Java HotSpot(TM) Client VM (build 1.5.0_12-b04, mixed mode, sharing)
        
  Builder version :
          Maven version: 2.0.9
          Java version: 1.5.0_12
          OS name: "linux" version: "2.6.20-16-server" arch: "i386" Family: "unix"
    
****************************************************************************
SCM Changes:
****************************************************************************
Changed: seelmann @ Tue 14 Apr 2009 00:15:07 -0700
Comment: DIRSERVER-1247: Applied patch from Norval Hope with some modifications
Files changed:
  /directory/apacheds/trunk/core/src/main/java/org/apache/directory/server/core/normalization/NormalizingVisitor.java
( 764690 )
  /directory/shared/trunk/ldap/src/main/java/org/apache/directory/shared/ldap/filter/AbstractExprNode.java
( 764690 )
  /directory/shared/trunk/ldap/src/main/java/org/apache/directory/shared/ldap/filter/ApproximateNode.java
( 764690 )
  /directory/shared/trunk/ldap/src/main/java/org/apache/directory/shared/ldap/filter/EqualityNode.java
( 764690 )
  /directory/shared/trunk/ldap/src/main/java/org/apache/directory/shared/ldap/filter/FilterParser.java
( 764690 )
  /directory/shared/trunk/ldap/src/main/java/org/apache/directory/shared/ldap/filter/GreaterEqNode.java
( 764690 )
  /directory/shared/trunk/ldap/src/main/java/org/apache/directory/shared/ldap/filter/LessEqNode.java
( 764690 )
  /directory/shared/trunk/ldap/src/main/java/org/apache/directory/shared/ldap/filter/SimpleNode.java
( 764690 )
  /directory/shared/trunk/ldap/src/main/java/org/apache/directory/shared/ldap/filter/SubstringNode.java
( 764690 )
  /directory/shared/trunk/ldap/src/main/java/org/apache/directory/shared/ldap/name/AttributeTypeAndValue.java
( 764690 )
  /directory/shared/trunk/ldap/src/main/java/org/apache/directory/shared/ldap/util/StringTools.java
( 764690 )
  /directory/shared/trunk/ldap/src/test/java/org/apache/directory/shared/ldap/filter/FilterCloneTest.java
( 764690 )
  /directory/shared/trunk/ldap/src/test/java/org/apache/directory/shared/ldap/filter/FilterParserTest.java
( 764690 )
  /directory/shared/trunk/ldap/src/test/java/org/apache/directory/shared/ldap/name/FastLdapDnParserTest.java
( 764690 )
  /directory/shared/trunk/ldap/src/test/java/org/apache/directory/shared/ldap/name/LdapDNTest.java
( 764690 )
  /directory/shared/trunk/ldap/src/test/java/org/apache/directory/shared/ldap/name/LdapDnParserTest.java
( 764690 )
  /directory/shared/trunk/ldap/src/test/java/org/apache/directory/shared/ldap/name/RdnTest.java
( 764690 )

****************************************************************************
Dependencies Changes:
****************************************************************************
No dependencies changed


****************************************************************************
Build Definition:
****************************************************************************
POM filename: pom.xml
Goals: clean deploy   
Arguments: --batch-mode -Dintegration
Build Fresh: false
Always Build: false
Default Build Definition: true
Schedule: DEFAULT_SCHEDULE
Profile Name: Maven 2.0.9, Java 5, Large Memory
Description: clean deploy

****************************************************************************
Test Summary:
****************************************************************************
Tests: 1444
Failures: 3
Total time: 442.1419

****************************************************************************
Test Failures:
****************************************************************************

StockCoreISuite
    testSearchWithEscapedCharsInFilter :
  java.lang.AssertionError
  java.lang.AssertionError: Expected number of results returned was incorrect! expected:<1>
but was:<0>
	at org.junit.Assert.fail(Assert.java:74)
	at org.junit.Assert.failNotEquals(Assert.java:448)
	at org.junit.Assert.assertEquals(Assert.java:102)
	at org.junit.Assert.assertEquals(Assert.java:323)
	at org.apache.directory.server.core.operations.search.SearchIT.testSearchWithEscapedCharsInFilter(SearchIT.java:1399)
	at sun.reflect.NativeMethodAccessorImpl.invoke0(Native Method)
	at sun.reflect.NativeMethodAccessorImpl.invoke(NativeMethodAccessorImpl.java:39)
	at sun.reflect.DelegatingMethodAccessorImpl.invoke(DelegatingMethodAccessorImpl.java:25)
	at java.lang.reflect.Method.invoke(Method.java:585)
	at org.junit.internal.runners.TestMethod.invoke(TestMethod.java:59)
	at org.junit.internal.runners.MethodRoadie.runTestMethod(MethodRoadie.java:98)
	at org.junit.internal.runners.MethodRoadie$2.run(MethodRoadie.java:79)
	at org.junit.internal.runners.MethodRoadie.runBeforesThenTestThenAfters(MethodRoadie.java:87)
	at org.junit.internal.runners.MethodRoadie.runTest(MethodRoadie.java:77)
	at org.junit.internal.runners.MethodRoadie.run(MethodRoadie.java:42)
	at org.apache.directory.server.core.integ.state.TestServiceContext.invokeTest(TestServiceContext.java:210)
	at org.apache.directory.server.core.integ.state.StartedNormalState.test(StartedNormalState.java:169)
	at org.apache.directory.server.core.integ.state.TestServiceContext.test(TestServiceContext.java:186)
	at org.apache.directory.server.core.integ.CiRunner.invokeTestMethod(CiRunner.java:101)
	at org.junit.internal.runners.JUnit4ClassRunner.runMethods(JUnit4ClassRunner.java:51)
	at org.junit.internal.runners.JUnit4ClassRunner$1.run(JUnit4ClassRunner.java:44)
	at org.junit.internal.runners.ClassRoadie.runUnprotected(ClassRoadie.java:27)
	at org.junit.internal.runners.ClassRoadie.runProtected(ClassRoadie.java:37)
	at org.junit.internal.runners.JUnit4ClassRunner.run(JUnit4ClassRunner.java:42)
	at org.apache.directory.server.core.integ.CiRunner.run(CiRunner.java:75)
	at org.junit.internal.runners.CompositeRunner.runChildren(CompositeRunner.java:33)
	at org.junit.runners.Suite.access$000(Suite.java:26)
	at org.junit.runners.Suite$1.run(Suite.java:93)
	at org.junit.internal.runners.ClassRoadie.runUnprotected(ClassRoadie.java:27)
	at org.junit.internal.runners.ClassRoadie.runProtected(ClassRoadie.java:37)
	at org.junit.runners.Suite.run(Suite.java:91)
	at org.apache.directory.server.core.integ.CiSuite.run(CiSuite.java:102)
	at org.apache.maven.surefire.junit4.JUnit4TestSet.execute(JUnit4TestSet.java:62)
	at org.apache.maven.surefire.suite.AbstractDirectoryTestSuite.executeTestSet(AbstractDirectoryTestSuite.java:140)
	at org.apache.maven.surefire.suite.AbstractDirectoryTestSuite.execute(AbstractDirectoryTestSuite.java:127)
	at org.apache.maven.surefire.Surefire.run(Surefire.java:177)
	at sun.reflect.NativeMethodAccessorImpl.invoke0(Native Method)
	at sun.reflect.NativeMethodAccessorImpl.invoke(NativeMethodAccessorImpl.java:39)
	at sun.reflect.DelegatingMethodAccessorImpl.invoke(DelegatingMethodAccessorImpl.java:25)
	at java.lang.reflect.Method.invoke(Method.java:585)
	at org.apache.maven.surefire.booter.SurefireBooter.runSuitesInProcess(SurefireBooter.java:345)
	at org.apache.maven.surefire.booter.SurefireBooter.main(SurefireBooter.java:1009)

    testSubstringSearchWithEscapedCharsInFilter :
  java.lang.AssertionError
  java.lang.AssertionError: Expected number of results returned was incorrect! expected:<1>
but was:<0>
	at org.junit.Assert.fail(Assert.java:74)
	at org.junit.Assert.failNotEquals(Assert.java:448)
	at org.junit.Assert.assertEquals(Assert.java:102)
	at org.junit.Assert.assertEquals(Assert.java:323)
	at org.apache.directory.server.core.operations.search.SearchIT.testSubstringSearchWithEscapedCharsInFilter(SearchIT.java:1454)
	at sun.reflect.NativeMethodAccessorImpl.invoke0(Native Method)
	at sun.reflect.NativeMethodAccessorImpl.invoke(NativeMethodAccessorImpl.java:39)
	at sun.reflect.DelegatingMethodAccessorImpl.invoke(DelegatingMethodAccessorImpl.java:25)
	at java.lang.reflect.Method.invoke(Method.java:585)
	at org.junit.internal.runners.TestMethod.invoke(TestMethod.java:59)
	at org.junit.internal.runners.MethodRoadie.runTestMethod(MethodRoadie.java:98)
	at org.junit.internal.runners.MethodRoadie$2.run(MethodRoadie.java:79)
	at org.junit.internal.runners.MethodRoadie.runBeforesThenTestThenAfters(MethodRoadie.java:87)
	at org.junit.internal.runners.MethodRoadie.runTest(MethodRoadie.java:77)
	at org.junit.internal.runners.MethodRoadie.run(MethodRoadie.java:42)
	at org.apache.directory.server.core.integ.state.TestServiceContext.invokeTest(TestServiceContext.java:210)
	at org.apache.directory.server.core.integ.state.StartedNormalState.test(StartedNormalState.java:169)
	at org.apache.directory.server.core.integ.state.TestServiceContext.test(TestServiceContext.java:186)
	at org.apache.directory.server.core.integ.CiRunner.invokeTestMethod(CiRunner.java:101)
	at org.junit.internal.runners.JUnit4ClassRunner.runMethods(JUnit4ClassRunner.java:51)
	at org.junit.internal.runners.JUnit4ClassRunner$1.run(JUnit4ClassRunner.java:44)
	at org.junit.internal.runners.ClassRoadie.runUnprotected(ClassRoadie.java:27)
	at org.junit.internal.runners.ClassRoadie.runProtected(ClassRoadie.java:37)
	at org.junit.internal.runners.JUnit4ClassRunner.run(JUnit4ClassRunner.java:42)
	at org.apache.directory.server.core.integ.CiRunner.run(CiRunner.java:75)
	at org.junit.internal.runners.CompositeRunner.runChildren(CompositeRunner.java:33)
	at org.junit.runners.Suite.access$000(Suite.java:26)
	at org.junit.runners.Suite$1.run(Suite.java:93)
	at org.junit.internal.runners.ClassRoadie.runUnprotected(ClassRoadie.java:27)
	at org.junit.internal.runners.ClassRoadie.runProtected(ClassRoadie.java:37)
	at org.junit.runners.Suite.run(Suite.java:91)
	at org.apache.directory.server.core.integ.CiSuite.run(CiSuite.java:102)
	at org.apache.maven.surefire.junit4.JUnit4TestSet.execute(JUnit4TestSet.java:62)
	at org.apache.maven.surefire.suite.AbstractDirectoryTestSuite.executeTestSet(AbstractDirectoryTestSuite.java:140)
	at org.apache.maven.surefire.suite.AbstractDirectoryTestSuite.execute(AbstractDirectoryTestSuite.java:127)
	at org.apache.maven.surefire.Surefire.run(Surefire.java:177)
	at sun.reflect.NativeMethodAccessorImpl.invoke0(Native Method)
	at sun.reflect.NativeMethodAccessorImpl.invoke(NativeMethodAccessorImpl.java:39)
	at sun.reflect.DelegatingMethodAccessorImpl.invoke(DelegatingMethodAccessorImpl.java:25)
	at java.lang.reflect.Method.invoke(Method.java:585)
	at org.apache.maven.surefire.booter.SurefireBooter.runSuitesInProcess(SurefireBooter.java:345)
	at org.apache.maven.surefire.booter.SurefireBooter.main(SurefireBooter.java:1009)

    testSubstringSearchWithEscapedAsterisksInFilter_DIRSERVER_1181 :
  java.lang.AssertionError
  java.lang.AssertionError: 
	at org.junit.Assert.fail(Assert.java:74)
	at org.junit.Assert.assertTrue(Assert.java:37)
	at org.junit.Assert.assertTrue(Assert.java:46)
	at org.apache.directory.server.core.operations.search.SearchIT.testSubstringSearchWithEscapedAsterisksInFilter_DIRSERVER_1181(SearchIT.java:1485)
	at sun.reflect.NativeMethodAccessorImpl.invoke0(Native Method)
	at sun.reflect.NativeMethodAccessorImpl.invoke(NativeMethodAccessorImpl.java:39)
	at sun.reflect.DelegatingMethodAccessorImpl.invoke(DelegatingMethodAccessorImpl.java:25)
	at java.lang.reflect.Method.invoke(Method.java:585)
	at org.junit.internal.runners.TestMethod.invoke(TestMethod.java:59)
	at org.junit.internal.runners.MethodRoadie.runTestMethod(MethodRoadie.java:98)
	at org.junit.internal.runners.MethodRoadie$2.run(MethodRoadie.java:79)
	at org.junit.internal.runners.MethodRoadie.runBeforesThenTestThenAfters(MethodRoadie.java:87)
	at org.junit.internal.runners.MethodRoadie.runTest(MethodRoadie.java:77)
	at org.junit.internal.runners.MethodRoadie.run(MethodRoadie.java:42)
	at org.apache.directory.server.core.integ.state.TestServiceContext.invokeTest(TestServiceContext.java:210)
	at org.apache.directory.server.core.integ.state.StartedNormalState.test(StartedNormalState.java:169)
	at org.apache.directory.server.core.integ.state.TestServiceContext.test(TestServiceContext.java:186)
	at org.apache.directory.server.core.integ.CiRunner.invokeTestMethod(CiRunner.java:101)
	at org.junit.internal.runners.JUnit4ClassRunner.runMethods(JUnit4ClassRunner.java:51)
	at org.junit.internal.runners.JUnit4ClassRunner$1.run(JUnit4ClassRunner.java:44)
	at org.junit.internal.runners.ClassRoadie.runUnprotected(ClassRoadie.java:27)
	at org.junit.internal.runners.ClassRoadie.runProtected(ClassRoadie.java:37)
	at org.junit.internal.runners.JUnit4ClassRunner.run(JUnit4ClassRunner.java:42)
	at org.apache.directory.server.core.integ.CiRunner.run(CiRunner.java:75)
	at org.junit.internal.runners.CompositeRunner.runChildren(CompositeRunner.java:33)
	at org.junit.runners.Suite.access$000(Suite.java:26)
	at org.junit.runners.Suite$1.run(Suite.java:93)
	at org.junit.internal.runners.ClassRoadie.runUnprotected(ClassRoadie.java:27)
	at org.junit.internal.runners.ClassRoadie.runProtected(ClassRoadie.java:37)
	at org.junit.runners.Suite.run(Suite.java:91)
	at org.apache.directory.server.core.integ.CiSuite.run(CiSuite.java:102)
	at org.apache.maven.surefire.junit4.JUnit4TestSet.execute(JUnit4TestSet.java:62)
	at org.apache.maven.surefire.suite.AbstractDirectoryTestSuite.executeTestSet(AbstractDirectoryTestSuite.java:140)
	at org.apache.maven.surefire.suite.AbstractDirectoryTestSuite.execute(AbstractDirectoryTestSuite.java:127)
	at org.apache.maven.surefire.Surefire.run(Surefire.java:177)
	at sun.reflect.NativeMethodAccessorImpl.invoke0(Native Method)
	at sun.reflect.NativeMethodAccessorImpl.invoke(NativeMethodAccessorImpl.java:39)
	at sun.reflect.DelegatingMethodAccessorImpl.invoke(DelegatingMethodAccessorImpl.java:25)
	at java.lang.reflect.Method.invoke(Method.java:585)
	at org.apache.maven.surefire.booter.SurefireBooter.runSuitesInProcess(SurefireBooter.java:345)
	at org.apache.maven.surefire.booter.SurefireBooter.main(SurefireBooter.java:1009)


  



Mime
View raw message