directory-commits mailing list archives

Site index · List index
Message view « Date » · « Thread »
Top « Date » · « Thread »
From "Continuum@vmbuild.apache.org" <contin...@apache.org>
Subject [continuum] BUILD FAILURE: Directory - ApacheDS - clean deploy
Date Thu, 19 Mar 2009 18:18:09 GMT
Online report : http://vmbuild.apache.org/continuum/buildResult.action?buildId=168339&projectId=1501

Build statistics:
  State: Failed
  Previous State: Ok
  Started at: Thu 19 Mar 2009 11:11:55 -0700
  Finished at: Thu 19 Mar 2009 11:17:43 -0700
  Total time: 5m 48s
  Build Trigger: Schedule
  Build Number: 13
  Exit code: 1
  Building machine hostname: vmbuild.apache.org
  Operating system : Linux(unknown)
  Java Home version : 
          java version "1.5.0_12"
          Java(TM) 2 Runtime Environment, Standard Edition (build 1.5.0_12-b04)
          Java HotSpot(TM) Client VM (build 1.5.0_12-b04, mixed mode, sharing)
        
  Builder version :
          Maven version: 2.0.9
          Java version: 1.5.0_12
          OS name: "linux" version: "2.6.20-16-server" arch: "i386" Family: "unix"
    
****************************************************************************
SCM Changes:
****************************************************************************
Changed: ccustine @ Thu 19 Mar 2009 10:58:03 -0700
Comment: DIRSERVER-1334 Create module for OSGi bundle
Files changed:
  /directory/apacheds/trunk/osgi ( 756112 )
  /directory/apacheds/trunk/osgi/pom.xml ( 756112 )
  /directory/apacheds/trunk/osgi/src ( 756112 )
  /directory/apacheds/trunk/osgi/src/main ( 756112 )
  /directory/apacheds/trunk/osgi/src/main/filtered-resources ( 756112 )
  /directory/apacheds/trunk/osgi/src/main/filtered-resources/features.xml ( 756112 )
  /directory/apacheds/trunk/osgi/src/main/resources ( 756112 )
  /directory/apacheds/trunk/osgi/src/main/resources/META-INF ( 756112 )
  /directory/apacheds/trunk/osgi/src/main/resources/META-INF/services ( 756112 )
  /directory/apacheds/trunk/osgi/src/main/resources/META-INF/services/org ( 756112 )
  /directory/apacheds/trunk/osgi/src/main/resources/META-INF/services/org/apache ( 756112
)
  /directory/apacheds/trunk/osgi/src/main/resources/META-INF/services/org/apache/xbean ( 756112
)
  /directory/apacheds/trunk/osgi/src/main/resources/META-INF/services/org/apache/xbean/spring
( 756112 )
  /directory/apacheds/trunk/osgi/src/main/resources/META-INF/services/org/apache/xbean/spring/http
( 756112 )
  /directory/apacheds/trunk/osgi/src/main/resources/META-INF/services/org/apache/xbean/spring/http/apacheds.org
( 756112 )
  /directory/apacheds/trunk/osgi/src/main/resources/META-INF/services/org/apache/xbean/spring/http/apacheds.org/config
( 756112 )
  /directory/apacheds/trunk/osgi/src/main/resources/META-INF/services/org/apache/xbean/spring/http/apacheds.org/config/core
( 756112 )
  /directory/apacheds/trunk/osgi/src/main/resources/META-INF/spring.handlers ( 756112 )
  /directory/apacheds/trunk/osgi/src/main/resources/META-INF/spring.schemas ( 756112 )
  /directory/apacheds/trunk/osgi/src/main/resources/apacheds.xsd ( 756112 )
  /directory/apacheds/trunk/osgi/src/main/resources/example ( 756112 )
  /directory/apacheds/trunk/osgi/src/main/resources/example/server.xml ( 756112 )

Changed: ccustine @ Thu 19 Mar 2009 11:00:46 -0700
Comment: DIRSERVER-1334 Create module for OSGi bundle
Files changed:
  /directory/apacheds/trunk/pom.xml ( 756115 )

Changed: ccustine @ Thu 19 Mar 2009 11:07:06 -0700
Comment: DIRSERVER-1334 Create module for OSGi bundle
Files changed:
  /directory/apacheds/trunk/osgi/pom.xml ( 756120 )

****************************************************************************
Dependencies Changes:
****************************************************************************
No dependencies changed


****************************************************************************
Build Definition:
****************************************************************************
POM filename: pom.xml
Goals: clean deploy   
Arguments: --batch-mode -Dintegration
Build Fresh: false
Always Build: false
Default Build Definition: true
Schedule: DEFAULT_SCHEDULE
Profile Name: Maven 2.0.9, Java 5, Large Memory
Description: clean deploy

****************************************************************************
Test Summary:
****************************************************************************
Tests: 1445
Failures: 1
Total time: 431.977

****************************************************************************
Test Failures:
****************************************************************************

InMemoryReplayCacheTest
    testCacheSetting :
  java.lang.AssertionError
  java.lang.AssertionError: expected:<0> but was:<1>
	at org.junit.Assert.fail(Assert.java:74)
	at org.junit.Assert.failNotEquals(Assert.java:448)
	at org.junit.Assert.assertEquals(Assert.java:102)
	at org.junit.Assert.assertEquals(Assert.java:323)
	at org.junit.Assert.assertEquals(Assert.java:319)
	at org.apache.directory.server.kerberos.shared.replay.InMemoryReplayCacheTest.testCacheSetting(InMemoryReplayCacheTest.java:129)
	at sun.reflect.NativeMethodAccessorImpl.invoke0(Native Method)
	at sun.reflect.NativeMethodAccessorImpl.invoke(NativeMethodAccessorImpl.java:39)
	at sun.reflect.DelegatingMethodAccessorImpl.invoke(DelegatingMethodAccessorImpl.java:25)
	at java.lang.reflect.Method.invoke(Method.java:585)
	at org.junit.internal.runners.TestMethod.invoke(TestMethod.java:59)
	at org.junit.internal.runners.MethodRoadie.runTestMethod(MethodRoadie.java:98)
	at org.junit.internal.runners.MethodRoadie$2.run(MethodRoadie.java:79)
	at org.junit.internal.runners.MethodRoadie.runBeforesThenTestThenAfters(MethodRoadie.java:87)
	at org.junit.internal.runners.MethodRoadie.runTest(MethodRoadie.java:77)
	at org.junit.internal.runners.MethodRoadie.run(MethodRoadie.java:42)
	at org.junit.internal.runners.JUnit4ClassRunner.invokeTestMethod(JUnit4ClassRunner.java:88)
	at org.junit.internal.runners.JUnit4ClassRunner.runMethods(JUnit4ClassRunner.java:51)
	at org.junit.internal.runners.JUnit4ClassRunner$1.run(JUnit4ClassRunner.java:44)
	at org.junit.internal.runners.ClassRoadie.runUnprotected(ClassRoadie.java:27)
	at org.junit.internal.runners.ClassRoadie.runProtected(ClassRoadie.java:37)
	at org.junit.internal.runners.JUnit4ClassRunner.run(JUnit4ClassRunner.java:42)
	at org.apache.maven.surefire.junit4.JUnit4TestSet.execute(JUnit4TestSet.java:62)
	at org.apache.maven.surefire.suite.AbstractDirectoryTestSuite.executeTestSet(AbstractDirectoryTestSuite.java:140)
	at org.apache.maven.surefire.suite.AbstractDirectoryTestSuite.execute(AbstractDirectoryTestSuite.java:127)
	at org.apache.maven.surefire.Surefire.run(Surefire.java:177)
	at sun.reflect.NativeMethodAccessorImpl.invoke0(Native Method)
	at sun.reflect.NativeMethodAccessorImpl.invoke(NativeMethodAccessorImpl.java:39)
	at sun.reflect.DelegatingMethodAccessorImpl.invoke(DelegatingMethodAccessorImpl.java:25)
	at java.lang.reflect.Method.invoke(Method.java:585)
	at org.apache.maven.surefire.booter.SurefireBooter.runSuitesInProcess(SurefireBooter.java:345)
	at org.apache.maven.surefire.booter.SurefireBooter.main(SurefireBooter.java:1009)

  



Mime
View raw message