directory-commits mailing list archives

Site index · List index
Message view « Date » · « Thread »
Top « Date » · « Thread »
From "Continuum@vmbuild.apache.org" <contin...@apache.org>
Subject [continuum] BUILD FAILURE: Directory - ApacheDS - default maven2 buildDefinition
Date Tue, 06 Jan 2009 20:07:04 GMT
Online report : http://vmbuild.apache.org/continuum/buildResult.action?buildId=134798&projectId=1501

Build statistics:
  State: Failed
  Previous State: Ok
  Started at: Tue 6 Jan 2009 12:02:15 -0800
  Finished at: Tue 6 Jan 2009 12:06:42 -0800
  Total time: 4m 27s
  Build Trigger: Schedule
  Build Number: 2
  Exit code: 1
  Building machine hostname: vmbuild.apache.org
  Operating system : Linux(unknown)
  Java Home version : 
          java version "1.5.0_12"
          Java(TM) 2 Runtime Environment, Standard Edition (build 1.5.0_12-b04)
          Java HotSpot(TM) Client VM (build 1.5.0_12-b04, mixed mode, sharing)
        
  Builder version :
          Maven version: 2.0.9
          Java version: 1.5.0_12
          OS name: "linux" version: "2.6.20-16-server" arch: "i386" Family: "unix"
    
****************************************************************************
SCM Changes:
****************************************************************************
Changed: elecharny @ Mon 5 Jan 2009 15:14:57 -0800
Comment: Injected the new data using the ApplyLdif annotation
Files changed:
  /directory/apacheds/trunk/core-integ/src/test/java/org/apache/directory/server/core/operations/search/SearchIT.java
( 731764 )

Changed: elecharny @ Tue 6 Jan 2009 10:14:48 -0800
Comment: Create a new IntegerOrderingComparator, and injected it into the server MatchingRules
Files changed:
  /directory/apacheds/trunk/schema-bootstrap/src/main/java/org/apache/directory/server/schema/bootstrap/SystemComparatorProducer.java
( 732033 )
  /directory/shared/trunk/ldap/src/main/java/org/apache/directory/shared/ldap/schema/comparator/IntegerOrderingComparator.java
( 732033 )

Changed: elecharny @ Tue 6 Jan 2009 10:34:42 -0800
Comment: Added tests for Integer comparison
Files changed:
  /directory/apacheds/trunk/core-integ/src/test/java/org/apache/directory/server/core/operations/search/SearchIT.java
( 732042 )

****************************************************************************
Dependencies Changes:
****************************************************************************
No dependencies changed


****************************************************************************
Build Definition:
****************************************************************************
POM filename: pom.xml
Goals: clean install   
Arguments: --batch-mode
Build Fresh: false
Always Build: false
Default Build Definition: true
Schedule: DEFAULT_SCHEDULE
Profile Name: Maven 2.0.9, Java 5, Large Memory
Description: default maven2 buildDefinition

****************************************************************************
Test Summary:
****************************************************************************
Tests: 1417
Failures: 1
Total time: 509.19397

****************************************************************************
Test Failures:
****************************************************************************

InMemoryReplayCacheTest
    testCacheSetting :
  java.lang.AssertionError
  java.lang.AssertionError: expected:<0> but was:<1>
	at org.junit.Assert.fail(Assert.java:74)
	at org.junit.Assert.failNotEquals(Assert.java:448)
	at org.junit.Assert.assertEquals(Assert.java:102)
	at org.junit.Assert.assertEquals(Assert.java:323)
	at org.junit.Assert.assertEquals(Assert.java:319)
	at org.apache.directory.server.kerberos.shared.replay.InMemoryReplayCacheTest.testCacheSetting(InMemoryReplayCacheTest.java:129)
	at sun.reflect.NativeMethodAccessorImpl.invoke0(Native Method)
	at sun.reflect.NativeMethodAccessorImpl.invoke(NativeMethodAccessorImpl.java:39)
	at sun.reflect.DelegatingMethodAccessorImpl.invoke(DelegatingMethodAccessorImpl.java:25)
	at java.lang.reflect.Method.invoke(Method.java:585)
	at org.junit.internal.runners.TestMethod.invoke(TestMethod.java:59)
	at org.junit.internal.runners.MethodRoadie.runTestMethod(MethodRoadie.java:98)
	at org.junit.internal.runners.MethodRoadie$2.run(MethodRoadie.java:79)
	at org.junit.internal.runners.MethodRoadie.runBeforesThenTestThenAfters(MethodRoadie.java:87)
	at org.junit.internal.runners.MethodRoadie.runTest(MethodRoadie.java:77)
	at org.junit.internal.runners.MethodRoadie.run(MethodRoadie.java:42)
	at org.junit.internal.runners.JUnit4ClassRunner.invokeTestMethod(JUnit4ClassRunner.java:88)
	at org.junit.internal.runners.JUnit4ClassRunner.runMethods(JUnit4ClassRunner.java:51)
	at org.junit.internal.runners.JUnit4ClassRunner$1.run(JUnit4ClassRunner.java:44)
	at org.junit.internal.runners.ClassRoadie.runUnprotected(ClassRoadie.java:27)
	at org.junit.internal.runners.ClassRoadie.runProtected(ClassRoadie.java:37)
	at org.junit.internal.runners.JUnit4ClassRunner.run(JUnit4ClassRunner.java:42)
	at org.apache.maven.surefire.junit4.JUnit4TestSet.execute(JUnit4TestSet.java:62)
	at org.apache.maven.surefire.suite.AbstractDirectoryTestSuite.executeTestSet(AbstractDirectoryTestSuite.java:140)
	at org.apache.maven.surefire.suite.AbstractDirectoryTestSuite.execute(AbstractDirectoryTestSuite.java:127)
	at org.apache.maven.surefire.Surefire.run(Surefire.java:177)
	at sun.reflect.NativeMethodAccessorImpl.invoke0(Native Method)
	at sun.reflect.NativeMethodAccessorImpl.invoke(NativeMethodAccessorImpl.java:39)
	at sun.reflect.DelegatingMethodAccessorImpl.invoke(DelegatingMethodAccessorImpl.java:25)
	at java.lang.reflect.Method.invoke(Method.java:585)
	at org.apache.maven.surefire.booter.SurefireBooter.runSuitesInProcess(SurefireBooter.java:345)
	at org.apache.maven.surefire.booter.SurefireBooter.main(SurefireBooter.java:1009)

  



Mime
View raw message