directory-commits mailing list archives

Site index · List index
Message view « Date » · « Thread »
Top « Date » · « Thread »
From oer...@apache.org
Subject svn commit: r543239 [36/37] - in /directory/sandbox/oersoy/das.testing/das.ldap.parent: ./ das.ldap.configuration.model.ecore.v100/ das.ldap.configuration.model.ecore.v100/.settings/ das.ldap.configuration.model.ecore.v100/model/ das.ldap.configuration...
Date Thu, 31 May 2007 19:58:38 GMT
Added: directory/sandbox/oersoy/das.testing/das.ldap.parent/das.ldap/target/surefire-reports/org.apache.tuscany.das.ldap.schema.setup.test.SchemaContextsSetupTest.txt
URL: http://svn.apache.org/viewvc/directory/sandbox/oersoy/das.testing/das.ldap.parent/das.ldap/target/surefire-reports/org.apache.tuscany.das.ldap.schema.setup.test.SchemaContextsSetupTest.txt?view=auto&rev=543239
==============================================================================
--- directory/sandbox/oersoy/das.testing/das.ldap.parent/das.ldap/target/surefire-reports/org.apache.tuscany.das.ldap.schema.setup.test.SchemaContextsSetupTest.txt (added)
+++ directory/sandbox/oersoy/das.testing/das.ldap.parent/das.ldap/target/surefire-reports/org.apache.tuscany.das.ldap.schema.setup.test.SchemaContextsSetupTest.txt Thu May 31 12:58:13 2007
@@ -0,0 +1,310 @@
+-------------------------------------------------------------------------------
+Test set: org.apache.tuscany.das.ldap.schema.setup.test.SchemaContextsSetupTest
+-------------------------------------------------------------------------------
+Tests run: 9, Failures: 0, Errors: 9, Skipped: 0, Time elapsed: 0.262 sec <<< FAILURE!
+testConnect(org.apache.tuscany.das.ldap.schema.setup.test.SchemaContextsSetupTest)  Time elapsed: 0.175 sec  <<< ERROR!
+javax.naming.NameAlreadyBoundException: [LDAP: error code 68 - failed to add entry cn=das,ou=schema: 2.5.4.3=das,2.5.4.11=schema already exists!]; remaining name 'cn=das'
+	at com.sun.jndi.ldap.LdapCtx.mapErrorCode(LdapCtx.java:3000)
+	at com.sun.jndi.ldap.LdapCtx.processReturnCode(LdapCtx.java:2951)
+	at com.sun.jndi.ldap.LdapCtx.processReturnCode(LdapCtx.java:2758)
+	at com.sun.jndi.ldap.LdapCtx.c_createSubcontext(LdapCtx.java:774)
+	at com.sun.jndi.toolkit.ctx.ComponentDirContext.p_createSubcontext(ComponentDirContext.java:319)
+	at com.sun.jndi.toolkit.ctx.PartialCompositeDirContext.createSubcontext(PartialCompositeDirContext.java:248)
+	at com.sun.jndi.toolkit.ctx.PartialCompositeDirContext.createSubcontext(PartialCompositeDirContext.java:236)
+	at javax.naming.directory.InitialDirContext.createSubcontext(InitialDirContext.java:178)
+	at org.apache.tuscany.das.ldap.schema.setup.test.SchemaContextsSetupTest.createDASContext(SchemaContextsSetupTest.java:89)
+	at org.apache.tuscany.das.ldap.schema.setup.test.SchemaContextsSetupTest.setUp(SchemaContextsSetupTest.java:49)
+	at junit.framework.TestCase.runBare(TestCase.java:125)
+	at junit.framework.TestResult$1.protect(TestResult.java:106)
+	at junit.framework.TestResult.runProtected(TestResult.java:124)
+	at junit.framework.TestResult.run(TestResult.java:109)
+	at junit.framework.TestCase.run(TestCase.java:118)
+	at junit.framework.TestSuite.runTest(TestSuite.java:208)
+	at junit.framework.TestSuite.run(TestSuite.java:203)
+	at sun.reflect.NativeMethodAccessorImpl.invoke0(Native Method)
+	at sun.reflect.NativeMethodAccessorImpl.invoke(NativeMethodAccessorImpl.java:39)
+	at sun.reflect.DelegatingMethodAccessorImpl.invoke(DelegatingMethodAccessorImpl.java:25)
+	at java.lang.reflect.Method.invoke(Method.java:597)
+	at org.apache.maven.surefire.junit.JUnitTestSet.execute(JUnitTestSet.java:210)
+	at org.apache.maven.surefire.suite.AbstractDirectoryTestSuite.executeTestSet(AbstractDirectoryTestSuite.java:135)
+	at org.apache.maven.surefire.suite.AbstractDirectoryTestSuite.execute(AbstractDirectoryTestSuite.java:122)
+	at org.apache.maven.surefire.Surefire.run(Surefire.java:129)
+	at sun.reflect.NativeMethodAccessorImpl.invoke0(Native Method)
+	at sun.reflect.NativeMethodAccessorImpl.invoke(NativeMethodAccessorImpl.java:39)
+	at sun.reflect.DelegatingMethodAccessorImpl.invoke(DelegatingMethodAccessorImpl.java:25)
+	at java.lang.reflect.Method.invoke(Method.java:597)
+	at org.apache.maven.surefire.booter.SurefireBooter.runSuitesInProcess(SurefireBooter.java:225)
+	at org.apache.maven.surefire.booter.SurefireBooter.main(SurefireBooter.java:747)
+
+testCreateEcoreContext(org.apache.tuscany.das.ldap.schema.setup.test.SchemaContextsSetupTest)  Time elapsed: 0.006 sec  <<< ERROR!
+javax.naming.NameAlreadyBoundException: [LDAP: error code 68 - failed to add entry cn=das,ou=schema: 2.5.4.3=das,2.5.4.11=schema already exists!]; remaining name 'cn=das'
+	at com.sun.jndi.ldap.LdapCtx.mapErrorCode(LdapCtx.java:3000)
+	at com.sun.jndi.ldap.LdapCtx.processReturnCode(LdapCtx.java:2951)
+	at com.sun.jndi.ldap.LdapCtx.processReturnCode(LdapCtx.java:2758)
+	at com.sun.jndi.ldap.LdapCtx.c_createSubcontext(LdapCtx.java:774)
+	at com.sun.jndi.toolkit.ctx.ComponentDirContext.p_createSubcontext(ComponentDirContext.java:319)
+	at com.sun.jndi.toolkit.ctx.PartialCompositeDirContext.createSubcontext(PartialCompositeDirContext.java:248)
+	at com.sun.jndi.toolkit.ctx.PartialCompositeDirContext.createSubcontext(PartialCompositeDirContext.java:236)
+	at javax.naming.directory.InitialDirContext.createSubcontext(InitialDirContext.java:178)
+	at org.apache.tuscany.das.ldap.schema.setup.test.SchemaContextsSetupTest.createDASContext(SchemaContextsSetupTest.java:89)
+	at org.apache.tuscany.das.ldap.schema.setup.test.SchemaContextsSetupTest.setUp(SchemaContextsSetupTest.java:49)
+	at junit.framework.TestCase.runBare(TestCase.java:125)
+	at junit.framework.TestResult$1.protect(TestResult.java:106)
+	at junit.framework.TestResult.runProtected(TestResult.java:124)
+	at junit.framework.TestResult.run(TestResult.java:109)
+	at junit.framework.TestCase.run(TestCase.java:118)
+	at junit.framework.TestSuite.runTest(TestSuite.java:208)
+	at junit.framework.TestSuite.run(TestSuite.java:203)
+	at sun.reflect.NativeMethodAccessorImpl.invoke0(Native Method)
+	at sun.reflect.NativeMethodAccessorImpl.invoke(NativeMethodAccessorImpl.java:39)
+	at sun.reflect.DelegatingMethodAccessorImpl.invoke(DelegatingMethodAccessorImpl.java:25)
+	at java.lang.reflect.Method.invoke(Method.java:597)
+	at org.apache.maven.surefire.junit.JUnitTestSet.execute(JUnitTestSet.java:210)
+	at org.apache.maven.surefire.suite.AbstractDirectoryTestSuite.executeTestSet(AbstractDirectoryTestSuite.java:135)
+	at org.apache.maven.surefire.suite.AbstractDirectoryTestSuite.execute(AbstractDirectoryTestSuite.java:122)
+	at org.apache.maven.surefire.Surefire.run(Surefire.java:129)
+	at sun.reflect.NativeMethodAccessorImpl.invoke0(Native Method)
+	at sun.reflect.NativeMethodAccessorImpl.invoke(NativeMethodAccessorImpl.java:39)
+	at sun.reflect.DelegatingMethodAccessorImpl.invoke(DelegatingMethodAccessorImpl.java:25)
+	at java.lang.reflect.Method.invoke(Method.java:597)
+	at org.apache.maven.surefire.booter.SurefireBooter.runSuitesInProcess(SurefireBooter.java:225)
+	at org.apache.maven.surefire.booter.SurefireBooter.main(SurefireBooter.java:747)
+
+testCreateEcoreSyntaxesContext(org.apache.tuscany.das.ldap.schema.setup.test.SchemaContextsSetupTest)  Time elapsed: 0.006 sec  <<< ERROR!
+javax.naming.NameAlreadyBoundException: [LDAP: error code 68 - failed to add entry cn=das,ou=schema: 2.5.4.3=das,2.5.4.11=schema already exists!]; remaining name 'cn=das'
+	at com.sun.jndi.ldap.LdapCtx.mapErrorCode(LdapCtx.java:3000)
+	at com.sun.jndi.ldap.LdapCtx.processReturnCode(LdapCtx.java:2951)
+	at com.sun.jndi.ldap.LdapCtx.processReturnCode(LdapCtx.java:2758)
+	at com.sun.jndi.ldap.LdapCtx.c_createSubcontext(LdapCtx.java:774)
+	at com.sun.jndi.toolkit.ctx.ComponentDirContext.p_createSubcontext(ComponentDirContext.java:319)
+	at com.sun.jndi.toolkit.ctx.PartialCompositeDirContext.createSubcontext(PartialCompositeDirContext.java:248)
+	at com.sun.jndi.toolkit.ctx.PartialCompositeDirContext.createSubcontext(PartialCompositeDirContext.java:236)
+	at javax.naming.directory.InitialDirContext.createSubcontext(InitialDirContext.java:178)
+	at org.apache.tuscany.das.ldap.schema.setup.test.SchemaContextsSetupTest.createDASContext(SchemaContextsSetupTest.java:89)
+	at org.apache.tuscany.das.ldap.schema.setup.test.SchemaContextsSetupTest.setUp(SchemaContextsSetupTest.java:49)
+	at junit.framework.TestCase.runBare(TestCase.java:125)
+	at junit.framework.TestResult$1.protect(TestResult.java:106)
+	at junit.framework.TestResult.runProtected(TestResult.java:124)
+	at junit.framework.TestResult.run(TestResult.java:109)
+	at junit.framework.TestCase.run(TestCase.java:118)
+	at junit.framework.TestSuite.runTest(TestSuite.java:208)
+	at junit.framework.TestSuite.run(TestSuite.java:203)
+	at sun.reflect.NativeMethodAccessorImpl.invoke0(Native Method)
+	at sun.reflect.NativeMethodAccessorImpl.invoke(NativeMethodAccessorImpl.java:39)
+	at sun.reflect.DelegatingMethodAccessorImpl.invoke(DelegatingMethodAccessorImpl.java:25)
+	at java.lang.reflect.Method.invoke(Method.java:597)
+	at org.apache.maven.surefire.junit.JUnitTestSet.execute(JUnitTestSet.java:210)
+	at org.apache.maven.surefire.suite.AbstractDirectoryTestSuite.executeTestSet(AbstractDirectoryTestSuite.java:135)
+	at org.apache.maven.surefire.suite.AbstractDirectoryTestSuite.execute(AbstractDirectoryTestSuite.java:122)
+	at org.apache.maven.surefire.Surefire.run(Surefire.java:129)
+	at sun.reflect.NativeMethodAccessorImpl.invoke0(Native Method)
+	at sun.reflect.NativeMethodAccessorImpl.invoke(NativeMethodAccessorImpl.java:39)
+	at sun.reflect.DelegatingMethodAccessorImpl.invoke(DelegatingMethodAccessorImpl.java:25)
+	at java.lang.reflect.Method.invoke(Method.java:597)
+	at org.apache.maven.surefire.booter.SurefireBooter.runSuitesInProcess(SurefireBooter.java:225)
+	at org.apache.maven.surefire.booter.SurefireBooter.main(SurefireBooter.java:747)
+
+testCreateDASContext(org.apache.tuscany.das.ldap.schema.setup.test.SchemaContextsSetupTest)  Time elapsed: 0.007 sec  <<< ERROR!
+javax.naming.NameAlreadyBoundException: [LDAP: error code 68 - failed to add entry cn=das,ou=schema: 2.5.4.3=das,2.5.4.11=schema already exists!]; remaining name 'cn=das'
+	at com.sun.jndi.ldap.LdapCtx.mapErrorCode(LdapCtx.java:3000)
+	at com.sun.jndi.ldap.LdapCtx.processReturnCode(LdapCtx.java:2951)
+	at com.sun.jndi.ldap.LdapCtx.processReturnCode(LdapCtx.java:2758)
+	at com.sun.jndi.ldap.LdapCtx.c_createSubcontext(LdapCtx.java:774)
+	at com.sun.jndi.toolkit.ctx.ComponentDirContext.p_createSubcontext(ComponentDirContext.java:319)
+	at com.sun.jndi.toolkit.ctx.PartialCompositeDirContext.createSubcontext(PartialCompositeDirContext.java:248)
+	at com.sun.jndi.toolkit.ctx.PartialCompositeDirContext.createSubcontext(PartialCompositeDirContext.java:236)
+	at javax.naming.directory.InitialDirContext.createSubcontext(InitialDirContext.java:178)
+	at org.apache.tuscany.das.ldap.schema.setup.test.SchemaContextsSetupTest.createDASContext(SchemaContextsSetupTest.java:89)
+	at org.apache.tuscany.das.ldap.schema.setup.test.SchemaContextsSetupTest.setUp(SchemaContextsSetupTest.java:49)
+	at junit.framework.TestCase.runBare(TestCase.java:125)
+	at junit.framework.TestResult$1.protect(TestResult.java:106)
+	at junit.framework.TestResult.runProtected(TestResult.java:124)
+	at junit.framework.TestResult.run(TestResult.java:109)
+	at junit.framework.TestCase.run(TestCase.java:118)
+	at junit.framework.TestSuite.runTest(TestSuite.java:208)
+	at junit.framework.TestSuite.run(TestSuite.java:203)
+	at sun.reflect.NativeMethodAccessorImpl.invoke0(Native Method)
+	at sun.reflect.NativeMethodAccessorImpl.invoke(NativeMethodAccessorImpl.java:39)
+	at sun.reflect.DelegatingMethodAccessorImpl.invoke(DelegatingMethodAccessorImpl.java:25)
+	at java.lang.reflect.Method.invoke(Method.java:597)
+	at org.apache.maven.surefire.junit.JUnitTestSet.execute(JUnitTestSet.java:210)
+	at org.apache.maven.surefire.suite.AbstractDirectoryTestSuite.executeTestSet(AbstractDirectoryTestSuite.java:135)
+	at org.apache.maven.surefire.suite.AbstractDirectoryTestSuite.execute(AbstractDirectoryTestSuite.java:122)
+	at org.apache.maven.surefire.Surefire.run(Surefire.java:129)
+	at sun.reflect.NativeMethodAccessorImpl.invoke0(Native Method)
+	at sun.reflect.NativeMethodAccessorImpl.invoke(NativeMethodAccessorImpl.java:39)
+	at sun.reflect.DelegatingMethodAccessorImpl.invoke(DelegatingMethodAccessorImpl.java:25)
+	at java.lang.reflect.Method.invoke(Method.java:597)
+	at org.apache.maven.surefire.booter.SurefireBooter.runSuitesInProcess(SurefireBooter.java:225)
+	at org.apache.maven.surefire.booter.SurefireBooter.main(SurefireBooter.java:747)
+
+testCreateXSDContext(org.apache.tuscany.das.ldap.schema.setup.test.SchemaContextsSetupTest)  Time elapsed: 0.006 sec  <<< ERROR!
+javax.naming.NameAlreadyBoundException: [LDAP: error code 68 - failed to add entry cn=das,ou=schema: 2.5.4.3=das,2.5.4.11=schema already exists!]; remaining name 'cn=das'
+	at com.sun.jndi.ldap.LdapCtx.mapErrorCode(LdapCtx.java:3000)
+	at com.sun.jndi.ldap.LdapCtx.processReturnCode(LdapCtx.java:2951)
+	at com.sun.jndi.ldap.LdapCtx.processReturnCode(LdapCtx.java:2758)
+	at com.sun.jndi.ldap.LdapCtx.c_createSubcontext(LdapCtx.java:774)
+	at com.sun.jndi.toolkit.ctx.ComponentDirContext.p_createSubcontext(ComponentDirContext.java:319)
+	at com.sun.jndi.toolkit.ctx.PartialCompositeDirContext.createSubcontext(PartialCompositeDirContext.java:248)
+	at com.sun.jndi.toolkit.ctx.PartialCompositeDirContext.createSubcontext(PartialCompositeDirContext.java:236)
+	at javax.naming.directory.InitialDirContext.createSubcontext(InitialDirContext.java:178)
+	at org.apache.tuscany.das.ldap.schema.setup.test.SchemaContextsSetupTest.createDASContext(SchemaContextsSetupTest.java:89)
+	at org.apache.tuscany.das.ldap.schema.setup.test.SchemaContextsSetupTest.setUp(SchemaContextsSetupTest.java:49)
+	at junit.framework.TestCase.runBare(TestCase.java:125)
+	at junit.framework.TestResult$1.protect(TestResult.java:106)
+	at junit.framework.TestResult.runProtected(TestResult.java:124)
+	at junit.framework.TestResult.run(TestResult.java:109)
+	at junit.framework.TestCase.run(TestCase.java:118)
+	at junit.framework.TestSuite.runTest(TestSuite.java:208)
+	at junit.framework.TestSuite.run(TestSuite.java:203)
+	at sun.reflect.NativeMethodAccessorImpl.invoke0(Native Method)
+	at sun.reflect.NativeMethodAccessorImpl.invoke(NativeMethodAccessorImpl.java:39)
+	at sun.reflect.DelegatingMethodAccessorImpl.invoke(DelegatingMethodAccessorImpl.java:25)
+	at java.lang.reflect.Method.invoke(Method.java:597)
+	at org.apache.maven.surefire.junit.JUnitTestSet.execute(JUnitTestSet.java:210)
+	at org.apache.maven.surefire.suite.AbstractDirectoryTestSuite.executeTestSet(AbstractDirectoryTestSuite.java:135)
+	at org.apache.maven.surefire.suite.AbstractDirectoryTestSuite.execute(AbstractDirectoryTestSuite.java:122)
+	at org.apache.maven.surefire.Surefire.run(Surefire.java:129)
+	at sun.reflect.NativeMethodAccessorImpl.invoke0(Native Method)
+	at sun.reflect.NativeMethodAccessorImpl.invoke(NativeMethodAccessorImpl.java:39)
+	at sun.reflect.DelegatingMethodAccessorImpl.invoke(DelegatingMethodAccessorImpl.java:25)
+	at java.lang.reflect.Method.invoke(Method.java:597)
+	at org.apache.maven.surefire.booter.SurefireBooter.runSuitesInProcess(SurefireBooter.java:225)
+	at org.apache.maven.surefire.booter.SurefireBooter.main(SurefireBooter.java:747)
+
+testCreateXSDSyntaxesContext(org.apache.tuscany.das.ldap.schema.setup.test.SchemaContextsSetupTest)  Time elapsed: 0.007 sec  <<< ERROR!
+javax.naming.NameAlreadyBoundException: [LDAP: error code 68 - failed to add entry cn=das,ou=schema: 2.5.4.3=das,2.5.4.11=schema already exists!]; remaining name 'cn=das'
+	at com.sun.jndi.ldap.LdapCtx.mapErrorCode(LdapCtx.java:3000)
+	at com.sun.jndi.ldap.LdapCtx.processReturnCode(LdapCtx.java:2951)
+	at com.sun.jndi.ldap.LdapCtx.processReturnCode(LdapCtx.java:2758)
+	at com.sun.jndi.ldap.LdapCtx.c_createSubcontext(LdapCtx.java:774)
+	at com.sun.jndi.toolkit.ctx.ComponentDirContext.p_createSubcontext(ComponentDirContext.java:319)
+	at com.sun.jndi.toolkit.ctx.PartialCompositeDirContext.createSubcontext(PartialCompositeDirContext.java:248)
+	at com.sun.jndi.toolkit.ctx.PartialCompositeDirContext.createSubcontext(PartialCompositeDirContext.java:236)
+	at javax.naming.directory.InitialDirContext.createSubcontext(InitialDirContext.java:178)
+	at org.apache.tuscany.das.ldap.schema.setup.test.SchemaContextsSetupTest.createDASContext(SchemaContextsSetupTest.java:89)
+	at org.apache.tuscany.das.ldap.schema.setup.test.SchemaContextsSetupTest.setUp(SchemaContextsSetupTest.java:49)
+	at junit.framework.TestCase.runBare(TestCase.java:125)
+	at junit.framework.TestResult$1.protect(TestResult.java:106)
+	at junit.framework.TestResult.runProtected(TestResult.java:124)
+	at junit.framework.TestResult.run(TestResult.java:109)
+	at junit.framework.TestCase.run(TestCase.java:118)
+	at junit.framework.TestSuite.runTest(TestSuite.java:208)
+	at junit.framework.TestSuite.run(TestSuite.java:203)
+	at sun.reflect.NativeMethodAccessorImpl.invoke0(Native Method)
+	at sun.reflect.NativeMethodAccessorImpl.invoke(NativeMethodAccessorImpl.java:39)
+	at sun.reflect.DelegatingMethodAccessorImpl.invoke(DelegatingMethodAccessorImpl.java:25)
+	at java.lang.reflect.Method.invoke(Method.java:597)
+	at org.apache.maven.surefire.junit.JUnitTestSet.execute(JUnitTestSet.java:210)
+	at org.apache.maven.surefire.suite.AbstractDirectoryTestSuite.executeTestSet(AbstractDirectoryTestSuite.java:135)
+	at org.apache.maven.surefire.suite.AbstractDirectoryTestSuite.execute(AbstractDirectoryTestSuite.java:122)
+	at org.apache.maven.surefire.Surefire.run(Surefire.java:129)
+	at sun.reflect.NativeMethodAccessorImpl.invoke0(Native Method)
+	at sun.reflect.NativeMethodAccessorImpl.invoke(NativeMethodAccessorImpl.java:39)
+	at sun.reflect.DelegatingMethodAccessorImpl.invoke(DelegatingMethodAccessorImpl.java:25)
+	at java.lang.reflect.Method.invoke(Method.java:597)
+	at org.apache.maven.surefire.booter.SurefireBooter.runSuitesInProcess(SurefireBooter.java:225)
+	at org.apache.maven.surefire.booter.SurefireBooter.main(SurefireBooter.java:747)
+
+testCreateSyntaxesContext(org.apache.tuscany.das.ldap.schema.setup.test.SchemaContextsSetupTest)  Time elapsed: 0.006 sec  <<< ERROR!
+javax.naming.NameAlreadyBoundException: [LDAP: error code 68 - failed to add entry cn=das,ou=schema: 2.5.4.3=das,2.5.4.11=schema already exists!]; remaining name 'cn=das'
+	at com.sun.jndi.ldap.LdapCtx.mapErrorCode(LdapCtx.java:3000)
+	at com.sun.jndi.ldap.LdapCtx.processReturnCode(LdapCtx.java:2951)
+	at com.sun.jndi.ldap.LdapCtx.processReturnCode(LdapCtx.java:2758)
+	at com.sun.jndi.ldap.LdapCtx.c_createSubcontext(LdapCtx.java:774)
+	at com.sun.jndi.toolkit.ctx.ComponentDirContext.p_createSubcontext(ComponentDirContext.java:319)
+	at com.sun.jndi.toolkit.ctx.PartialCompositeDirContext.createSubcontext(PartialCompositeDirContext.java:248)
+	at com.sun.jndi.toolkit.ctx.PartialCompositeDirContext.createSubcontext(PartialCompositeDirContext.java:236)
+	at javax.naming.directory.InitialDirContext.createSubcontext(InitialDirContext.java:178)
+	at org.apache.tuscany.das.ldap.schema.setup.test.SchemaContextsSetupTest.createDASContext(SchemaContextsSetupTest.java:89)
+	at org.apache.tuscany.das.ldap.schema.setup.test.SchemaContextsSetupTest.setUp(SchemaContextsSetupTest.java:49)
+	at junit.framework.TestCase.runBare(TestCase.java:125)
+	at junit.framework.TestResult$1.protect(TestResult.java:106)
+	at junit.framework.TestResult.runProtected(TestResult.java:124)
+	at junit.framework.TestResult.run(TestResult.java:109)
+	at junit.framework.TestCase.run(TestCase.java:118)
+	at junit.framework.TestSuite.runTest(TestSuite.java:208)
+	at junit.framework.TestSuite.run(TestSuite.java:203)
+	at sun.reflect.NativeMethodAccessorImpl.invoke0(Native Method)
+	at sun.reflect.NativeMethodAccessorImpl.invoke(NativeMethodAccessorImpl.java:39)
+	at sun.reflect.DelegatingMethodAccessorImpl.invoke(DelegatingMethodAccessorImpl.java:25)
+	at java.lang.reflect.Method.invoke(Method.java:597)
+	at org.apache.maven.surefire.junit.JUnitTestSet.execute(JUnitTestSet.java:210)
+	at org.apache.maven.surefire.suite.AbstractDirectoryTestSuite.executeTestSet(AbstractDirectoryTestSuite.java:135)
+	at org.apache.maven.surefire.suite.AbstractDirectoryTestSuite.execute(AbstractDirectoryTestSuite.java:122)
+	at org.apache.maven.surefire.Surefire.run(Surefire.java:129)
+	at sun.reflect.NativeMethodAccessorImpl.invoke0(Native Method)
+	at sun.reflect.NativeMethodAccessorImpl.invoke(NativeMethodAccessorImpl.java:39)
+	at sun.reflect.DelegatingMethodAccessorImpl.invoke(DelegatingMethodAccessorImpl.java:25)
+	at java.lang.reflect.Method.invoke(Method.java:597)
+	at org.apache.maven.surefire.booter.SurefireBooter.runSuitesInProcess(SurefireBooter.java:225)
+	at org.apache.maven.surefire.booter.SurefireBooter.main(SurefireBooter.java:747)
+
+testCreateAttributeTypesContext(org.apache.tuscany.das.ldap.schema.setup.test.SchemaContextsSetupTest)  Time elapsed: 0.007 sec  <<< ERROR!
+javax.naming.NameAlreadyBoundException: [LDAP: error code 68 - failed to add entry cn=das,ou=schema: 2.5.4.3=das,2.5.4.11=schema already exists!]; remaining name 'cn=das'
+	at com.sun.jndi.ldap.LdapCtx.mapErrorCode(LdapCtx.java:3000)
+	at com.sun.jndi.ldap.LdapCtx.processReturnCode(LdapCtx.java:2951)
+	at com.sun.jndi.ldap.LdapCtx.processReturnCode(LdapCtx.java:2758)
+	at com.sun.jndi.ldap.LdapCtx.c_createSubcontext(LdapCtx.java:774)
+	at com.sun.jndi.toolkit.ctx.ComponentDirContext.p_createSubcontext(ComponentDirContext.java:319)
+	at com.sun.jndi.toolkit.ctx.PartialCompositeDirContext.createSubcontext(PartialCompositeDirContext.java:248)
+	at com.sun.jndi.toolkit.ctx.PartialCompositeDirContext.createSubcontext(PartialCompositeDirContext.java:236)
+	at javax.naming.directory.InitialDirContext.createSubcontext(InitialDirContext.java:178)
+	at org.apache.tuscany.das.ldap.schema.setup.test.SchemaContextsSetupTest.createDASContext(SchemaContextsSetupTest.java:89)
+	at org.apache.tuscany.das.ldap.schema.setup.test.SchemaContextsSetupTest.setUp(SchemaContextsSetupTest.java:49)
+	at junit.framework.TestCase.runBare(TestCase.java:125)
+	at junit.framework.TestResult$1.protect(TestResult.java:106)
+	at junit.framework.TestResult.runProtected(TestResult.java:124)
+	at junit.framework.TestResult.run(TestResult.java:109)
+	at junit.framework.TestCase.run(TestCase.java:118)
+	at junit.framework.TestSuite.runTest(TestSuite.java:208)
+	at junit.framework.TestSuite.run(TestSuite.java:203)
+	at sun.reflect.NativeMethodAccessorImpl.invoke0(Native Method)
+	at sun.reflect.NativeMethodAccessorImpl.invoke(NativeMethodAccessorImpl.java:39)
+	at sun.reflect.DelegatingMethodAccessorImpl.invoke(DelegatingMethodAccessorImpl.java:25)
+	at java.lang.reflect.Method.invoke(Method.java:597)
+	at org.apache.maven.surefire.junit.JUnitTestSet.execute(JUnitTestSet.java:210)
+	at org.apache.maven.surefire.suite.AbstractDirectoryTestSuite.executeTestSet(AbstractDirectoryTestSuite.java:135)
+	at org.apache.maven.surefire.suite.AbstractDirectoryTestSuite.execute(AbstractDirectoryTestSuite.java:122)
+	at org.apache.maven.surefire.Surefire.run(Surefire.java:129)
+	at sun.reflect.NativeMethodAccessorImpl.invoke0(Native Method)
+	at sun.reflect.NativeMethodAccessorImpl.invoke(NativeMethodAccessorImpl.java:39)
+	at sun.reflect.DelegatingMethodAccessorImpl.invoke(DelegatingMethodAccessorImpl.java:25)
+	at java.lang.reflect.Method.invoke(Method.java:597)
+	at org.apache.maven.surefire.booter.SurefireBooter.runSuitesInProcess(SurefireBooter.java:225)
+	at org.apache.maven.surefire.booter.SurefireBooter.main(SurefireBooter.java:747)
+
+testCreateObjectClassesContext(org.apache.tuscany.das.ldap.schema.setup.test.SchemaContextsSetupTest)  Time elapsed: 0.01 sec  <<< ERROR!
+javax.naming.NameAlreadyBoundException: [LDAP: error code 68 - failed to add entry cn=das,ou=schema: 2.5.4.3=das,2.5.4.11=schema already exists!]; remaining name 'cn=das'
+	at com.sun.jndi.ldap.LdapCtx.mapErrorCode(LdapCtx.java:3000)
+	at com.sun.jndi.ldap.LdapCtx.processReturnCode(LdapCtx.java:2951)
+	at com.sun.jndi.ldap.LdapCtx.processReturnCode(LdapCtx.java:2758)
+	at com.sun.jndi.ldap.LdapCtx.c_createSubcontext(LdapCtx.java:774)
+	at com.sun.jndi.toolkit.ctx.ComponentDirContext.p_createSubcontext(ComponentDirContext.java:319)
+	at com.sun.jndi.toolkit.ctx.PartialCompositeDirContext.createSubcontext(PartialCompositeDirContext.java:248)
+	at com.sun.jndi.toolkit.ctx.PartialCompositeDirContext.createSubcontext(PartialCompositeDirContext.java:236)
+	at javax.naming.directory.InitialDirContext.createSubcontext(InitialDirContext.java:178)
+	at org.apache.tuscany.das.ldap.schema.setup.test.SchemaContextsSetupTest.createDASContext(SchemaContextsSetupTest.java:89)
+	at org.apache.tuscany.das.ldap.schema.setup.test.SchemaContextsSetupTest.setUp(SchemaContextsSetupTest.java:49)
+	at junit.framework.TestCase.runBare(TestCase.java:125)
+	at junit.framework.TestResult$1.protect(TestResult.java:106)
+	at junit.framework.TestResult.runProtected(TestResult.java:124)
+	at junit.framework.TestResult.run(TestResult.java:109)
+	at junit.framework.TestCase.run(TestCase.java:118)
+	at junit.framework.TestSuite.runTest(TestSuite.java:208)
+	at junit.framework.TestSuite.run(TestSuite.java:203)
+	at sun.reflect.NativeMethodAccessorImpl.invoke0(Native Method)
+	at sun.reflect.NativeMethodAccessorImpl.invoke(NativeMethodAccessorImpl.java:39)
+	at sun.reflect.DelegatingMethodAccessorImpl.invoke(DelegatingMethodAccessorImpl.java:25)
+	at java.lang.reflect.Method.invoke(Method.java:597)
+	at org.apache.maven.surefire.junit.JUnitTestSet.execute(JUnitTestSet.java:210)
+	at org.apache.maven.surefire.suite.AbstractDirectoryTestSuite.executeTestSet(AbstractDirectoryTestSuite.java:135)
+	at org.apache.maven.surefire.suite.AbstractDirectoryTestSuite.execute(AbstractDirectoryTestSuite.java:122)
+	at org.apache.maven.surefire.Surefire.run(Surefire.java:129)
+	at sun.reflect.NativeMethodAccessorImpl.invoke0(Native Method)
+	at sun.reflect.NativeMethodAccessorImpl.invoke(NativeMethodAccessorImpl.java:39)
+	at sun.reflect.DelegatingMethodAccessorImpl.invoke(DelegatingMethodAccessorImpl.java:25)
+	at java.lang.reflect.Method.invoke(Method.java:597)
+	at org.apache.maven.surefire.booter.SurefireBooter.runSuitesInProcess(SurefireBooter.java:225)
+	at org.apache.maven.surefire.booter.SurefireBooter.main(SurefireBooter.java:747)
+

Added: directory/sandbox/oersoy/das.testing/das.ldap.parent/das.ldap/target/surefire-reports/org.apache.tuscany.das.ldap.schema.setup.test.XSDContextsSetupTest.txt
URL: http://svn.apache.org/viewvc/directory/sandbox/oersoy/das.testing/das.ldap.parent/das.ldap/target/surefire-reports/org.apache.tuscany.das.ldap.schema.setup.test.XSDContextsSetupTest.txt?view=auto&rev=543239
==============================================================================
--- directory/sandbox/oersoy/das.testing/das.ldap.parent/das.ldap/target/surefire-reports/org.apache.tuscany.das.ldap.schema.setup.test.XSDContextsSetupTest.txt (added)
+++ directory/sandbox/oersoy/das.testing/das.ldap.parent/das.ldap/target/surefire-reports/org.apache.tuscany.das.ldap.schema.setup.test.XSDContextsSetupTest.txt Thu May 31 12:58:13 2007
@@ -0,0 +1,106 @@
+-------------------------------------------------------------------------------
+Test set: org.apache.tuscany.das.ldap.schema.setup.test.XSDContextsSetupTest
+-------------------------------------------------------------------------------
+Tests run: 3, Failures: 0, Errors: 3, Skipped: 0, Time elapsed: 0.146 sec <<< FAILURE!
+testConnect(org.apache.tuscany.das.ldap.schema.setup.test.XSDContextsSetupTest)  Time elapsed: 0.007 sec  <<< ERROR!
+javax.naming.NameAlreadyBoundException: [LDAP: error code 68 - failed to add entry cn=xsd,ou=schema: 2.5.4.3=xsd,2.5.4.11=schema already exists!]; remaining name 'cn=xsd'
+	at com.sun.jndi.ldap.LdapCtx.mapErrorCode(LdapCtx.java:3000)
+	at com.sun.jndi.ldap.LdapCtx.processReturnCode(LdapCtx.java:2951)
+	at com.sun.jndi.ldap.LdapCtx.processReturnCode(LdapCtx.java:2758)
+	at com.sun.jndi.ldap.LdapCtx.c_createSubcontext(LdapCtx.java:774)
+	at com.sun.jndi.toolkit.ctx.ComponentDirContext.p_createSubcontext(ComponentDirContext.java:319)
+	at com.sun.jndi.toolkit.ctx.PartialCompositeDirContext.createSubcontext(PartialCompositeDirContext.java:248)
+	at com.sun.jndi.toolkit.ctx.PartialCompositeDirContext.createSubcontext(PartialCompositeDirContext.java:236)
+	at javax.naming.directory.InitialDirContext.createSubcontext(InitialDirContext.java:178)
+	at org.apache.tuscany.das.ldap.schema.setup.test.XSDContextsSetupTest.createEcoreContext(XSDContextsSetupTest.java:66)
+	at org.apache.tuscany.das.ldap.schema.setup.test.XSDContextsSetupTest.setUp(XSDContextsSetupTest.java:32)
+	at junit.framework.TestCase.runBare(TestCase.java:125)
+	at junit.framework.TestResult$1.protect(TestResult.java:106)
+	at junit.framework.TestResult.runProtected(TestResult.java:124)
+	at junit.framework.TestResult.run(TestResult.java:109)
+	at junit.framework.TestCase.run(TestCase.java:118)
+	at junit.framework.TestSuite.runTest(TestSuite.java:208)
+	at junit.framework.TestSuite.run(TestSuite.java:203)
+	at sun.reflect.NativeMethodAccessorImpl.invoke0(Native Method)
+	at sun.reflect.NativeMethodAccessorImpl.invoke(NativeMethodAccessorImpl.java:39)
+	at sun.reflect.DelegatingMethodAccessorImpl.invoke(DelegatingMethodAccessorImpl.java:25)
+	at java.lang.reflect.Method.invoke(Method.java:597)
+	at org.apache.maven.surefire.junit.JUnitTestSet.execute(JUnitTestSet.java:210)
+	at org.apache.maven.surefire.suite.AbstractDirectoryTestSuite.executeTestSet(AbstractDirectoryTestSuite.java:135)
+	at org.apache.maven.surefire.suite.AbstractDirectoryTestSuite.execute(AbstractDirectoryTestSuite.java:122)
+	at org.apache.maven.surefire.Surefire.run(Surefire.java:129)
+	at sun.reflect.NativeMethodAccessorImpl.invoke0(Native Method)
+	at sun.reflect.NativeMethodAccessorImpl.invoke(NativeMethodAccessorImpl.java:39)
+	at sun.reflect.DelegatingMethodAccessorImpl.invoke(DelegatingMethodAccessorImpl.java:25)
+	at java.lang.reflect.Method.invoke(Method.java:597)
+	at org.apache.maven.surefire.booter.SurefireBooter.runSuitesInProcess(SurefireBooter.java:225)
+	at org.apache.maven.surefire.booter.SurefireBooter.main(SurefireBooter.java:747)
+
+testCreateEcoreContext(org.apache.tuscany.das.ldap.schema.setup.test.XSDContextsSetupTest)  Time elapsed: 0.109 sec  <<< ERROR!
+javax.naming.NameAlreadyBoundException: [LDAP: error code 68 - failed to add entry cn=xsd,ou=schema: 2.5.4.3=xsd,2.5.4.11=schema already exists!]; remaining name 'cn=xsd'
+	at com.sun.jndi.ldap.LdapCtx.mapErrorCode(LdapCtx.java:3000)
+	at com.sun.jndi.ldap.LdapCtx.processReturnCode(LdapCtx.java:2951)
+	at com.sun.jndi.ldap.LdapCtx.processReturnCode(LdapCtx.java:2758)
+	at com.sun.jndi.ldap.LdapCtx.c_createSubcontext(LdapCtx.java:774)
+	at com.sun.jndi.toolkit.ctx.ComponentDirContext.p_createSubcontext(ComponentDirContext.java:319)
+	at com.sun.jndi.toolkit.ctx.PartialCompositeDirContext.createSubcontext(PartialCompositeDirContext.java:248)
+	at com.sun.jndi.toolkit.ctx.PartialCompositeDirContext.createSubcontext(PartialCompositeDirContext.java:236)
+	at javax.naming.directory.InitialDirContext.createSubcontext(InitialDirContext.java:178)
+	at org.apache.tuscany.das.ldap.schema.setup.test.XSDContextsSetupTest.createEcoreContext(XSDContextsSetupTest.java:66)
+	at org.apache.tuscany.das.ldap.schema.setup.test.XSDContextsSetupTest.setUp(XSDContextsSetupTest.java:32)
+	at junit.framework.TestCase.runBare(TestCase.java:125)
+	at junit.framework.TestResult$1.protect(TestResult.java:106)
+	at junit.framework.TestResult.runProtected(TestResult.java:124)
+	at junit.framework.TestResult.run(TestResult.java:109)
+	at junit.framework.TestCase.run(TestCase.java:118)
+	at junit.framework.TestSuite.runTest(TestSuite.java:208)
+	at junit.framework.TestSuite.run(TestSuite.java:203)
+	at sun.reflect.NativeMethodAccessorImpl.invoke0(Native Method)
+	at sun.reflect.NativeMethodAccessorImpl.invoke(NativeMethodAccessorImpl.java:39)
+	at sun.reflect.DelegatingMethodAccessorImpl.invoke(DelegatingMethodAccessorImpl.java:25)
+	at java.lang.reflect.Method.invoke(Method.java:597)
+	at org.apache.maven.surefire.junit.JUnitTestSet.execute(JUnitTestSet.java:210)
+	at org.apache.maven.surefire.suite.AbstractDirectoryTestSuite.executeTestSet(AbstractDirectoryTestSuite.java:135)
+	at org.apache.maven.surefire.suite.AbstractDirectoryTestSuite.execute(AbstractDirectoryTestSuite.java:122)
+	at org.apache.maven.surefire.Surefire.run(Surefire.java:129)
+	at sun.reflect.NativeMethodAccessorImpl.invoke0(Native Method)
+	at sun.reflect.NativeMethodAccessorImpl.invoke(NativeMethodAccessorImpl.java:39)
+	at sun.reflect.DelegatingMethodAccessorImpl.invoke(DelegatingMethodAccessorImpl.java:25)
+	at java.lang.reflect.Method.invoke(Method.java:597)
+	at org.apache.maven.surefire.booter.SurefireBooter.runSuitesInProcess(SurefireBooter.java:225)
+	at org.apache.maven.surefire.booter.SurefireBooter.main(SurefireBooter.java:747)
+
+testCreateEcoreSyntaxesContext(org.apache.tuscany.das.ldap.schema.setup.test.XSDContextsSetupTest)  Time elapsed: 0.005 sec  <<< ERROR!
+javax.naming.NameAlreadyBoundException: [LDAP: error code 68 - failed to add entry cn=xsd,ou=schema: 2.5.4.3=xsd,2.5.4.11=schema already exists!]; remaining name 'cn=xsd'
+	at com.sun.jndi.ldap.LdapCtx.mapErrorCode(LdapCtx.java:3000)
+	at com.sun.jndi.ldap.LdapCtx.processReturnCode(LdapCtx.java:2951)
+	at com.sun.jndi.ldap.LdapCtx.processReturnCode(LdapCtx.java:2758)
+	at com.sun.jndi.ldap.LdapCtx.c_createSubcontext(LdapCtx.java:774)
+	at com.sun.jndi.toolkit.ctx.ComponentDirContext.p_createSubcontext(ComponentDirContext.java:319)
+	at com.sun.jndi.toolkit.ctx.PartialCompositeDirContext.createSubcontext(PartialCompositeDirContext.java:248)
+	at com.sun.jndi.toolkit.ctx.PartialCompositeDirContext.createSubcontext(PartialCompositeDirContext.java:236)
+	at javax.naming.directory.InitialDirContext.createSubcontext(InitialDirContext.java:178)
+	at org.apache.tuscany.das.ldap.schema.setup.test.XSDContextsSetupTest.createEcoreContext(XSDContextsSetupTest.java:66)
+	at org.apache.tuscany.das.ldap.schema.setup.test.XSDContextsSetupTest.setUp(XSDContextsSetupTest.java:32)
+	at junit.framework.TestCase.runBare(TestCase.java:125)
+	at junit.framework.TestResult$1.protect(TestResult.java:106)
+	at junit.framework.TestResult.runProtected(TestResult.java:124)
+	at junit.framework.TestResult.run(TestResult.java:109)
+	at junit.framework.TestCase.run(TestCase.java:118)
+	at junit.framework.TestSuite.runTest(TestSuite.java:208)
+	at junit.framework.TestSuite.run(TestSuite.java:203)
+	at sun.reflect.NativeMethodAccessorImpl.invoke0(Native Method)
+	at sun.reflect.NativeMethodAccessorImpl.invoke(NativeMethodAccessorImpl.java:39)
+	at sun.reflect.DelegatingMethodAccessorImpl.invoke(DelegatingMethodAccessorImpl.java:25)
+	at java.lang.reflect.Method.invoke(Method.java:597)
+	at org.apache.maven.surefire.junit.JUnitTestSet.execute(JUnitTestSet.java:210)
+	at org.apache.maven.surefire.suite.AbstractDirectoryTestSuite.executeTestSet(AbstractDirectoryTestSuite.java:135)
+	at org.apache.maven.surefire.suite.AbstractDirectoryTestSuite.execute(AbstractDirectoryTestSuite.java:122)
+	at org.apache.maven.surefire.Surefire.run(Surefire.java:129)
+	at sun.reflect.NativeMethodAccessorImpl.invoke0(Native Method)
+	at sun.reflect.NativeMethodAccessorImpl.invoke(NativeMethodAccessorImpl.java:39)
+	at sun.reflect.DelegatingMethodAccessorImpl.invoke(DelegatingMethodAccessorImpl.java:25)
+	at java.lang.reflect.Method.invoke(Method.java:597)
+	at org.apache.maven.surefire.booter.SurefireBooter.runSuitesInProcess(SurefireBooter.java:225)
+	at org.apache.maven.surefire.booter.SurefireBooter.main(SurefireBooter.java:747)
+

Added: directory/sandbox/oersoy/das.testing/das.ldap.parent/das.ldap/target/surefire-reports/org.apache.tuscany.das.ldap.test.TestHelper.txt
URL: http://svn.apache.org/viewvc/directory/sandbox/oersoy/das.testing/das.ldap.parent/das.ldap/target/surefire-reports/org.apache.tuscany.das.ldap.test.TestHelper.txt?view=auto&rev=543239
==============================================================================
--- directory/sandbox/oersoy/das.testing/das.ldap.parent/das.ldap/target/surefire-reports/org.apache.tuscany.das.ldap.test.TestHelper.txt (added)
+++ directory/sandbox/oersoy/das.testing/das.ldap.parent/das.ldap/target/surefire-reports/org.apache.tuscany.das.ldap.test.TestHelper.txt Thu May 31 12:58:13 2007
@@ -0,0 +1,4 @@
+-------------------------------------------------------------------------------
+Test set: org.apache.tuscany.das.ldap.test.TestHelper
+-------------------------------------------------------------------------------
+Tests run: 0, Failures: 0, Errors: 0, Skipped: 0, Time elapsed: 0.102 sec

Added: directory/sandbox/oersoy/das.testing/das.ldap.parent/das.ldap/target/surefire-reports/org.apache.tuscany.das.ldap.util.test.JNDIUtilTest.txt
URL: http://svn.apache.org/viewvc/directory/sandbox/oersoy/das.testing/das.ldap.parent/das.ldap/target/surefire-reports/org.apache.tuscany.das.ldap.util.test.JNDIUtilTest.txt?view=auto&rev=543239
==============================================================================
--- directory/sandbox/oersoy/das.testing/das.ldap.parent/das.ldap/target/surefire-reports/org.apache.tuscany.das.ldap.util.test.JNDIUtilTest.txt (added)
+++ directory/sandbox/oersoy/das.testing/das.ldap.parent/das.ldap/target/surefire-reports/org.apache.tuscany.das.ldap.util.test.JNDIUtilTest.txt Thu May 31 12:58:13 2007
@@ -0,0 +1,175 @@
+-------------------------------------------------------------------------------
+Test set: org.apache.tuscany.das.ldap.util.test.JNDIUtilTest
+-------------------------------------------------------------------------------
+Tests run: 3, Failures: 0, Errors: 3, Skipped: 0, Time elapsed: 0.15 sec <<< FAILURE!
+testCalculateParentRelativeDN(org.apache.tuscany.das.ldap.util.test.JNDIUtilTest)  Time elapsed: 0.003 sec  <<< ERROR!
+org.apache.directory.shared.ldap.exception.LdapNameNotFoundException: ou=das
+	at org.apache.directory.server.core.partition.DefaultPartitionNexus.getBackend(DefaultPartitionNexus.java:987)
+	at org.apache.directory.server.core.partition.DefaultPartitionNexus.hasEntry(DefaultPartitionNexus.java:920)
+	at org.apache.directory.server.core.interceptor.InterceptorChain$1.hasEntry(InterceptorChain.java:157)
+	at org.apache.directory.server.core.interceptor.InterceptorChain$Entry$1.hasEntry(InterceptorChain.java:1326)
+	at org.apache.directory.server.core.interceptor.BaseInterceptor.hasEntry(BaseInterceptor.java:134)
+	at org.apache.directory.server.core.interceptor.InterceptorChain$Entry$1.hasEntry(InterceptorChain.java:1326)
+	at org.apache.directory.server.core.exception.ExceptionService.assertHasEntry(ExceptionService.java:405)
+	at org.apache.directory.server.core.exception.ExceptionService.lookup(ExceptionService.java:182)
+	at org.apache.directory.server.core.interceptor.InterceptorChain.lookup(InterceptorChain.java:849)
+	at org.apache.directory.server.core.partition.PartitionNexusProxy.lookup(PartitionNexusProxy.java:501)
+	at org.apache.directory.server.core.authz.AuthorizationService.hasEntry(AuthorizationService.java:599)
+	at org.apache.directory.server.core.interceptor.InterceptorChain$Entry$1.hasEntry(InterceptorChain.java:1326)
+	at org.apache.directory.server.core.interceptor.BaseInterceptor.hasEntry(BaseInterceptor.java:134)
+	at org.apache.directory.server.core.interceptor.InterceptorChain$Entry$1.hasEntry(InterceptorChain.java:1326)
+	at org.apache.directory.server.core.authn.AuthenticationService.hasEntry(AuthenticationService.java:258)
+	at org.apache.directory.server.core.interceptor.InterceptorChain$Entry$1.hasEntry(InterceptorChain.java:1326)
+	at org.apache.directory.server.core.normalization.NormalizationService.hasEntry(NormalizationService.java:333)
+	at org.apache.directory.server.core.interceptor.InterceptorChain.hasEntry(InterceptorChain.java:891)
+	at org.apache.directory.server.core.partition.PartitionNexusProxy.hasEntry(PartitionNexusProxy.java:547)
+	at org.apache.directory.server.core.partition.PartitionNexusProxy.hasEntry(PartitionNexusProxy.java:535)
+	at org.apache.directory.server.core.jndi.ServerContext.<init>(ServerContext.java:129)
+	at org.apache.directory.server.core.jndi.ServerDirContext.<init>(ServerDirContext.java:82)
+	at org.apache.directory.server.core.jndi.ServerLdapContext.<init>(ServerLdapContext.java:63)
+	at org.apache.directory.server.core.DefaultDirectoryService.getJndiContext(DefaultDirectoryService.java:170)
+	at org.apache.directory.server.core.jndi.AbstractContextFactory.getInitialContext(AbstractContextFactory.java:137)
+	at javax.naming.spi.NamingManager.getInitialContext(NamingManager.java:667)
+	at javax.naming.InitialContext.getDefaultInitCtx(InitialContext.java:288)
+	at javax.naming.InitialContext.init(InitialContext.java:223)
+	at javax.naming.InitialContext.<init>(InitialContext.java:197)
+	at javax.naming.directory.InitialDirContext.<init>(InitialDirContext.java:82)
+	at org.apache.tuscany.das.ldap.configuration.model.v100.impl.ConnectionManagerImpl.createDASPartition(ConnectionManagerImpl.java:629)
+	at org.apache.tuscany.das.ldap.test.TestSetup.setUp(TestSetup.java:27)
+	at org.apache.tuscany.das.ldap.util.test.JNDIUtilTest.setUp(JNDIUtilTest.java:22)
+	at junit.framework.TestCase.runBare(TestCase.java:125)
+	at junit.framework.TestResult$1.protect(TestResult.java:106)
+	at junit.framework.TestResult.runProtected(TestResult.java:124)
+	at junit.framework.TestResult.run(TestResult.java:109)
+	at junit.framework.TestCase.run(TestCase.java:118)
+	at junit.framework.TestSuite.runTest(TestSuite.java:208)
+	at junit.framework.TestSuite.run(TestSuite.java:203)
+	at sun.reflect.NativeMethodAccessorImpl.invoke0(Native Method)
+	at sun.reflect.NativeMethodAccessorImpl.invoke(NativeMethodAccessorImpl.java:39)
+	at sun.reflect.DelegatingMethodAccessorImpl.invoke(DelegatingMethodAccessorImpl.java:25)
+	at java.lang.reflect.Method.invoke(Method.java:597)
+	at org.apache.maven.surefire.junit.JUnitTestSet.execute(JUnitTestSet.java:210)
+	at org.apache.maven.surefire.suite.AbstractDirectoryTestSuite.executeTestSet(AbstractDirectoryTestSuite.java:135)
+	at org.apache.maven.surefire.suite.AbstractDirectoryTestSuite.execute(AbstractDirectoryTestSuite.java:122)
+	at org.apache.maven.surefire.Surefire.run(Surefire.java:129)
+	at sun.reflect.NativeMethodAccessorImpl.invoke0(Native Method)
+	at sun.reflect.NativeMethodAccessorImpl.invoke(NativeMethodAccessorImpl.java:39)
+	at sun.reflect.DelegatingMethodAccessorImpl.invoke(DelegatingMethodAccessorImpl.java:25)
+	at java.lang.reflect.Method.invoke(Method.java:597)
+	at org.apache.maven.surefire.booter.SurefireBooter.runSuitesInProcess(SurefireBooter.java:225)
+	at org.apache.maven.surefire.booter.SurefireBooter.main(SurefireBooter.java:747)
+
+testCalculateDNComponents(org.apache.tuscany.das.ldap.util.test.JNDIUtilTest)  Time elapsed: 0.123 sec  <<< ERROR!
+org.apache.directory.shared.ldap.exception.LdapNameNotFoundException: ou=das
+	at org.apache.directory.server.core.partition.DefaultPartitionNexus.getBackend(DefaultPartitionNexus.java:987)
+	at org.apache.directory.server.core.partition.DefaultPartitionNexus.hasEntry(DefaultPartitionNexus.java:920)
+	at org.apache.directory.server.core.interceptor.InterceptorChain$1.hasEntry(InterceptorChain.java:157)
+	at org.apache.directory.server.core.interceptor.InterceptorChain$Entry$1.hasEntry(InterceptorChain.java:1326)
+	at org.apache.directory.server.core.interceptor.BaseInterceptor.hasEntry(BaseInterceptor.java:134)
+	at org.apache.directory.server.core.interceptor.InterceptorChain$Entry$1.hasEntry(InterceptorChain.java:1326)
+	at org.apache.directory.server.core.exception.ExceptionService.assertHasEntry(ExceptionService.java:405)
+	at org.apache.directory.server.core.exception.ExceptionService.lookup(ExceptionService.java:182)
+	at org.apache.directory.server.core.interceptor.InterceptorChain.lookup(InterceptorChain.java:849)
+	at org.apache.directory.server.core.partition.PartitionNexusProxy.lookup(PartitionNexusProxy.java:501)
+	at org.apache.directory.server.core.authz.AuthorizationService.hasEntry(AuthorizationService.java:599)
+	at org.apache.directory.server.core.interceptor.InterceptorChain$Entry$1.hasEntry(InterceptorChain.java:1326)
+	at org.apache.directory.server.core.interceptor.BaseInterceptor.hasEntry(BaseInterceptor.java:134)
+	at org.apache.directory.server.core.interceptor.InterceptorChain$Entry$1.hasEntry(InterceptorChain.java:1326)
+	at org.apache.directory.server.core.authn.AuthenticationService.hasEntry(AuthenticationService.java:258)
+	at org.apache.directory.server.core.interceptor.InterceptorChain$Entry$1.hasEntry(InterceptorChain.java:1326)
+	at org.apache.directory.server.core.normalization.NormalizationService.hasEntry(NormalizationService.java:333)
+	at org.apache.directory.server.core.interceptor.InterceptorChain.hasEntry(InterceptorChain.java:891)
+	at org.apache.directory.server.core.partition.PartitionNexusProxy.hasEntry(PartitionNexusProxy.java:547)
+	at org.apache.directory.server.core.partition.PartitionNexusProxy.hasEntry(PartitionNexusProxy.java:535)
+	at org.apache.directory.server.core.jndi.ServerContext.<init>(ServerContext.java:129)
+	at org.apache.directory.server.core.jndi.ServerDirContext.<init>(ServerDirContext.java:82)
+	at org.apache.directory.server.core.jndi.ServerLdapContext.<init>(ServerLdapContext.java:63)
+	at org.apache.directory.server.core.DefaultDirectoryService.getJndiContext(DefaultDirectoryService.java:170)
+	at org.apache.directory.server.core.jndi.AbstractContextFactory.getInitialContext(AbstractContextFactory.java:137)
+	at javax.naming.spi.NamingManager.getInitialContext(NamingManager.java:667)
+	at javax.naming.InitialContext.getDefaultInitCtx(InitialContext.java:288)
+	at javax.naming.InitialContext.init(InitialContext.java:223)
+	at javax.naming.InitialContext.<init>(InitialContext.java:197)
+	at javax.naming.directory.InitialDirContext.<init>(InitialDirContext.java:82)
+	at org.apache.tuscany.das.ldap.configuration.model.v100.impl.ConnectionManagerImpl.createDASPartition(ConnectionManagerImpl.java:629)
+	at org.apache.tuscany.das.ldap.test.TestSetup.setUp(TestSetup.java:27)
+	at org.apache.tuscany.das.ldap.util.test.JNDIUtilTest.setUp(JNDIUtilTest.java:22)
+	at junit.framework.TestCase.runBare(TestCase.java:125)
+	at junit.framework.TestResult$1.protect(TestResult.java:106)
+	at junit.framework.TestResult.runProtected(TestResult.java:124)
+	at junit.framework.TestResult.run(TestResult.java:109)
+	at junit.framework.TestCase.run(TestCase.java:118)
+	at junit.framework.TestSuite.runTest(TestSuite.java:208)
+	at junit.framework.TestSuite.run(TestSuite.java:203)
+	at sun.reflect.NativeMethodAccessorImpl.invoke0(Native Method)
+	at sun.reflect.NativeMethodAccessorImpl.invoke(NativeMethodAccessorImpl.java:39)
+	at sun.reflect.DelegatingMethodAccessorImpl.invoke(DelegatingMethodAccessorImpl.java:25)
+	at java.lang.reflect.Method.invoke(Method.java:597)
+	at org.apache.maven.surefire.junit.JUnitTestSet.execute(JUnitTestSet.java:210)
+	at org.apache.maven.surefire.suite.AbstractDirectoryTestSuite.executeTestSet(AbstractDirectoryTestSuite.java:135)
+	at org.apache.maven.surefire.suite.AbstractDirectoryTestSuite.execute(AbstractDirectoryTestSuite.java:122)
+	at org.apache.maven.surefire.Surefire.run(Surefire.java:129)
+	at sun.reflect.NativeMethodAccessorImpl.invoke0(Native Method)
+	at sun.reflect.NativeMethodAccessorImpl.invoke(NativeMethodAccessorImpl.java:39)
+	at sun.reflect.DelegatingMethodAccessorImpl.invoke(DelegatingMethodAccessorImpl.java:25)
+	at java.lang.reflect.Method.invoke(Method.java:597)
+	at org.apache.maven.surefire.booter.SurefireBooter.runSuitesInProcess(SurefireBooter.java:225)
+	at org.apache.maven.surefire.booter.SurefireBooter.main(SurefireBooter.java:747)
+
+testGetParentContext(org.apache.tuscany.das.ldap.util.test.JNDIUtilTest)  Time elapsed: 0.003 sec  <<< ERROR!
+org.apache.directory.shared.ldap.exception.LdapNameNotFoundException: ou=das
+	at org.apache.directory.server.core.partition.DefaultPartitionNexus.getBackend(DefaultPartitionNexus.java:987)
+	at org.apache.directory.server.core.partition.DefaultPartitionNexus.hasEntry(DefaultPartitionNexus.java:920)
+	at org.apache.directory.server.core.interceptor.InterceptorChain$1.hasEntry(InterceptorChain.java:157)
+	at org.apache.directory.server.core.interceptor.InterceptorChain$Entry$1.hasEntry(InterceptorChain.java:1326)
+	at org.apache.directory.server.core.interceptor.BaseInterceptor.hasEntry(BaseInterceptor.java:134)
+	at org.apache.directory.server.core.interceptor.InterceptorChain$Entry$1.hasEntry(InterceptorChain.java:1326)
+	at org.apache.directory.server.core.exception.ExceptionService.assertHasEntry(ExceptionService.java:405)
+	at org.apache.directory.server.core.exception.ExceptionService.lookup(ExceptionService.java:182)
+	at org.apache.directory.server.core.interceptor.InterceptorChain.lookup(InterceptorChain.java:849)
+	at org.apache.directory.server.core.partition.PartitionNexusProxy.lookup(PartitionNexusProxy.java:501)
+	at org.apache.directory.server.core.authz.AuthorizationService.hasEntry(AuthorizationService.java:599)
+	at org.apache.directory.server.core.interceptor.InterceptorChain$Entry$1.hasEntry(InterceptorChain.java:1326)
+	at org.apache.directory.server.core.interceptor.BaseInterceptor.hasEntry(BaseInterceptor.java:134)
+	at org.apache.directory.server.core.interceptor.InterceptorChain$Entry$1.hasEntry(InterceptorChain.java:1326)
+	at org.apache.directory.server.core.authn.AuthenticationService.hasEntry(AuthenticationService.java:258)
+	at org.apache.directory.server.core.interceptor.InterceptorChain$Entry$1.hasEntry(InterceptorChain.java:1326)
+	at org.apache.directory.server.core.normalization.NormalizationService.hasEntry(NormalizationService.java:333)
+	at org.apache.directory.server.core.interceptor.InterceptorChain.hasEntry(InterceptorChain.java:891)
+	at org.apache.directory.server.core.partition.PartitionNexusProxy.hasEntry(PartitionNexusProxy.java:547)
+	at org.apache.directory.server.core.partition.PartitionNexusProxy.hasEntry(PartitionNexusProxy.java:535)
+	at org.apache.directory.server.core.jndi.ServerContext.<init>(ServerContext.java:129)
+	at org.apache.directory.server.core.jndi.ServerDirContext.<init>(ServerDirContext.java:82)
+	at org.apache.directory.server.core.jndi.ServerLdapContext.<init>(ServerLdapContext.java:63)
+	at org.apache.directory.server.core.DefaultDirectoryService.getJndiContext(DefaultDirectoryService.java:170)
+	at org.apache.directory.server.core.jndi.AbstractContextFactory.getInitialContext(AbstractContextFactory.java:137)
+	at javax.naming.spi.NamingManager.getInitialContext(NamingManager.java:667)
+	at javax.naming.InitialContext.getDefaultInitCtx(InitialContext.java:288)
+	at javax.naming.InitialContext.init(InitialContext.java:223)
+	at javax.naming.InitialContext.<init>(InitialContext.java:197)
+	at javax.naming.directory.InitialDirContext.<init>(InitialDirContext.java:82)
+	at org.apache.tuscany.das.ldap.configuration.model.v100.impl.ConnectionManagerImpl.createDASPartition(ConnectionManagerImpl.java:629)
+	at org.apache.tuscany.das.ldap.test.TestSetup.setUp(TestSetup.java:27)
+	at org.apache.tuscany.das.ldap.util.test.JNDIUtilTest.setUp(JNDIUtilTest.java:22)
+	at junit.framework.TestCase.runBare(TestCase.java:125)
+	at junit.framework.TestResult$1.protect(TestResult.java:106)
+	at junit.framework.TestResult.runProtected(TestResult.java:124)
+	at junit.framework.TestResult.run(TestResult.java:109)
+	at junit.framework.TestCase.run(TestCase.java:118)
+	at junit.framework.TestSuite.runTest(TestSuite.java:208)
+	at junit.framework.TestSuite.run(TestSuite.java:203)
+	at sun.reflect.NativeMethodAccessorImpl.invoke0(Native Method)
+	at sun.reflect.NativeMethodAccessorImpl.invoke(NativeMethodAccessorImpl.java:39)
+	at sun.reflect.DelegatingMethodAccessorImpl.invoke(DelegatingMethodAccessorImpl.java:25)
+	at java.lang.reflect.Method.invoke(Method.java:597)
+	at org.apache.maven.surefire.junit.JUnitTestSet.execute(JUnitTestSet.java:210)
+	at org.apache.maven.surefire.suite.AbstractDirectoryTestSuite.executeTestSet(AbstractDirectoryTestSuite.java:135)
+	at org.apache.maven.surefire.suite.AbstractDirectoryTestSuite.execute(AbstractDirectoryTestSuite.java:122)
+	at org.apache.maven.surefire.Surefire.run(Surefire.java:129)
+	at sun.reflect.NativeMethodAccessorImpl.invoke0(Native Method)
+	at sun.reflect.NativeMethodAccessorImpl.invoke(NativeMethodAccessorImpl.java:39)
+	at sun.reflect.DelegatingMethodAccessorImpl.invoke(DelegatingMethodAccessorImpl.java:25)
+	at java.lang.reflect.Method.invoke(Method.java:597)
+	at org.apache.maven.surefire.booter.SurefireBooter.runSuitesInProcess(SurefireBooter.java:225)
+	at org.apache.maven.surefire.booter.SurefireBooter.main(SurefireBooter.java:747)
+

Added: directory/sandbox/oersoy/das.testing/das.ldap.parent/das.ldap/target/surefire-reports/org.apache.tuscany.das.ldap.util.test.XSDNamespaceURITokenizerTest.txt
URL: http://svn.apache.org/viewvc/directory/sandbox/oersoy/das.testing/das.ldap.parent/das.ldap/target/surefire-reports/org.apache.tuscany.das.ldap.util.test.XSDNamespaceURITokenizerTest.txt?view=auto&rev=543239
==============================================================================
--- directory/sandbox/oersoy/das.testing/das.ldap.parent/das.ldap/target/surefire-reports/org.apache.tuscany.das.ldap.util.test.XSDNamespaceURITokenizerTest.txt (added)
+++ directory/sandbox/oersoy/das.testing/das.ldap.parent/das.ldap/target/surefire-reports/org.apache.tuscany.das.ldap.util.test.XSDNamespaceURITokenizerTest.txt Thu May 31 12:58:13 2007
@@ -0,0 +1,114 @@
+-------------------------------------------------------------------------------
+Test set: org.apache.tuscany.das.ldap.util.test.XSDNamespaceURITokenizerTest
+-------------------------------------------------------------------------------
+Tests run: 2, Failures: 0, Errors: 2, Skipped: 0, Time elapsed: 0.116 sec <<< FAILURE!
+testCreateAuthorityTokens(org.apache.tuscany.das.ldap.util.test.XSDNamespaceURITokenizerTest)  Time elapsed: 0.002 sec  <<< ERROR!
+org.apache.directory.shared.ldap.exception.LdapNameNotFoundException: ou=das
+	at org.apache.directory.server.core.partition.DefaultPartitionNexus.getBackend(DefaultPartitionNexus.java:987)
+	at org.apache.directory.server.core.partition.DefaultPartitionNexus.hasEntry(DefaultPartitionNexus.java:920)
+	at org.apache.directory.server.core.interceptor.InterceptorChain$1.hasEntry(InterceptorChain.java:157)
+	at org.apache.directory.server.core.interceptor.InterceptorChain$Entry$1.hasEntry(InterceptorChain.java:1326)
+	at org.apache.directory.server.core.interceptor.BaseInterceptor.hasEntry(BaseInterceptor.java:134)
+	at org.apache.directory.server.core.interceptor.InterceptorChain$Entry$1.hasEntry(InterceptorChain.java:1326)
+	at org.apache.directory.server.core.exception.ExceptionService.assertHasEntry(ExceptionService.java:405)
+	at org.apache.directory.server.core.exception.ExceptionService.lookup(ExceptionService.java:182)
+	at org.apache.directory.server.core.interceptor.InterceptorChain.lookup(InterceptorChain.java:849)
+	at org.apache.directory.server.core.partition.PartitionNexusProxy.lookup(PartitionNexusProxy.java:501)
+	at org.apache.directory.server.core.authz.AuthorizationService.hasEntry(AuthorizationService.java:599)
+	at org.apache.directory.server.core.interceptor.InterceptorChain$Entry$1.hasEntry(InterceptorChain.java:1326)
+	at org.apache.directory.server.core.interceptor.BaseInterceptor.hasEntry(BaseInterceptor.java:134)
+	at org.apache.directory.server.core.interceptor.InterceptorChain$Entry$1.hasEntry(InterceptorChain.java:1326)
+	at org.apache.directory.server.core.authn.AuthenticationService.hasEntry(AuthenticationService.java:258)
+	at org.apache.directory.server.core.interceptor.InterceptorChain$Entry$1.hasEntry(InterceptorChain.java:1326)
+	at org.apache.directory.server.core.normalization.NormalizationService.hasEntry(NormalizationService.java:333)
+	at org.apache.directory.server.core.interceptor.InterceptorChain.hasEntry(InterceptorChain.java:891)
+	at org.apache.directory.server.core.partition.PartitionNexusProxy.hasEntry(PartitionNexusProxy.java:547)
+	at org.apache.directory.server.core.partition.PartitionNexusProxy.hasEntry(PartitionNexusProxy.java:535)
+	at org.apache.directory.server.core.jndi.ServerContext.<init>(ServerContext.java:129)
+	at org.apache.directory.server.core.jndi.ServerDirContext.<init>(ServerDirContext.java:82)
+	at org.apache.directory.server.core.jndi.ServerLdapContext.<init>(ServerLdapContext.java:63)
+	at org.apache.directory.server.core.DefaultDirectoryService.getJndiContext(DefaultDirectoryService.java:170)
+	at org.apache.directory.server.core.jndi.AbstractContextFactory.getInitialContext(AbstractContextFactory.java:137)
+	at javax.naming.spi.NamingManager.getInitialContext(NamingManager.java:667)
+	at javax.naming.InitialContext.getDefaultInitCtx(InitialContext.java:288)
+	at javax.naming.InitialContext.init(InitialContext.java:223)
+	at javax.naming.InitialContext.<init>(InitialContext.java:197)
+	at javax.naming.directory.InitialDirContext.<init>(InitialDirContext.java:82)
+	at org.apache.tuscany.das.ldap.configuration.model.v100.impl.ConnectionManagerImpl.createDASPartition(ConnectionManagerImpl.java:629)
+	at org.apache.tuscany.das.ldap.test.TestSetup.setUp(TestSetup.java:27)
+	at junit.framework.TestCase.runBare(TestCase.java:125)
+	at junit.framework.TestResult$1.protect(TestResult.java:106)
+	at junit.framework.TestResult.runProtected(TestResult.java:124)
+	at junit.framework.TestResult.run(TestResult.java:109)
+	at junit.framework.TestCase.run(TestCase.java:118)
+	at junit.framework.TestSuite.runTest(TestSuite.java:208)
+	at junit.framework.TestSuite.run(TestSuite.java:203)
+	at sun.reflect.GeneratedMethodAccessor8.invoke(Unknown Source)
+	at sun.reflect.DelegatingMethodAccessorImpl.invoke(DelegatingMethodAccessorImpl.java:25)
+	at java.lang.reflect.Method.invoke(Method.java:597)
+	at org.apache.maven.surefire.junit.JUnitTestSet.execute(JUnitTestSet.java:210)
+	at org.apache.maven.surefire.suite.AbstractDirectoryTestSuite.executeTestSet(AbstractDirectoryTestSuite.java:135)
+	at org.apache.maven.surefire.suite.AbstractDirectoryTestSuite.execute(AbstractDirectoryTestSuite.java:122)
+	at org.apache.maven.surefire.Surefire.run(Surefire.java:129)
+	at sun.reflect.NativeMethodAccessorImpl.invoke0(Native Method)
+	at sun.reflect.NativeMethodAccessorImpl.invoke(NativeMethodAccessorImpl.java:39)
+	at sun.reflect.DelegatingMethodAccessorImpl.invoke(DelegatingMethodAccessorImpl.java:25)
+	at java.lang.reflect.Method.invoke(Method.java:597)
+	at org.apache.maven.surefire.booter.SurefireBooter.runSuitesInProcess(SurefireBooter.java:225)
+	at org.apache.maven.surefire.booter.SurefireBooter.main(SurefireBooter.java:747)
+
+testCreatePathTokens(org.apache.tuscany.das.ldap.util.test.XSDNamespaceURITokenizerTest)  Time elapsed: 0.002 sec  <<< ERROR!
+org.apache.directory.shared.ldap.exception.LdapNameNotFoundException: ou=das
+	at org.apache.directory.server.core.partition.DefaultPartitionNexus.getBackend(DefaultPartitionNexus.java:987)
+	at org.apache.directory.server.core.partition.DefaultPartitionNexus.hasEntry(DefaultPartitionNexus.java:920)
+	at org.apache.directory.server.core.interceptor.InterceptorChain$1.hasEntry(InterceptorChain.java:157)
+	at org.apache.directory.server.core.interceptor.InterceptorChain$Entry$1.hasEntry(InterceptorChain.java:1326)
+	at org.apache.directory.server.core.interceptor.BaseInterceptor.hasEntry(BaseInterceptor.java:134)
+	at org.apache.directory.server.core.interceptor.InterceptorChain$Entry$1.hasEntry(InterceptorChain.java:1326)
+	at org.apache.directory.server.core.exception.ExceptionService.assertHasEntry(ExceptionService.java:405)
+	at org.apache.directory.server.core.exception.ExceptionService.lookup(ExceptionService.java:182)
+	at org.apache.directory.server.core.interceptor.InterceptorChain.lookup(InterceptorChain.java:849)
+	at org.apache.directory.server.core.partition.PartitionNexusProxy.lookup(PartitionNexusProxy.java:501)
+	at org.apache.directory.server.core.authz.AuthorizationService.hasEntry(AuthorizationService.java:599)
+	at org.apache.directory.server.core.interceptor.InterceptorChain$Entry$1.hasEntry(InterceptorChain.java:1326)
+	at org.apache.directory.server.core.interceptor.BaseInterceptor.hasEntry(BaseInterceptor.java:134)
+	at org.apache.directory.server.core.interceptor.InterceptorChain$Entry$1.hasEntry(InterceptorChain.java:1326)
+	at org.apache.directory.server.core.authn.AuthenticationService.hasEntry(AuthenticationService.java:258)
+	at org.apache.directory.server.core.interceptor.InterceptorChain$Entry$1.hasEntry(InterceptorChain.java:1326)
+	at org.apache.directory.server.core.normalization.NormalizationService.hasEntry(NormalizationService.java:333)
+	at org.apache.directory.server.core.interceptor.InterceptorChain.hasEntry(InterceptorChain.java:891)
+	at org.apache.directory.server.core.partition.PartitionNexusProxy.hasEntry(PartitionNexusProxy.java:547)
+	at org.apache.directory.server.core.partition.PartitionNexusProxy.hasEntry(PartitionNexusProxy.java:535)
+	at org.apache.directory.server.core.jndi.ServerContext.<init>(ServerContext.java:129)
+	at org.apache.directory.server.core.jndi.ServerDirContext.<init>(ServerDirContext.java:82)
+	at org.apache.directory.server.core.jndi.ServerLdapContext.<init>(ServerLdapContext.java:63)
+	at org.apache.directory.server.core.DefaultDirectoryService.getJndiContext(DefaultDirectoryService.java:170)
+	at org.apache.directory.server.core.jndi.AbstractContextFactory.getInitialContext(AbstractContextFactory.java:137)
+	at javax.naming.spi.NamingManager.getInitialContext(NamingManager.java:667)
+	at javax.naming.InitialContext.getDefaultInitCtx(InitialContext.java:288)
+	at javax.naming.InitialContext.init(InitialContext.java:223)
+	at javax.naming.InitialContext.<init>(InitialContext.java:197)
+	at javax.naming.directory.InitialDirContext.<init>(InitialDirContext.java:82)
+	at org.apache.tuscany.das.ldap.configuration.model.v100.impl.ConnectionManagerImpl.createDASPartition(ConnectionManagerImpl.java:629)
+	at org.apache.tuscany.das.ldap.test.TestSetup.setUp(TestSetup.java:27)
+	at junit.framework.TestCase.runBare(TestCase.java:125)
+	at junit.framework.TestResult$1.protect(TestResult.java:106)
+	at junit.framework.TestResult.runProtected(TestResult.java:124)
+	at junit.framework.TestResult.run(TestResult.java:109)
+	at junit.framework.TestCase.run(TestCase.java:118)
+	at junit.framework.TestSuite.runTest(TestSuite.java:208)
+	at junit.framework.TestSuite.run(TestSuite.java:203)
+	at sun.reflect.GeneratedMethodAccessor8.invoke(Unknown Source)
+	at sun.reflect.DelegatingMethodAccessorImpl.invoke(DelegatingMethodAccessorImpl.java:25)
+	at java.lang.reflect.Method.invoke(Method.java:597)
+	at org.apache.maven.surefire.junit.JUnitTestSet.execute(JUnitTestSet.java:210)
+	at org.apache.maven.surefire.suite.AbstractDirectoryTestSuite.executeTestSet(AbstractDirectoryTestSuite.java:135)
+	at org.apache.maven.surefire.suite.AbstractDirectoryTestSuite.execute(AbstractDirectoryTestSuite.java:122)
+	at org.apache.maven.surefire.Surefire.run(Surefire.java:129)
+	at sun.reflect.NativeMethodAccessorImpl.invoke0(Native Method)
+	at sun.reflect.NativeMethodAccessorImpl.invoke(NativeMethodAccessorImpl.java:39)
+	at sun.reflect.DelegatingMethodAccessorImpl.invoke(DelegatingMethodAccessorImpl.java:25)
+	at java.lang.reflect.Method.invoke(Method.java:597)
+	at org.apache.maven.surefire.booter.SurefireBooter.runSuitesInProcess(SurefireBooter.java:225)
+	at org.apache.maven.surefire.booter.SurefireBooter.main(SurefireBooter.java:747)
+

Added: directory/sandbox/oersoy/das.testing/das.ldap.parent/das.ldap/target/test-classes/org/apache/tuscany/das/ldap/create/test/CreateSyntaxEntrySelfContainedTest.class
URL: http://svn.apache.org/viewvc/directory/sandbox/oersoy/das.testing/das.ldap.parent/das.ldap/target/test-classes/org/apache/tuscany/das/ldap/create/test/CreateSyntaxEntrySelfContainedTest.class?view=auto&rev=543239
==============================================================================
Binary file - no diff available.

Propchange: directory/sandbox/oersoy/das.testing/das.ldap.parent/das.ldap/target/test-classes/org/apache/tuscany/das/ldap/create/test/CreateSyntaxEntrySelfContainedTest.class
------------------------------------------------------------------------------
    svn:mime-type = application/octet-stream

Added: directory/sandbox/oersoy/das.testing/das.ldap.parent/das.ldap/target/test-classes/org/apache/tuscany/das/ldap/create/test/InitialContextCreatorHelperTest.class
URL: http://svn.apache.org/viewvc/directory/sandbox/oersoy/das.testing/das.ldap.parent/das.ldap/target/test-classes/org/apache/tuscany/das/ldap/create/test/InitialContextCreatorHelperTest.class?view=auto&rev=543239
==============================================================================
Binary file - no diff available.

Propchange: directory/sandbox/oersoy/das.testing/das.ldap.parent/das.ldap/target/test-classes/org/apache/tuscany/das/ldap/create/test/InitialContextCreatorHelperTest.class
------------------------------------------------------------------------------
    svn:mime-type = application/octet-stream

Added: directory/sandbox/oersoy/das.testing/das.ldap.parent/das.ldap/target/test-classes/org/apache/tuscany/das/ldap/create/test/InitialContextCreatorTest.class
URL: http://svn.apache.org/viewvc/directory/sandbox/oersoy/das.testing/das.ldap.parent/das.ldap/target/test-classes/org/apache/tuscany/das/ldap/create/test/InitialContextCreatorTest.class?view=auto&rev=543239
==============================================================================
Binary file - no diff available.

Propchange: directory/sandbox/oersoy/das.testing/das.ldap.parent/das.ldap/target/test-classes/org/apache/tuscany/das/ldap/create/test/InitialContextCreatorTest.class
------------------------------------------------------------------------------
    svn:mime-type = application/octet-stream

Added: directory/sandbox/oersoy/das.testing/das.ldap.parent/das.ldap/target/test-classes/org/apache/tuscany/das/ldap/create/test/SyntaxEntryCreatorTest.class
URL: http://svn.apache.org/viewvc/directory/sandbox/oersoy/das.testing/das.ldap.parent/das.ldap/target/test-classes/org/apache/tuscany/das/ldap/create/test/SyntaxEntryCreatorTest.class?view=auto&rev=543239
==============================================================================
Binary file - no diff available.

Propchange: directory/sandbox/oersoy/das.testing/das.ldap.parent/das.ldap/target/test-classes/org/apache/tuscany/das/ldap/create/test/SyntaxEntryCreatorTest.class
------------------------------------------------------------------------------
    svn:mime-type = application/octet-stream

Added: directory/sandbox/oersoy/das.testing/das.ldap.parent/das.ldap/target/test-classes/org/apache/tuscany/das/ldap/create/test/UniqueOIDCreatorHelperTest.class
URL: http://svn.apache.org/viewvc/directory/sandbox/oersoy/das.testing/das.ldap.parent/das.ldap/target/test-classes/org/apache/tuscany/das/ldap/create/test/UniqueOIDCreatorHelperTest.class?view=auto&rev=543239
==============================================================================
Binary file - no diff available.

Propchange: directory/sandbox/oersoy/das.testing/das.ldap.parent/das.ldap/target/test-classes/org/apache/tuscany/das/ldap/create/test/UniqueOIDCreatorHelperTest.class
------------------------------------------------------------------------------
    svn:mime-type = application/octet-stream

Added: directory/sandbox/oersoy/das.testing/das.ldap.parent/das.ldap/target/test-classes/org/apache/tuscany/das/ldap/destroy/test/InitialContextDestroyerTest.class
URL: http://svn.apache.org/viewvc/directory/sandbox/oersoy/das.testing/das.ldap.parent/das.ldap/target/test-classes/org/apache/tuscany/das/ldap/destroy/test/InitialContextDestroyerTest.class?view=auto&rev=543239
==============================================================================
Binary file - no diff available.

Propchange: directory/sandbox/oersoy/das.testing/das.ldap.parent/das.ldap/target/test-classes/org/apache/tuscany/das/ldap/destroy/test/InitialContextDestroyerTest.class
------------------------------------------------------------------------------
    svn:mime-type = application/octet-stream

Added: directory/sandbox/oersoy/das.testing/das.ldap.parent/das.ldap/target/test-classes/org/apache/tuscany/das/ldap/learning/test/DualHotPartitionTest.class
URL: http://svn.apache.org/viewvc/directory/sandbox/oersoy/das.testing/das.ldap.parent/das.ldap/target/test-classes/org/apache/tuscany/das/ldap/learning/test/DualHotPartitionTest.class?view=auto&rev=543239
==============================================================================
Binary file - no diff available.

Propchange: directory/sandbox/oersoy/das.testing/das.ldap.parent/das.ldap/target/test-classes/org/apache/tuscany/das/ldap/learning/test/DualHotPartitionTest.class
------------------------------------------------------------------------------
    svn:mime-type = application/octet-stream

Added: directory/sandbox/oersoy/das.testing/das.ldap.parent/das.ldap/target/test-classes/org/apache/tuscany/das/ldap/learning/test/HotPartitionTest.class
URL: http://svn.apache.org/viewvc/directory/sandbox/oersoy/das.testing/das.ldap.parent/das.ldap/target/test-classes/org/apache/tuscany/das/ldap/learning/test/HotPartitionTest.class?view=auto&rev=543239
==============================================================================
Binary file - no diff available.

Propchange: directory/sandbox/oersoy/das.testing/das.ldap.parent/das.ldap/target/test-classes/org/apache/tuscany/das/ldap/learning/test/HotPartitionTest.class
------------------------------------------------------------------------------
    svn:mime-type = application/octet-stream

Added: directory/sandbox/oersoy/das.testing/das.ldap.parent/das.ldap/target/test-classes/org/apache/tuscany/das/ldap/learning/test/LearningTest.class
URL: http://svn.apache.org/viewvc/directory/sandbox/oersoy/das.testing/das.ldap.parent/das.ldap/target/test-classes/org/apache/tuscany/das/ldap/learning/test/LearningTest.class?view=auto&rev=543239
==============================================================================
Binary file - no diff available.

Propchange: directory/sandbox/oersoy/das.testing/das.ldap.parent/das.ldap/target/test-classes/org/apache/tuscany/das/ldap/learning/test/LearningTest.class
------------------------------------------------------------------------------
    svn:mime-type = application/octet-stream

Added: directory/sandbox/oersoy/das.testing/das.ldap.parent/das.ldap/target/test-classes/org/apache/tuscany/das/ldap/modify/test/DataObjectModififierTest.class
URL: http://svn.apache.org/viewvc/directory/sandbox/oersoy/das.testing/das.ldap.parent/das.ldap/target/test-classes/org/apache/tuscany/das/ldap/modify/test/DataObjectModififierTest.class?view=auto&rev=543239
==============================================================================
Binary file - no diff available.

Propchange: directory/sandbox/oersoy/das.testing/das.ldap.parent/das.ldap/target/test-classes/org/apache/tuscany/das/ldap/modify/test/DataObjectModififierTest.class
------------------------------------------------------------------------------
    svn:mime-type = application/octet-stream

Added: directory/sandbox/oersoy/das.testing/das.ldap.parent/das.ldap/target/test-classes/org/apache/tuscany/das/ldap/schema/create/test/MComplexMayAttributeTypeCreatorTest.class
URL: http://svn.apache.org/viewvc/directory/sandbox/oersoy/das.testing/das.ldap.parent/das.ldap/target/test-classes/org/apache/tuscany/das/ldap/schema/create/test/MComplexMayAttributeTypeCreatorTest.class?view=auto&rev=543239
==============================================================================
Binary file - no diff available.

Propchange: directory/sandbox/oersoy/das.testing/das.ldap.parent/das.ldap/target/test-classes/org/apache/tuscany/das/ldap/schema/create/test/MComplexMayAttributeTypeCreatorTest.class
------------------------------------------------------------------------------
    svn:mime-type = application/octet-stream

Added: directory/sandbox/oersoy/das.testing/das.ldap.parent/das.ldap/target/test-classes/org/apache/tuscany/das/ldap/schema/create/test/MComplexMustAttributeTypeCreatorTest.class
URL: http://svn.apache.org/viewvc/directory/sandbox/oersoy/das.testing/das.ldap.parent/das.ldap/target/test-classes/org/apache/tuscany/das/ldap/schema/create/test/MComplexMustAttributeTypeCreatorTest.class?view=auto&rev=543239
==============================================================================
Binary file - no diff available.

Propchange: directory/sandbox/oersoy/das.testing/das.ldap.parent/das.ldap/target/test-classes/org/apache/tuscany/das/ldap/schema/create/test/MComplexMustAttributeTypeCreatorTest.class
------------------------------------------------------------------------------
    svn:mime-type = application/octet-stream

Added: directory/sandbox/oersoy/das.testing/das.ldap.parent/das.ldap/target/test-classes/org/apache/tuscany/das/ldap/schema/create/test/MetaTopSDOObjectClassCreatorTest.class
URL: http://svn.apache.org/viewvc/directory/sandbox/oersoy/das.testing/das.ldap.parent/das.ldap/target/test-classes/org/apache/tuscany/das/ldap/schema/create/test/MetaTopSDOObjectClassCreatorTest.class?view=auto&rev=543239
==============================================================================
Binary file - no diff available.

Propchange: directory/sandbox/oersoy/das.testing/das.ldap.parent/das.ldap/target/test-classes/org/apache/tuscany/das/ldap/schema/create/test/MetaTopSDOObjectClassCreatorTest.class
------------------------------------------------------------------------------
    svn:mime-type = application/octet-stream

Added: directory/sandbox/oersoy/das.testing/das.ldap.parent/das.ldap/target/test-classes/org/apache/tuscany/das/ldap/schema/emf/create/test/EAttributeTypeCreatorTest.class
URL: http://svn.apache.org/viewvc/directory/sandbox/oersoy/das.testing/das.ldap.parent/das.ldap/target/test-classes/org/apache/tuscany/das/ldap/schema/emf/create/test/EAttributeTypeCreatorTest.class?view=auto&rev=543239
==============================================================================
Binary file - no diff available.

Propchange: directory/sandbox/oersoy/das.testing/das.ldap.parent/das.ldap/target/test-classes/org/apache/tuscany/das/ldap/schema/emf/create/test/EAttributeTypeCreatorTest.class
------------------------------------------------------------------------------
    svn:mime-type = application/octet-stream

Added: directory/sandbox/oersoy/das.testing/das.ldap.parent/das.ldap/target/test-classes/org/apache/tuscany/das/ldap/schema/emf/create/test/EObjectClassCreatorTest.class
URL: http://svn.apache.org/viewvc/directory/sandbox/oersoy/das.testing/das.ldap.parent/das.ldap/target/test-classes/org/apache/tuscany/das/ldap/schema/emf/create/test/EObjectClassCreatorTest.class?view=auto&rev=543239
==============================================================================
Binary file - no diff available.

Propchange: directory/sandbox/oersoy/das.testing/das.ldap.parent/das.ldap/target/test-classes/org/apache/tuscany/das/ldap/schema/emf/create/test/EObjectClassCreatorTest.class
------------------------------------------------------------------------------
    svn:mime-type = application/octet-stream

Added: directory/sandbox/oersoy/das.testing/das.ldap.parent/das.ldap/target/test-classes/org/apache/tuscany/das/ldap/schema/emf/create/test/EReferenceTypeCreatorTest.class
URL: http://svn.apache.org/viewvc/directory/sandbox/oersoy/das.testing/das.ldap.parent/das.ldap/target/test-classes/org/apache/tuscany/das/ldap/schema/emf/create/test/EReferenceTypeCreatorTest.class?view=auto&rev=543239
==============================================================================
Binary file - no diff available.

Propchange: directory/sandbox/oersoy/das.testing/das.ldap.parent/das.ldap/target/test-classes/org/apache/tuscany/das/ldap/schema/emf/create/test/EReferenceTypeCreatorTest.class
------------------------------------------------------------------------------
    svn:mime-type = application/octet-stream

Added: directory/sandbox/oersoy/das.testing/das.ldap.parent/das.ldap/target/test-classes/org/apache/tuscany/das/ldap/schema/emf/create/test/EcoreTypeSystemCreatorHelperTest.class
URL: http://svn.apache.org/viewvc/directory/sandbox/oersoy/das.testing/das.ldap.parent/das.ldap/target/test-classes/org/apache/tuscany/das/ldap/schema/emf/create/test/EcoreTypeSystemCreatorHelperTest.class?view=auto&rev=543239
==============================================================================
Binary file - no diff available.

Propchange: directory/sandbox/oersoy/das.testing/das.ldap.parent/das.ldap/target/test-classes/org/apache/tuscany/das/ldap/schema/emf/create/test/EcoreTypeSystemCreatorHelperTest.class
------------------------------------------------------------------------------
    svn:mime-type = application/octet-stream

Added: directory/sandbox/oersoy/das.testing/das.ldap.parent/das.ldap/target/test-classes/org/apache/tuscany/das/ldap/schema/emf/create/test/EcoreTypeSystemCreatorTest.class
URL: http://svn.apache.org/viewvc/directory/sandbox/oersoy/das.testing/das.ldap.parent/das.ldap/target/test-classes/org/apache/tuscany/das/ldap/schema/emf/create/test/EcoreTypeSystemCreatorTest.class?view=auto&rev=543239
==============================================================================
Binary file - no diff available.

Propchange: directory/sandbox/oersoy/das.testing/das.ldap.parent/das.ldap/target/test-classes/org/apache/tuscany/das/ldap/schema/emf/create/test/EcoreTypeSystemCreatorTest.class
------------------------------------------------------------------------------
    svn:mime-type = application/octet-stream

Added: directory/sandbox/oersoy/das.testing/das.ldap.parent/das.ldap/target/test-classes/org/apache/tuscany/das/ldap/schema/emf/destroy/test/EcoreTypeSystemDestroyerTest.class
URL: http://svn.apache.org/viewvc/directory/sandbox/oersoy/das.testing/das.ldap.parent/das.ldap/target/test-classes/org/apache/tuscany/das/ldap/schema/emf/destroy/test/EcoreTypeSystemDestroyerTest.class?view=auto&rev=543239
==============================================================================
Binary file - no diff available.

Propchange: directory/sandbox/oersoy/das.testing/das.ldap.parent/das.ldap/target/test-classes/org/apache/tuscany/das/ldap/schema/emf/destroy/test/EcoreTypeSystemDestroyerTest.class
------------------------------------------------------------------------------
    svn:mime-type = application/octet-stream

Added: directory/sandbox/oersoy/das.testing/das.ldap.parent/das.ldap/target/test-classes/org/apache/tuscany/das/ldap/schema/setup/test/AbstractTestSetup.class
URL: http://svn.apache.org/viewvc/directory/sandbox/oersoy/das.testing/das.ldap.parent/das.ldap/target/test-classes/org/apache/tuscany/das/ldap/schema/setup/test/AbstractTestSetup.class?view=auto&rev=543239
==============================================================================
Binary file - no diff available.

Propchange: directory/sandbox/oersoy/das.testing/das.ldap.parent/das.ldap/target/test-classes/org/apache/tuscany/das/ldap/schema/setup/test/AbstractTestSetup.class
------------------------------------------------------------------------------
    svn:mime-type = application/octet-stream

Added: directory/sandbox/oersoy/das.testing/das.ldap.parent/das.ldap/target/test-classes/org/apache/tuscany/das/ldap/schema/setup/test/DASContextsSetup.class
URL: http://svn.apache.org/viewvc/directory/sandbox/oersoy/das.testing/das.ldap.parent/das.ldap/target/test-classes/org/apache/tuscany/das/ldap/schema/setup/test/DASContextsSetup.class?view=auto&rev=543239
==============================================================================
Binary file - no diff available.

Propchange: directory/sandbox/oersoy/das.testing/das.ldap.parent/das.ldap/target/test-classes/org/apache/tuscany/das/ldap/schema/setup/test/DASContextsSetup.class
------------------------------------------------------------------------------
    svn:mime-type = application/octet-stream

Added: directory/sandbox/oersoy/das.testing/das.ldap.parent/das.ldap/target/test-classes/org/apache/tuscany/das/ldap/schema/setup/test/DASContextsSetupTest.class
URL: http://svn.apache.org/viewvc/directory/sandbox/oersoy/das.testing/das.ldap.parent/das.ldap/target/test-classes/org/apache/tuscany/das/ldap/schema/setup/test/DASContextsSetupTest.class?view=auto&rev=543239
==============================================================================
Binary file - no diff available.

Propchange: directory/sandbox/oersoy/das.testing/das.ldap.parent/das.ldap/target/test-classes/org/apache/tuscany/das/ldap/schema/setup/test/DASContextsSetupTest.class
------------------------------------------------------------------------------
    svn:mime-type = application/octet-stream

Added: directory/sandbox/oersoy/das.testing/das.ldap.parent/das.ldap/target/test-classes/org/apache/tuscany/das/ldap/schema/setup/test/EcoreContextsSetup.class
URL: http://svn.apache.org/viewvc/directory/sandbox/oersoy/das.testing/das.ldap.parent/das.ldap/target/test-classes/org/apache/tuscany/das/ldap/schema/setup/test/EcoreContextsSetup.class?view=auto&rev=543239
==============================================================================
Binary file - no diff available.

Propchange: directory/sandbox/oersoy/das.testing/das.ldap.parent/das.ldap/target/test-classes/org/apache/tuscany/das/ldap/schema/setup/test/EcoreContextsSetup.class
------------------------------------------------------------------------------
    svn:mime-type = application/octet-stream

Added: directory/sandbox/oersoy/das.testing/das.ldap.parent/das.ldap/target/test-classes/org/apache/tuscany/das/ldap/schema/setup/test/EcoreContextsSetupTest.class
URL: http://svn.apache.org/viewvc/directory/sandbox/oersoy/das.testing/das.ldap.parent/das.ldap/target/test-classes/org/apache/tuscany/das/ldap/schema/setup/test/EcoreContextsSetupTest.class?view=auto&rev=543239
==============================================================================
Binary file - no diff available.

Propchange: directory/sandbox/oersoy/das.testing/das.ldap.parent/das.ldap/target/test-classes/org/apache/tuscany/das/ldap/schema/setup/test/EcoreContextsSetupTest.class
------------------------------------------------------------------------------
    svn:mime-type = application/octet-stream

Added: directory/sandbox/oersoy/das.testing/das.ldap.parent/das.ldap/target/test-classes/org/apache/tuscany/das/ldap/schema/setup/test/SchemaContextSetup.class
URL: http://svn.apache.org/viewvc/directory/sandbox/oersoy/das.testing/das.ldap.parent/das.ldap/target/test-classes/org/apache/tuscany/das/ldap/schema/setup/test/SchemaContextSetup.class?view=auto&rev=543239
==============================================================================
Binary file - no diff available.

Propchange: directory/sandbox/oersoy/das.testing/das.ldap.parent/das.ldap/target/test-classes/org/apache/tuscany/das/ldap/schema/setup/test/SchemaContextSetup.class
------------------------------------------------------------------------------
    svn:mime-type = application/octet-stream

Added: directory/sandbox/oersoy/das.testing/das.ldap.parent/das.ldap/target/test-classes/org/apache/tuscany/das/ldap/schema/setup/test/SchemaContextSetupTest.class
URL: http://svn.apache.org/viewvc/directory/sandbox/oersoy/das.testing/das.ldap.parent/das.ldap/target/test-classes/org/apache/tuscany/das/ldap/schema/setup/test/SchemaContextSetupTest.class?view=auto&rev=543239
==============================================================================
Binary file - no diff available.

Propchange: directory/sandbox/oersoy/das.testing/das.ldap.parent/das.ldap/target/test-classes/org/apache/tuscany/das/ldap/schema/setup/test/SchemaContextSetupTest.class
------------------------------------------------------------------------------
    svn:mime-type = application/octet-stream

Added: directory/sandbox/oersoy/das.testing/das.ldap.parent/das.ldap/target/test-classes/org/apache/tuscany/das/ldap/schema/setup/test/SchemaContextsSetup.class
URL: http://svn.apache.org/viewvc/directory/sandbox/oersoy/das.testing/das.ldap.parent/das.ldap/target/test-classes/org/apache/tuscany/das/ldap/schema/setup/test/SchemaContextsSetup.class?view=auto&rev=543239
==============================================================================
Binary file - no diff available.

Propchange: directory/sandbox/oersoy/das.testing/das.ldap.parent/das.ldap/target/test-classes/org/apache/tuscany/das/ldap/schema/setup/test/SchemaContextsSetup.class
------------------------------------------------------------------------------
    svn:mime-type = application/octet-stream

Added: directory/sandbox/oersoy/das.testing/das.ldap.parent/das.ldap/target/test-classes/org/apache/tuscany/das/ldap/schema/setup/test/SchemaContextsSetupTest.class
URL: http://svn.apache.org/viewvc/directory/sandbox/oersoy/das.testing/das.ldap.parent/das.ldap/target/test-classes/org/apache/tuscany/das/ldap/schema/setup/test/SchemaContextsSetupTest.class?view=auto&rev=543239
==============================================================================
Binary file - no diff available.

Propchange: directory/sandbox/oersoy/das.testing/das.ldap.parent/das.ldap/target/test-classes/org/apache/tuscany/das/ldap/schema/setup/test/SchemaContextsSetupTest.class
------------------------------------------------------------------------------
    svn:mime-type = application/octet-stream

Added: directory/sandbox/oersoy/das.testing/das.ldap.parent/das.ldap/target/test-classes/org/apache/tuscany/das/ldap/schema/setup/test/XSDContextsSetup.class
URL: http://svn.apache.org/viewvc/directory/sandbox/oersoy/das.testing/das.ldap.parent/das.ldap/target/test-classes/org/apache/tuscany/das/ldap/schema/setup/test/XSDContextsSetup.class?view=auto&rev=543239
==============================================================================
Binary file - no diff available.

Propchange: directory/sandbox/oersoy/das.testing/das.ldap.parent/das.ldap/target/test-classes/org/apache/tuscany/das/ldap/schema/setup/test/XSDContextsSetup.class
------------------------------------------------------------------------------
    svn:mime-type = application/octet-stream

Added: directory/sandbox/oersoy/das.testing/das.ldap.parent/das.ldap/target/test-classes/org/apache/tuscany/das/ldap/schema/setup/test/XSDContextsSetupTest.class
URL: http://svn.apache.org/viewvc/directory/sandbox/oersoy/das.testing/das.ldap.parent/das.ldap/target/test-classes/org/apache/tuscany/das/ldap/schema/setup/test/XSDContextsSetupTest.class?view=auto&rev=543239
==============================================================================
Binary file - no diff available.

Propchange: directory/sandbox/oersoy/das.testing/das.ldap.parent/das.ldap/target/test-classes/org/apache/tuscany/das/ldap/schema/setup/test/XSDContextsSetupTest.class
------------------------------------------------------------------------------
    svn:mime-type = application/octet-stream

Added: directory/sandbox/oersoy/das.testing/das.ldap.parent/das.ldap/target/test-classes/org/apache/tuscany/das/ldap/test/TestHelper.class
URL: http://svn.apache.org/viewvc/directory/sandbox/oersoy/das.testing/das.ldap.parent/das.ldap/target/test-classes/org/apache/tuscany/das/ldap/test/TestHelper.class?view=auto&rev=543239
==============================================================================
Binary file - no diff available.

Propchange: directory/sandbox/oersoy/das.testing/das.ldap.parent/das.ldap/target/test-classes/org/apache/tuscany/das/ldap/test/TestHelper.class
------------------------------------------------------------------------------
    svn:mime-type = application/octet-stream

Added: directory/sandbox/oersoy/das.testing/das.ldap.parent/das.ldap/target/test-classes/org/apache/tuscany/das/ldap/test/TestSetup.class
URL: http://svn.apache.org/viewvc/directory/sandbox/oersoy/das.testing/das.ldap.parent/das.ldap/target/test-classes/org/apache/tuscany/das/ldap/test/TestSetup.class?view=auto&rev=543239
==============================================================================
Binary file - no diff available.

Propchange: directory/sandbox/oersoy/das.testing/das.ldap.parent/das.ldap/target/test-classes/org/apache/tuscany/das/ldap/test/TestSetup.class
------------------------------------------------------------------------------
    svn:mime-type = application/octet-stream

Added: directory/sandbox/oersoy/das.testing/das.ldap.parent/das.ldap/target/test-classes/org/apache/tuscany/das/ldap/util/test/JNDIUtilTest.class
URL: http://svn.apache.org/viewvc/directory/sandbox/oersoy/das.testing/das.ldap.parent/das.ldap/target/test-classes/org/apache/tuscany/das/ldap/util/test/JNDIUtilTest.class?view=auto&rev=543239
==============================================================================
Binary file - no diff available.

Propchange: directory/sandbox/oersoy/das.testing/das.ldap.parent/das.ldap/target/test-classes/org/apache/tuscany/das/ldap/util/test/JNDIUtilTest.class
------------------------------------------------------------------------------
    svn:mime-type = application/octet-stream

Added: directory/sandbox/oersoy/das.testing/das.ldap.parent/das.ldap/target/test-classes/org/apache/tuscany/das/ldap/util/test/XSDNamespaceURITokenizerTest.class
URL: http://svn.apache.org/viewvc/directory/sandbox/oersoy/das.testing/das.ldap.parent/das.ldap/target/test-classes/org/apache/tuscany/das/ldap/util/test/XSDNamespaceURITokenizerTest.class?view=auto&rev=543239
==============================================================================
Binary file - no diff available.



Mime
View raw message